Package evaluation of Zarr on Julia 1.13.0-DEV.974 (7bbb213719*) started at 2025-08-12T19:00:49.932
################################################################################
# Set-up
#
Installing PkgEval dependencies (TestEnv)...
Set-up completed after 9.87s
################################################################################
# Installation
#
Installing Zarr...
Resolving package versions...
Updating `~/.julia/environments/v1.13/Project.toml`
[0a941bbe] + Zarr v0.9.4
Updating `~/.julia/environments/v1.13/Manifest.toml`
[fbe9abb3] + AWS v1.94.1
⌅ [1c724243] + AWSS3 v0.10.4
[dce04be8] + ArgCheck v2.5.0
[31f734f8] + ArrowTypes v2.3.0
[d1d4a3ce] + BitFlags v0.1.9
[a74b3585] + Blosc v0.7.3
[6309b1aa] + CodecInflate64 v0.1.3
[944b1d66] + CodecZlib v0.7.8
[34da2185] + Compat v4.18.0
[f0e56b4a] + ConcurrentUtilities v2.5.0
[187b0558] + ConstructionBase v1.6.0
⌅ [864edb3b] + DataStructures v0.18.22
[3c3547ce] + DiskArrays v0.4.15
[460bff9d] + ExceptionUnwrapping v0.1.11
[e2ba6199] + ExprTools v0.1.10
[8f5d6c58] + EzXML v1.2.2
[48062228] + FilePathsBase v0.9.24
[bc5e4493] + GitHub v5.10.0
[cd3eb016] + HTTP v1.10.17
[83e8ac13] + IniFile v0.5.1
[0c81fc1b] + InputBuffers v1.1.1
[c8e1da08] + IterTools v1.10.0
[692b3bcd] + JLLWrappers v1.7.1
[682c06a0] + JSON v0.21.4
[8ac3fa9e] + LRUCache v1.6.2
[e6f89c97] + LoggingExtras v1.1.0
[739be429] + MbedTLS v1.1.9
⌅ [78c3b35d] + Mocking v0.7.9
[6fe1bfb0] + OffsetArrays v1.17.0
[4d8831e6] + OpenSSL v1.5.0
[bac558e1] + OrderedCollections v1.8.1
[69de0a69] + Parsers v2.8.3
[aea7be01] + PrecompileTools v1.3.2
[21216c6a] + Preferences v1.5.0
[20febd7b] + Retry v0.4.1
[777ac1f9] + SimpleBufferStream v1.2.0
[2133526b] + SodiumSeal v0.1.1
[2da68c74] + SymDict v0.3.0
[3bb67fe8] + TranscodingStreams v0.11.3
[5c2747f8] + URIs v1.6.1
[228000da] + XMLDict v0.4.1
[0a941bbe] + Zarr v0.9.4
[49080126] + ZipArchives v2.5.1
[0b7ba130] + Blosc_jll v1.21.7+0
[94ce4f54] + Libiconv_jll v1.18.0+0
[5ced341a] + Lz4_jll v1.10.1+0
[c8ffd9c3] + MbedTLS_jll v2.28.6+2
[02c8fc9c] + XML2_jll v2.14.4+0
[a9144af2] + libsodium_jll v1.0.21+0
[0dad84c5] + ArgTools v1.1.2
[56f22d72] + Artifacts v1.11.0
[2a0f44e3] + Base64 v1.11.0
[ade2ca70] + Dates v1.11.0
[f43a241f] + Downloads v1.7.0
[7b1f6079] + FileWatching v1.11.0
[b77e0a4c] + InteractiveUtils v1.11.0
[ac6e5ff7] + JuliaSyntaxHighlighting v1.12.0
[b27032c2] + LibCURL v0.6.4
[76f85450] + LibGit2 v1.11.0
[8f399da3] + Libdl v1.11.0
[56ddb016] + Logging v1.11.0
[d6f4376e] + Markdown v1.11.0
[a63ad114] + Mmap v1.11.0
[ca575930] + NetworkOptions v1.3.0
[44cfe95a] + Pkg v1.13.0
[de0858da] + Printf v1.11.0
[9a3f8284] + Random v1.11.0
[ea8e919c] + SHA v0.7.0
[9e88b42a] + Serialization v1.11.0
[6462fe0b] + Sockets v1.11.0
[f489334b] + StyledStrings v1.11.0
[fa267f1f] + TOML v1.0.3
[a4e569a6] + Tar v1.10.0
[8dfed614] + Test v1.11.0
[cf7118a7] + UUIDs v1.11.0
[4ec0a83e] + Unicode v1.11.0
[e66e0078] + CompilerSupportLibraries_jll v1.3.0+1
[deac9b47] + LibCURL_jll v8.15.0+1
[e37daf67] + LibGit2_jll v1.9.1+0
[29816b5a] + LibSSH2_jll v1.11.3+1
[14a3606d] + MozillaCACerts_jll v2025.7.15
[458c3c95] + OpenSSL_jll v3.5.2+0
[efcefdf7] + PCRE2_jll v10.45.0+0
[83775a58] + Zlib_jll v1.3.1+2
[3161d3a3] + Zstd_jll v1.5.7+1
[8e850ede] + nghttp2_jll v1.65.0+0
[3f19e933] + p7zip_jll v17.5.0+2
Info Packages marked with ⌅ have new versions available but compatibility constraints restrict them from upgrading. To see why use `status --outdated -m`
Installation completed after 4.76s
################################################################################
# Precompilation
#
Precompiling PkgEval dependencies...
Precompiling package dependencies...
Precompilation completed after 117.23s
################################################################################
# Testing
#
Testing Zarr
Status `/tmp/jl_V2n8xY/Project.toml`
[8f4d0f93] Conda v1.10.2
[682c06a0] JSON v0.21.4
[4281f0d9] Minio v0.2.2
[438e738f] PyCall v1.96.4
[0a941bbe] Zarr v0.9.4
[ade2ca70] Dates v1.11.0
[a63ad114] Mmap v1.11.0
[44cfe95a] Pkg v1.13.0
[9a3f8284] Random v1.11.0
[6462fe0b] Sockets v1.11.0
[8dfed614] Test v1.11.0
Status `/tmp/jl_V2n8xY/Manifest.toml`
[fbe9abb3] AWS v1.94.1
⌅ [1c724243] AWSS3 v0.10.4
[dce04be8] ArgCheck v2.5.0
[31f734f8] ArrowTypes v2.3.0
[d1d4a3ce] BitFlags v0.1.9
[a74b3585] Blosc v0.7.3
[6309b1aa] CodecInflate64 v0.1.3
[944b1d66] CodecZlib v0.7.8
[34da2185] Compat v4.18.0
[f0e56b4a] ConcurrentUtilities v2.5.0
[8f4d0f93] Conda v1.10.2
[187b0558] ConstructionBase v1.6.0
⌅ [864edb3b] DataStructures v0.18.22
[3c3547ce] DiskArrays v0.4.15
[460bff9d] ExceptionUnwrapping v0.1.11
[e2ba6199] ExprTools v0.1.10
[8f5d6c58] EzXML v1.2.2
[48062228] FilePathsBase v0.9.24
[bc5e4493] GitHub v5.10.0
[cd3eb016] HTTP v1.10.17
[83e8ac13] IniFile v0.5.1
[0c81fc1b] InputBuffers v1.1.1
[c8e1da08] IterTools v1.10.0
[692b3bcd] JLLWrappers v1.7.1
[682c06a0] JSON v0.21.4
[8ac3fa9e] LRUCache v1.6.2
[e6f89c97] LoggingExtras v1.1.0
[1914dd2f] MacroTools v0.5.16
[739be429] MbedTLS v1.1.9
[4281f0d9] Minio v0.2.2
⌅ [78c3b35d] Mocking v0.7.9
[6fe1bfb0] OffsetArrays v1.17.0
[4d8831e6] OpenSSL v1.5.0
[bac558e1] OrderedCollections v1.8.1
[69de0a69] Parsers v2.8.3
[aea7be01] PrecompileTools v1.3.2
[21216c6a] Preferences v1.5.0
[438e738f] PyCall v1.96.4
[20febd7b] Retry v0.4.1
[777ac1f9] SimpleBufferStream v1.2.0
[2133526b] SodiumSeal v0.1.1
[2da68c74] SymDict v0.3.0
[3bb67fe8] TranscodingStreams v0.11.3
[5c2747f8] URIs v1.6.1
[81def892] VersionParsing v1.3.0
[228000da] XMLDict v0.4.1
[0a941bbe] Zarr v0.9.4
[49080126] ZipArchives v2.5.1
[0b7ba130] Blosc_jll v1.21.7+0
[94ce4f54] Libiconv_jll v1.18.0+0
[5ced341a] Lz4_jll v1.10.1+0
[c8ffd9c3] MbedTLS_jll v2.28.6+2
[02c8fc9c] XML2_jll v2.14.4+0
[a9144af2] libsodium_jll v1.0.21+0
⌅ [ad83bbfc] minio_jll v1.0.0+1
[0dad84c5] ArgTools v1.1.2
[56f22d72] Artifacts v1.11.0
[2a0f44e3] Base64 v1.11.0
[ade2ca70] Dates v1.11.0
[f43a241f] Downloads v1.7.0
[7b1f6079] FileWatching v1.11.0
[b77e0a4c] InteractiveUtils v1.11.0
[ac6e5ff7] JuliaSyntaxHighlighting v1.12.0
[b27032c2] LibCURL v0.6.4
[76f85450] LibGit2 v1.11.0
[8f399da3] Libdl v1.11.0
[37e2e46d] LinearAlgebra v1.13.0
[56ddb016] Logging v1.11.0
[d6f4376e] Markdown v1.11.0
[a63ad114] Mmap v1.11.0
[ca575930] NetworkOptions v1.3.0
[44cfe95a] Pkg v1.13.0
[de0858da] Printf v1.11.0
[9a3f8284] Random v1.11.0
[ea8e919c] SHA v0.7.0
[9e88b42a] Serialization v1.11.0
[6462fe0b] Sockets v1.11.0
[f489334b] StyledStrings v1.11.0
[fa267f1f] TOML v1.0.3
[a4e569a6] Tar v1.10.0
[8dfed614] Test v1.11.0
[cf7118a7] UUIDs v1.11.0
[4ec0a83e] Unicode v1.11.0
[e66e0078] CompilerSupportLibraries_jll v1.3.0+1
[deac9b47] LibCURL_jll v8.15.0+1
[e37daf67] LibGit2_jll v1.9.1+0
[29816b5a] LibSSH2_jll v1.11.3+1
[14a3606d] MozillaCACerts_jll v2025.7.15
[4536629a] OpenBLAS_jll v0.3.29+0
[458c3c95] OpenSSL_jll v3.5.2+0
[efcefdf7] PCRE2_jll v10.45.0+0
[83775a58] Zlib_jll v1.3.1+2
[3161d3a3] Zstd_jll v1.5.7+1
[8e850b90] libblastrampoline_jll v5.13.1+0
[8e850ede] nghttp2_jll v1.65.0+0
[3f19e933] p7zip_jll v17.5.0+2
Info Packages marked with ⌅ have new versions available but compatibility constraints restrict them from upgrading.
Testing Running tests...
Type : ZArray
Data type : Vector{Float64}
Shape : (2, 3)
Chunk Shape : (2, 3)
Order : C
Read-Only : false
Compressor : Zarr.BloscCompressor(0, 5, "lz4", 1)
Filters : (Zarr.VLenArrayFilter{Float64}(),)
Store type : Dictionary Storage
No. bytes : unknown
No. bytes stored : 108
Storage ratio : unknown
Chunks initialized : 1/1
Precompiling packages...
5154.8 ms ✓ minio_jll
5016.2 ms ✓ Minio
2 dependencies successfully precompiled in 11 seconds. 70 already precompiled.
[ Info: Minio server started
Minio S3 storage: Error During Test at /home/pkgeval/.julia/packages/Zarr/3QSdj/test/storage.jl:153
Got exception outside of a @test
HTTP.ConnectError for url = `http://localhost:9001/zarrdata`: IOError: connect: connection refused (ECONNREFUSED)
Stacktrace:
[1] getconnection(::Type{Sockets.TCPSocket}, host::SubString{String}, port::SubString{String}; keepalive::Bool, readtimeout::Int64, kw::@Kwargs{require_ssl_verification::Bool, iofunction::Nothing, decompress::Nothing, verbose::Int64})
@ HTTP.Connections ~/.julia/packages/HTTP/JcAHX/src/Connections.jl:531
[2] getconnection
@ ~/.julia/packages/HTTP/JcAHX/src/Connections.jl:508 [inlined]
[3] #13
@ ~/.julia/packages/HTTP/JcAHX/src/Connections.jl:467 [inlined]
[4] macro expansion
@ ~/.julia/packages/ConcurrentUtilities/ofY4K/src/try_with_timeout.jl:92 [inlined]
[5] (::ConcurrentUtilities.var"#try_with_timeout##2#try_with_timeout##3"{Any, Channel{Any}, HTTP.Connections.var"#13#14"{Sockets.TCPSocket, Bool, Bool, @Kwargs{readtimeout::Int64, iofunction::Nothing, decompress::Nothing, verbose::Int64}, SubString{String}, SubString{String}}, Timer})()
@ ConcurrentUtilities ~/.julia/packages/ConcurrentUtilities/ofY4K/src/ConcurrentUtilities.jl:10
Stacktrace:
[1] (::HTTP.ConnectionRequest.var"#connections#connectionlayer##0"{HTTP.ConnectionRequest.var"#connections#1#connectionlayer##1"{HTTP.TimeoutRequest.var"#timeouts#timeoutlayer##0"{HTTP.TimeoutRequest.var"#timeouts#1#timeoutlayer##1"{HTTP.ExceptionRequest.var"#exceptions#exceptionlayer##0"{HTTP.ExceptionRequest.var"#exceptions#1#exceptionlayer##1"{typeof(HTTP.StreamRequest.streamlayer)}}}}}})(req::HTTP.Messages.Request; proxy::Nothing, socket_type::Type, socket_type_tls::Nothing, readtimeout::Int64, connect_timeout::Int64, logerrors::Bool, logtag::Nothing, closeimmediately::Bool, kw::@Kwargs{iofunction::Nothing, decompress::Nothing, verbose::Int64})
@ HTTP.ConnectionRequest ~/.julia/packages/HTTP/JcAHX/src/clientlayers/ConnectionRequest.jl:88
[2] connections
@ ~/.julia/packages/HTTP/JcAHX/src/clientlayers/ConnectionRequest.jl:60 [inlined]
[3] (::HTTP.RetryRequest.var"#manageretries#retrylayer##0"{HTTP.RetryRequest.var"#manageretries#1#retrylayer##1"{HTTP.ConnectionRequest.var"#connections#connectionlayer##0"{HTTP.ConnectionRequest.var"#connections#1#connectionlayer##1"{HTTP.TimeoutRequest.var"#timeouts#timeoutlayer##0"{HTTP.TimeoutRequest.var"#timeouts#1#timeoutlayer##1"{HTTP.ExceptionRequest.var"#exceptions#exceptionlayer##0"{HTTP.ExceptionRequest.var"#exceptions#1#exceptionlayer##1"{typeof(HTTP.StreamRequest.streamlayer)}}}}}}}})(req::HTTP.Messages.Request; retry::Bool, retries::Int64, retry_delays::ExponentialBackOff, retry_check::Function, retry_non_idempotent::Bool, kw::@Kwargs{iofunction::Nothing, decompress::Nothing, verbose::Int64})
@ HTTP.RetryRequest ~/.julia/packages/HTTP/JcAHX/src/clientlayers/RetryRequest.jl:35
[4] manageretries
@ ~/.julia/packages/HTTP/JcAHX/src/clientlayers/RetryRequest.jl:30 [inlined]
[5] (::HTTP.CookieRequest.var"#managecookies#cookielayer##0"{HTTP.CookieRequest.var"#managecookies#1#cookielayer##1"{HTTP.RetryRequest.var"#manageretries#retrylayer##0"{HTTP.RetryRequest.var"#manageretries#1#retrylayer##1"{HTTP.ConnectionRequest.var"#connections#connectionlayer##0"{HTTP.ConnectionRequest.var"#connections#1#connectionlayer##1"{HTTP.TimeoutRequest.var"#timeouts#timeoutlayer##0"{HTTP.TimeoutRequest.var"#timeouts#1#timeoutlayer##1"{HTTP.ExceptionRequest.var"#exceptions#exceptionlayer##0"{HTTP.ExceptionRequest.var"#exceptions#1#exceptionlayer##1"{typeof(HTTP.StreamRequest.streamlayer)}}}}}}}}}})(req::HTTP.Messages.Request; cookies::Bool, cookiejar::HTTP.Cookies.CookieJar, kw::@Kwargs{iofunction::Nothing, decompress::Nothing, verbose::Int64, retry::Bool})
@ HTTP.CookieRequest ~/.julia/packages/HTTP/JcAHX/src/clientlayers/CookieRequest.jl:42
[6] managecookies
@ ~/.julia/packages/HTTP/JcAHX/src/clientlayers/CookieRequest.jl:19 [inlined]
[7] (::HTTP.HeadersRequest.var"#defaultheaders#headerslayer##0"{HTTP.HeadersRequest.var"#defaultheaders#1#headerslayer##1"{HTTP.CookieRequest.var"#managecookies#cookielayer##0"{HTTP.CookieRequest.var"#managecookies#1#cookielayer##1"{HTTP.RetryRequest.var"#manageretries#retrylayer##0"{HTTP.RetryRequest.var"#manageretries#1#retrylayer##1"{HTTP.ConnectionRequest.var"#connections#connectionlayer##0"{HTTP.ConnectionRequest.var"#connections#1#connectionlayer##1"{HTTP.TimeoutRequest.var"#timeouts#timeoutlayer##0"{HTTP.TimeoutRequest.var"#timeouts#1#timeoutlayer##1"{HTTP.ExceptionRequest.var"#exceptions#exceptionlayer##0"{HTTP.ExceptionRequest.var"#exceptions#1#exceptionlayer##1"{typeof(HTTP.StreamRequest.streamlayer)}}}}}}}}}}}})(req::HTTP.Messages.Request; iofunction::Nothing, decompress::Nothing, basicauth::Bool, detect_content_type::Bool, canonicalize_headers::Bool, kw::@Kwargs{verbose::Int64, retry::Bool})
@ HTTP.HeadersRequest ~/.julia/packages/HTTP/JcAHX/src/clientlayers/HeadersRequest.jl:71
[8] defaultheaders
@ ~/.julia/packages/HTTP/JcAHX/src/clientlayers/HeadersRequest.jl:14 [inlined]
[9] (::HTTP.RedirectRequest.var"#redirects#redirectlayer##0"{HTTP.RedirectRequest.var"#redirects#1#redirectlayer##1"{HTTP.HeadersRequest.var"#defaultheaders#headerslayer##0"{HTTP.HeadersRequest.var"#defaultheaders#1#headerslayer##1"{HTTP.CookieRequest.var"#managecookies#cookielayer##0"{HTTP.CookieRequest.var"#managecookies#1#cookielayer##1"{HTTP.RetryRequest.var"#manageretries#retrylayer##0"{HTTP.RetryRequest.var"#manageretries#1#retrylayer##1"{HTTP.ConnectionRequest.var"#connections#connectionlayer##0"{HTTP.ConnectionRequest.var"#connections#1#connectionlayer##1"{HTTP.TimeoutRequest.var"#timeouts#timeoutlayer##0"{HTTP.TimeoutRequest.var"#timeouts#1#timeoutlayer##1"{HTTP.ExceptionRequest.var"#exceptions#exceptionlayer##0"{HTTP.ExceptionRequest.var"#exceptions#1#exceptionlayer##1"{typeof(HTTP.StreamRequest.streamlayer)}}}}}}}}}}}}}})(req::HTTP.Messages.Request; redirect::Bool, redirect_limit::Int64, redirect_method::Nothing, forwardheaders::Bool, response_stream::Base.BufferStream, kw::@Kwargs{verbose::Int64, retry::Bool})
@ HTTP.RedirectRequest ~/.julia/packages/HTTP/JcAHX/src/clientlayers/RedirectRequest.jl:17
[10] redirects
@ ~/.julia/packages/HTTP/JcAHX/src/clientlayers/RedirectRequest.jl:14 [inlined]
[11] (::HTTP.MessageRequest.var"#makerequest#messagelayer##0"{HTTP.MessageRequest.var"#makerequest#1#messagelayer##1"{HTTP.RedirectRequest.var"#redirects#redirectlayer##0"{HTTP.RedirectRequest.var"#redirects#1#redirectlayer##1"{HTTP.HeadersRequest.var"#defaultheaders#headerslayer##0"{HTTP.HeadersRequest.var"#defaultheaders#1#headerslayer##1"{HTTP.CookieRequest.var"#managecookies#cookielayer##0"{HTTP.CookieRequest.var"#managecookies#1#cookielayer##1"{HTTP.RetryRequest.var"#manageretries#retrylayer##0"{HTTP.RetryRequest.var"#manageretries#1#retrylayer##1"{HTTP.ConnectionRequest.var"#connections#connectionlayer##0"{HTTP.ConnectionRequest.var"#connections#1#connectionlayer##1"{HTTP.TimeoutRequest.var"#timeouts#timeoutlayer##0"{HTTP.TimeoutRequest.var"#timeouts#1#timeoutlayer##1"{HTTP.ExceptionRequest.var"#exceptions#exceptionlayer##0"{HTTP.ExceptionRequest.var"#exceptions#1#exceptionlayer##1"{typeof(HTTP.StreamRequest.streamlayer)}}}}}}}}}}}}}}}})(method::String, url::URIs.URI, headers::Vector{Pair{SubString{String}, SubString{String}}}, body::String; copyheaders::Bool, response_stream::Base.BufferStream, http_version::HTTP.Strings.HTTPVersion, verbose::Int64, kw::@Kwargs{redirect::Bool, retry::Bool})
@ HTTP.MessageRequest ~/.julia/packages/HTTP/JcAHX/src/clientlayers/MessageRequest.jl:35
[12] makerequest
@ ~/.julia/packages/HTTP/JcAHX/src/clientlayers/MessageRequest.jl:24 [inlined]
[13] request(stack::HTTP.MessageRequest.var"#makerequest#messagelayer##0"{HTTP.MessageRequest.var"#makerequest#1#messagelayer##1"{HTTP.RedirectRequest.var"#redirects#redirectlayer##0"{HTTP.RedirectRequest.var"#redirects#1#redirectlayer##1"{HTTP.HeadersRequest.var"#defaultheaders#headerslayer##0"{HTTP.HeadersRequest.var"#defaultheaders#1#headerslayer##1"{HTTP.CookieRequest.var"#managecookies#cookielayer##0"{HTTP.CookieRequest.var"#managecookies#1#cookielayer##1"{HTTP.RetryRequest.var"#manageretries#retrylayer##0"{HTTP.RetryRequest.var"#manageretries#1#retrylayer##1"{HTTP.ConnectionRequest.var"#connections#connectionlayer##0"{HTTP.ConnectionRequest.var"#connections#1#connectionlayer##1"{HTTP.TimeoutRequest.var"#timeouts#timeoutlayer##0"{HTTP.TimeoutRequest.var"#timeouts#1#timeoutlayer##1"{HTTP.ExceptionRequest.var"#exceptions#exceptionlayer##0"{HTTP.ExceptionRequest.var"#exceptions#1#exceptionlayer##1"{typeof(HTTP.StreamRequest.streamlayer)}}}}}}}}}}}}}}}}, method::String, url::URIs.URI, h::Vector{Pair{SubString{String}, SubString{String}}}, b::String, q::Nothing; headers::Vector{Pair{SubString{String}, SubString{String}}}, body::String, query::Nothing, kw::@Kwargs{redirect::Bool, retry::Bool, response_stream::Base.BufferStream})
@ HTTP ~/.julia/packages/HTTP/JcAHX/src/HTTP.jl:457
[14] kwcall(::@NamedTuple{redirect::Bool, retry::Bool, response_stream::Base.BufferStream}, ::typeof(HTTP.request), stack::Function, method::String, url::URIs.URI, h::Vector{Pair{SubString{String}, SubString{String}}}, b::String, q::Nothing)
@ HTTP ~/.julia/packages/HTTP/JcAHX/src/HTTP.jl:455
[15] #request#21
@ ~/.julia/packages/HTTP/JcAHX/src/HTTP.jl:315 [inlined]
[16] kwcall(::@NamedTuple{redirect::Bool, retry::Bool, response_stream::Base.BufferStream}, ::typeof(HTTP.request), method::String, url::URIs.URI, h::Vector{Pair{SubString{String}, SubString{String}}}, b::String)
@ HTTP ~/.julia/packages/HTTP/JcAHX/src/HTTP.jl:313
[17] macro expansion
@ ~/.julia/packages/Mocking/rzcpa/src/mock.jl:50 [inlined]
[18] (::AWS.var"#_http_request##0#_http_request##1"{AWS.Request, OrderedCollections.LittleDict{Symbol, Any, Vector{Symbol}, Vector{Any}}})()
@ AWS ~/.julia/packages/AWS/ZEOyZ/src/utilities/request.jl:222
[19] (::Base.var"#46#47"{Base.var"#48#49"{AWS.AWSExponentialBackoff, AWS.var"#_http_request##2#_http_request##3", AWS.var"#_http_request##0#_http_request##1"{AWS.Request, OrderedCollections.LittleDict{Symbol, Any, Vector{Symbol}, Vector{Any}}}}})(; kwargs::@Kwargs{})
@ Base ./error.jl:323
[20] (::Base.var"#46#47"{Base.var"#48#49"{AWS.AWSExponentialBackoff, AWS.var"#_http_request##2#_http_request##3", AWS.var"#_http_request##0#_http_request##1"{AWS.Request, OrderedCollections.LittleDict{Symbol, Any, Vector{Symbol}, Vector{Any}}}}})()
@ Base ./error.jl:306
[21] _http_request(http_backend::AWS.HTTPBackend, request::AWS.Request, response_stream::IOBuffer)
@ AWS ~/.julia/packages/AWS/ZEOyZ/src/utilities/request.jl:247
[22] macro expansion
@ ~/.julia/packages/Mocking/rzcpa/src/mock.jl:50 [inlined]
[23] (::AWS.var"#42#43"{MinioConfig, AWS.Request, IOBuffer, Vector{Int64}})()
@ AWS ~/.julia/packages/AWS/ZEOyZ/src/utilities/request.jl:131
[24] (::AWS.var"#45#46"{AWS.var"#42#43"{MinioConfig, AWS.Request, IOBuffer, Vector{Int64}}, IOBuffer})()
@ AWS ~/.julia/packages/AWS/ZEOyZ/src/utilities/request.jl:146
[25] (::Base.var"#46#47"{Base.var"#48#49"{AWS.AWSExponentialBackoff, AWS.var"#47#48"{MinioConfig, Vector{String}, Vector{String}, Int64}, AWS.var"#45#46"{AWS.var"#42#43"{MinioConfig, AWS.Request, IOBuffer, Vector{Int64}}, IOBuffer}}})(; kwargs::@Kwargs{})
@ Base ./error.jl:311
[26] (::Base.var"#46#47"{Base.var"#48#49"{AWS.AWSExponentialBackoff, AWS.var"#47#48"{MinioConfig, Vector{String}, Vector{String}, Int64}, AWS.var"#45#46"{AWS.var"#42#43"{MinioConfig, AWS.Request, IOBuffer, Vector{Int64}}, IOBuffer}}})()
@ Base ./error.jl:306
[27] submit_request(aws::MinioConfig, request::AWS.Request; return_headers::Nothing)
@ AWS ~/.julia/packages/AWS/ZEOyZ/src/utilities/request.jl:197
[28] kwcall(::@NamedTuple{return_headers::Nothing}, ::typeof(AWS.submit_request), aws::MinioConfig, request::AWS.Request)
@ AWS ~/.julia/packages/AWS/ZEOyZ/src/utilities/request.jl:99
[29] (::AWS.RestXMLService)(request_method::String, request_uri::String, args::Dict{String, Any}; aws_config::MinioConfig, feature_set::AWS.FeatureSet)
@ AWS ~/.julia/packages/AWS/ZEOyZ/src/AWS.jl:352
┌[30] RestXMLService
│ @ ~/.julia/packages/AWS/ZEOyZ/src/AWS.jl:316 [inlined]
╰──── repeated 2 times
[32] create_bucket(Bucket::String; aws_config::MinioConfig)
@ AWSS3.S3 ~/.julia/packages/AWS/ZEOyZ/src/services/s3.jl:774
[33] create_bucket(Bucket::String)
@ AWSS3.S3 ~/.julia/packages/AWS/ZEOyZ/src/services/s3.jl:773
[34] top-level scope
@ ~/.julia/packages/Zarr/3QSdj/test/storage.jl:154
[35] macro expansion
@ /opt/julia/share/julia/stdlib/v1.13/Test/src/Test.jl:1929 [inlined]
[36] macro expansion
@ ~/.julia/packages/Zarr/3QSdj/test/storage.jl:163 [inlined]
[37] include(mapexpr::Function, mod::Module, _path::String)
@ Base ./Base.jl:312
[38] top-level scope
@ ~/.julia/packages/Zarr/3QSdj/test/runtests.jl:17
[39] macro expansion
@ /opt/julia/share/julia/stdlib/v1.13/Test/src/Test.jl:1929 [inlined]
[40] macro expansion
@ ~/.julia/packages/Zarr/3QSdj/test/runtests.jl:260 [inlined]
[41] include(mapexpr::Function, mod::Module, _path::String)
@ Base ./Base.jl:312
[42] top-level scope
@ none:6
[43] eval(m::Module, e::Any)
@ Core ./boot.jl:489
[44] exec_options(opts::Base.JLOptions)
@ Base ./client.jl:286
[45] _start()
@ Base ./client.jl:553
caused by: IOError: connect: connection refused (ECONNREFUSED)
Stacktrace:
[1] getconnection(::Type{Sockets.TCPSocket}, host::SubString{String}, port::SubString{String}; keepalive::Bool, readtimeout::Int64, kw::@Kwargs{require_ssl_verification::Bool, iofunction::Nothing, decompress::Nothing, verbose::Int64})
@ HTTP.Connections ~/.julia/packages/HTTP/JcAHX/src/Connections.jl:531
[2] getconnection
@ ~/.julia/packages/HTTP/JcAHX/src/Connections.jl:508 [inlined]
[3] #13
@ ~/.julia/packages/HTTP/JcAHX/src/Connections.jl:467 [inlined]
[4] macro expansion
@ ~/.julia/packages/ConcurrentUtilities/ofY4K/src/try_with_timeout.jl:92 [inlined]
[5] (::ConcurrentUtilities.var"#try_with_timeout##2#try_with_timeout##3"{Any, Channel{Any}, HTTP.Connections.var"#13#14"{Sockets.TCPSocket, Bool, Bool, @Kwargs{readtimeout::Int64, iofunction::Nothing, decompress::Nothing, verbose::Int64}, SubString{String}, SubString{String}}, Timer})()
@ ConcurrentUtilities ~/.julia/packages/ConcurrentUtilities/ofY4K/src/ConcurrentUtilities.jl:10
Stacktrace:
[1] try_yieldto(undo::typeof(Base.ensure_rescheduled))
@ Base ./task.jl:1107
[2] wait()
@ Base ./task.jl:1195
[3] wait(c::Base.GenericCondition{ReentrantLock}; first::Bool)
@ Base ./condition.jl:141
[4] wait
@ ./condition.jl:136 [inlined]
[5] take_unbuffered(c::Channel{Any})
@ Base ./channels.jl:549
[6] take!
@ ./channels.jl:526 [inlined]
[7] try_with_timeout(f::Function, timeout::Int64, ::Type{Any})
@ ConcurrentUtilities ~/.julia/packages/ConcurrentUtilities/ofY4K/src/try_with_timeout.jl:99
[8] try_with_timeout
@ ~/.julia/packages/ConcurrentUtilities/ofY4K/src/try_with_timeout.jl:77 [inlined]
[9] (::HTTP.Connections.var"#11#12"{Sockets.TCPSocket, Int64, Int64, Bool, Bool, @Kwargs{readtimeout::Int64, iofunction::Nothing, decompress::Nothing, verbose::Int64}, SubString{String}, SubString{String}})()
@ HTTP.Connections ~/.julia/packages/HTTP/JcAHX/src/Connections.jl:464
[10] acquire(f::HTTP.Connections.var"#11#12"{Sockets.TCPSocket, Int64, Int64, Bool, Bool, @Kwargs{readtimeout::Int64, iofunction::Nothing, decompress::Nothing, verbose::Int64}, SubString{String}, SubString{String}}, pool::ConcurrentUtilities.Pools.Pool{Tuple{AbstractString, AbstractString, Bool, Bool, Bool}, HTTP.Connections.Connection{Sockets.TCPSocket}}, key::Tuple{SubString{String}, SubString{String}, Bool, Bool, Bool}; forcenew::Bool, isvalid::HTTP.Connections.var"#15#16"{Int64})
@ ConcurrentUtilities.Pools ~/.julia/packages/ConcurrentUtilities/ofY4K/src/pools.jl:159
[11] acquire
@ ~/.julia/packages/ConcurrentUtilities/ofY4K/src/pools.jl:140 [inlined]
[12] #newconnection#7
@ ~/.julia/packages/HTTP/JcAHX/src/Connections.jl:459 [inlined]
[13] kwcall(::@NamedTuple{readtimeout::Int64, connect_timeout::Int64, iofunction::Nothing, decompress::Nothing, verbose::Int64}, ::typeof(HTTP.Connections.newconnection), ::Type{Sockets.TCPSocket}, host::SubString{String}, port::SubString{String})
@ HTTP.Connections ~/.julia/packages/HTTP/JcAHX/src/Connections.jl:447
[14] (::HTTP.ConnectionRequest.var"#connections#connectionlayer##0"{HTTP.ConnectionRequest.var"#connections#1#connectionlayer##1"{HTTP.TimeoutRequest.var"#timeouts#timeoutlayer##0"{HTTP.TimeoutRequest.var"#timeouts#1#timeoutlayer##1"{HTTP.ExceptionRequest.var"#exceptions#exceptionlayer##0"{HTTP.ExceptionRequest.var"#exceptions#1#exceptionlayer##1"{typeof(HTTP.StreamRequest.streamlayer)}}}}}})(req::HTTP.Messages.Request; proxy::Nothing, socket_type::Type, socket_type_tls::Nothing, readtimeout::Int64, connect_timeout::Int64, logerrors::Bool, logtag::Nothing, closeimmediately::Bool, kw::@Kwargs{iofunction::Nothing, decompress::Nothing, verbose::Int64})
@ HTTP.ConnectionRequest ~/.julia/packages/HTTP/JcAHX/src/clientlayers/ConnectionRequest.jl:82
[15] connections
@ ~/.julia/packages/HTTP/JcAHX/src/clientlayers/ConnectionRequest.jl:60 [inlined]
[16] (::HTTP.RetryRequest.var"#manageretries#retrylayer##0"{HTTP.RetryRequest.var"#manageretries#1#retrylayer##1"{HTTP.ConnectionRequest.var"#connections#connectionlayer##0"{HTTP.ConnectionRequest.var"#connections#1#connectionlayer##1"{HTTP.TimeoutRequest.var"#timeouts#timeoutlayer##0"{HTTP.TimeoutRequest.var"#timeouts#1#timeoutlayer##1"{HTTP.ExceptionRequest.var"#exceptions#exceptionlayer##0"{HTTP.ExceptionRequest.var"#exceptions#1#exceptionlayer##1"{typeof(HTTP.StreamRequest.streamlayer)}}}}}}}})(req::HTTP.Messages.Request; retry::Bool, retries::Int64, retry_delays::ExponentialBackOff, retry_check::Function, retry_non_idempotent::Bool, kw::@Kwargs{iofunction::Nothing, decompress::Nothing, verbose::Int64})
@ HTTP.RetryRequest ~/.julia/packages/HTTP/JcAHX/src/clientlayers/RetryRequest.jl:35
[17] manageretries
@ ~/.julia/packages/HTTP/JcAHX/src/clientlayers/RetryRequest.jl:30 [inlined]
[18] (::HTTP.CookieRequest.var"#managecookies#cookielayer##0"{HTTP.CookieRequest.var"#managecookies#1#cookielayer##1"{HTTP.RetryRequest.var"#manageretries#retrylayer##0"{HTTP.RetryRequest.var"#manageretries#1#retrylayer##1"{HTTP.ConnectionRequest.var"#connections#connectionlayer##0"{HTTP.ConnectionRequest.var"#connections#1#connectionlayer##1"{HTTP.TimeoutRequest.var"#timeouts#timeoutlayer##0"{HTTP.TimeoutRequest.var"#timeouts#1#timeoutlayer##1"{HTTP.ExceptionRequest.var"#exceptions#exceptionlayer##0"{HTTP.ExceptionRequest.var"#exceptions#1#exceptionlayer##1"{typeof(HTTP.StreamRequest.streamlayer)}}}}}}}}}})(req::HTTP.Messages.Request; cookies::Bool, cookiejar::HTTP.Cookies.CookieJar, kw::@Kwargs{iofunction::Nothing, decompress::Nothing, verbose::Int64, retry::Bool})
@ HTTP.CookieRequest ~/.julia/packages/HTTP/JcAHX/src/clientlayers/CookieRequest.jl:42
[19] managecookies
@ ~/.julia/packages/HTTP/JcAHX/src/clientlayers/CookieRequest.jl:19 [inlined]
[20] (::HTTP.HeadersRequest.var"#defaultheaders#headerslayer##0"{HTTP.HeadersRequest.var"#defaultheaders#1#headerslayer##1"{HTTP.CookieRequest.var"#managecookies#cookielayer##0"{HTTP.CookieRequest.var"#managecookies#1#cookielayer##1"{HTTP.RetryRequest.var"#manageretries#retrylayer##0"{HTTP.RetryRequest.var"#manageretries#1#retrylayer##1"{HTTP.ConnectionRequest.var"#connections#connectionlayer##0"{HTTP.ConnectionRequest.var"#connections#1#connectionlayer##1"{HTTP.TimeoutRequest.var"#timeouts#timeoutlayer##0"{HTTP.TimeoutRequest.var"#timeouts#1#timeoutlayer##1"{HTTP.ExceptionRequest.var"#exceptions#exceptionlayer##0"{HTTP.ExceptionRequest.var"#exceptions#1#exceptionlayer##1"{typeof(HTTP.StreamRequest.streamlayer)}}}}}}}}}}}})(req::HTTP.Messages.Request; iofunction::Nothing, decompress::Nothing, basicauth::Bool, detect_content_type::Bool, canonicalize_headers::Bool, kw::@Kwargs{verbose::Int64, retry::Bool})
@ HTTP.HeadersRequest ~/.julia/packages/HTTP/JcAHX/src/clientlayers/HeadersRequest.jl:71
[21] defaultheaders
@ ~/.julia/packages/HTTP/JcAHX/src/clientlayers/HeadersRequest.jl:14 [inlined]
[22] (::HTTP.RedirectRequest.var"#redirects#redirectlayer##0"{HTTP.RedirectRequest.var"#redirects#1#redirectlayer##1"{HTTP.HeadersRequest.var"#defaultheaders#headerslayer##0"{HTTP.HeadersRequest.var"#defaultheaders#1#headerslayer##1"{HTTP.CookieRequest.var"#managecookies#cookielayer##0"{HTTP.CookieRequest.var"#managecookies#1#cookielayer##1"{HTTP.RetryRequest.var"#manageretries#retrylayer##0"{HTTP.RetryRequest.var"#manageretries#1#retrylayer##1"{HTTP.ConnectionRequest.var"#connections#connectionlayer##0"{HTTP.ConnectionRequest.var"#connections#1#connectionlayer##1"{HTTP.TimeoutRequest.var"#timeouts#timeoutlayer##0"{HTTP.TimeoutRequest.var"#timeouts#1#timeoutlayer##1"{HTTP.ExceptionRequest.var"#exceptions#exceptionlayer##0"{HTTP.ExceptionRequest.var"#exceptions#1#exceptionlayer##1"{typeof(HTTP.StreamRequest.streamlayer)}}}}}}}}}}}}}})(req::HTTP.Messages.Request; redirect::Bool, redirect_limit::Int64, redirect_method::Nothing, forwardheaders::Bool, response_stream::Base.BufferStream, kw::@Kwargs{verbose::Int64, retry::Bool})
@ HTTP.RedirectRequest ~/.julia/packages/HTTP/JcAHX/src/clientlayers/RedirectRequest.jl:17
[23] redirects
@ ~/.julia/packages/HTTP/JcAHX/src/clientlayers/RedirectRequest.jl:14 [inlined]
[24] (::HTTP.MessageRequest.var"#makerequest#messagelayer##0"{HTTP.MessageRequest.var"#makerequest#1#messagelayer##1"{HTTP.RedirectRequest.var"#redirects#redirectlayer##0"{HTTP.RedirectRequest.var"#redirects#1#redirectlayer##1"{HTTP.HeadersRequest.var"#defaultheaders#headerslayer##0"{HTTP.HeadersRequest.var"#defaultheaders#1#headerslayer##1"{HTTP.CookieRequest.var"#managecookies#cookielayer##0"{HTTP.CookieRequest.var"#managecookies#1#cookielayer##1"{HTTP.RetryRequest.var"#manageretries#retrylayer##0"{HTTP.RetryRequest.var"#manageretries#1#retrylayer##1"{HTTP.ConnectionRequest.var"#connections#connectionlayer##0"{HTTP.ConnectionRequest.var"#connections#1#connectionlayer##1"{HTTP.TimeoutRequest.var"#timeouts#timeoutlayer##0"{HTTP.TimeoutRequest.var"#timeouts#1#timeoutlayer##1"{HTTP.ExceptionRequest.var"#exceptions#exceptionlayer##0"{HTTP.ExceptionRequest.var"#exceptions#1#exceptionlayer##1"{typeof(HTTP.StreamRequest.streamlayer)}}}}}}}}}}}}}}}})(method::String, url::URIs.URI, headers::Vector{Pair{SubString{String}, SubString{String}}}, body::String; copyheaders::Bool, response_stream::Base.BufferStream, http_version::HTTP.Strings.HTTPVersion, verbose::Int64, kw::@Kwargs{redirect::Bool, retry::Bool})
@ HTTP.MessageRequest ~/.julia/packages/HTTP/JcAHX/src/clientlayers/MessageRequest.jl:35
[25] makerequest
@ ~/.julia/packages/HTTP/JcAHX/src/clientlayers/MessageRequest.jl:24 [inlined]
[26] request(stack::HTTP.MessageRequest.var"#makerequest#messagelayer##0"{HTTP.MessageRequest.var"#makerequest#1#messagelayer##1"{HTTP.RedirectRequest.var"#redirects#redirectlayer##0"{HTTP.RedirectRequest.var"#redirects#1#redirectlayer##1"{HTTP.HeadersRequest.var"#defaultheaders#headerslayer##0"{HTTP.HeadersRequest.var"#defaultheaders#1#headerslayer##1"{HTTP.CookieRequest.var"#managecookies#cookielayer##0"{HTTP.CookieRequest.var"#managecookies#1#cookielayer##1"{HTTP.RetryRequest.var"#manageretries#retrylayer##0"{HTTP.RetryRequest.var"#manageretries#1#retrylayer##1"{HTTP.ConnectionRequest.var"#connections#connectionlayer##0"{HTTP.ConnectionRequest.var"#connections#1#connectionlayer##1"{HTTP.TimeoutRequest.var"#timeouts#timeoutlayer##0"{HTTP.TimeoutRequest.var"#timeouts#1#timeoutlayer##1"{HTTP.ExceptionRequest.var"#exceptions#exceptionlayer##0"{HTTP.ExceptionRequest.var"#exceptions#1#exceptionlayer##1"{typeof(HTTP.StreamRequest.streamlayer)}}}}}}}}}}}}}}}}, method::String, url::URIs.URI, h::Vector{Pair{SubString{String}, SubString{String}}}, b::String, q::Nothing; headers::Vector{Pair{SubString{String}, SubString{String}}}, body::String, query::Nothing, kw::@Kwargs{redirect::Bool, retry::Bool, response_stream::Base.BufferStream})
@ HTTP ~/.julia/packages/HTTP/JcAHX/src/HTTP.jl:457
[27] kwcall(::@NamedTuple{redirect::Bool, retry::Bool, response_stream::Base.BufferStream}, ::typeof(HTTP.request), stack::Function, method::String, url::URIs.URI, h::Vector{Pair{SubString{String}, SubString{String}}}, b::String, q::Nothing)
@ HTTP ~/.julia/packages/HTTP/JcAHX/src/HTTP.jl:455
[28] #request#21
@ ~/.julia/packages/HTTP/JcAHX/src/HTTP.jl:315 [inlined]
[29] kwcall(::@NamedTuple{redirect::Bool, retry::Bool, response_stream::Base.BufferStream}, ::typeof(HTTP.request), method::String, url::URIs.URI, h::Vector{Pair{SubString{String}, SubString{String}}}, b::String)
@ HTTP ~/.julia/packages/HTTP/JcAHX/src/HTTP.jl:313
[30] macro expansion
@ ~/.julia/packages/Mocking/rzcpa/src/mock.jl:50 [inlined]
[31] (::AWS.var"#_http_request##0#_http_request##1"{AWS.Request, OrderedCollections.LittleDict{Symbol, Any, Vector{Symbol}, Vector{Any}}})()
@ AWS ~/.julia/packages/AWS/ZEOyZ/src/utilities/request.jl:222
[32] (::Base.var"#46#47"{Base.var"#48#49"{AWS.AWSExponentialBackoff, AWS.var"#_http_request##2#_http_request##3", AWS.var"#_http_request##0#_http_request##1"{AWS.Request, OrderedCollections.LittleDict{Symbol, Any, Vector{Symbol}, Vector{Any}}}}})(; kwargs::@Kwargs{})
@ Base ./error.jl:323
[33] (::Base.var"#46#47"{Base.var"#48#49"{AWS.AWSExponentialBackoff, AWS.var"#_http_request##2#_http_request##3", AWS.var"#_http_request##0#_http_request##1"{AWS.Request, OrderedCollections.LittleDict{Symbol, Any, Vector{Symbol}, Vector{Any}}}}})()
@ Base ./error.jl:306
[34] _http_request(http_backend::AWS.HTTPBackend, request::AWS.Request, response_stream::IOBuffer)
@ AWS ~/.julia/packages/AWS/ZEOyZ/src/utilities/request.jl:247
[35] macro expansion
@ ~/.julia/packages/Mocking/rzcpa/src/mock.jl:50 [inlined]
[36] (::AWS.var"#42#43"{MinioConfig, AWS.Request, IOBuffer, Vector{Int64}})()
@ AWS ~/.julia/packages/AWS/ZEOyZ/src/utilities/request.jl:131
[37] (::AWS.var"#45#46"{AWS.var"#42#43"{MinioConfig, AWS.Request, IOBuffer, Vector{Int64}}, IOBuffer})()
@ AWS ~/.julia/packages/AWS/ZEOyZ/src/utilities/request.jl:146
[38] (::Base.var"#46#47"{Base.var"#48#49"{AWS.AWSExponentialBackoff, AWS.var"#47#48"{MinioConfig, Vector{String}, Vector{String}, Int64}, AWS.var"#45#46"{AWS.var"#42#43"{MinioConfig, AWS.Request, IOBuffer, Vector{Int64}}, IOBuffer}}})(; kwargs::@Kwargs{})
@ Base ./error.jl:311
[39] (::Base.var"#46#47"{Base.var"#48#49"{AWS.AWSExponentialBackoff, AWS.var"#47#48"{MinioConfig, Vector{String}, Vector{String}, Int64}, AWS.var"#45#46"{AWS.var"#42#43"{MinioConfig, AWS.Request, IOBuffer, Vector{Int64}}, IOBuffer}}})()
@ Base ./error.jl:306
[40] submit_request(aws::MinioConfig, request::AWS.Request; return_headers::Nothing)
@ AWS ~/.julia/packages/AWS/ZEOyZ/src/utilities/request.jl:197
[41] kwcall(::@NamedTuple{return_headers::Nothing}, ::typeof(AWS.submit_request), aws::MinioConfig, request::AWS.Request)
@ AWS ~/.julia/packages/AWS/ZEOyZ/src/utilities/request.jl:99
[42] (::AWS.RestXMLService)(request_method::String, request_uri::String, args::Dict{String, Any}; aws_config::MinioConfig, feature_set::AWS.FeatureSet)
@ AWS ~/.julia/packages/AWS/ZEOyZ/src/AWS.jl:352
┌[43] RestXMLService
│ @ ~/.julia/packages/AWS/ZEOyZ/src/AWS.jl:316 [inlined]
╰──── repeated 2 times
[45] create_bucket(Bucket::String; aws_config::MinioConfig)
@ AWSS3.S3 ~/.julia/packages/AWS/ZEOyZ/src/services/s3.jl:774
[46] create_bucket(Bucket::String)
@ AWSS3.S3 ~/.julia/packages/AWS/ZEOyZ/src/services/s3.jl:773
[47] top-level scope
@ ~/.julia/packages/Zarr/3QSdj/test/storage.jl:154
[48] macro expansion
@ /opt/julia/share/julia/stdlib/v1.13/Test/src/Test.jl:1929 [inlined]
[49] macro expansion
@ ~/.julia/packages/Zarr/3QSdj/test/storage.jl:163 [inlined]
[50] include(mapexpr::Function, mod::Module, _path::String)
@ Base ./Base.jl:312
[51] top-level scope
@ ~/.julia/packages/Zarr/3QSdj/test/runtests.jl:17
[52] macro expansion
@ /opt/julia/share/julia/stdlib/v1.13/Test/src/Test.jl:1929 [inlined]
[53] macro expansion
@ ~/.julia/packages/Zarr/3QSdj/test/runtests.jl:260 [inlined]
[54] include(mapexpr::Function, mod::Module, _path::String)
@ Base ./Base.jl:312
[55] top-level scope
@ none:6
[56] eval(m::Module, e::Any)
@ Core ./boot.jl:489
[57] exec_options(opts::Base.JLOptions)
@ Base ./client.jl:286
[58] _start()
@ Base ./client.jl:553
AWS S3 Storage: Error During Test at /home/pkgeval/.julia/packages/Zarr/3QSdj/test/storage.jl:176
Test threw exception
Expression: storagesize(S3, p) == 0
TaskFailedException
Stacktrace:
[1] try_yieldto(undo::typeof(Base.ensure_rescheduled))
@ Base ./task.jl:1107
[2] wait()
@ Base ./task.jl:1195
[3] wait(c::Base.GenericCondition{ReentrantLock}; first::Bool)
@ Base ./condition.jl:141
[4] wait
@ ./condition.jl:136 [inlined]
[5] take_buffered(c::Channel{OrderedCollections.LittleDict})
@ Base ./channels.jl:532
[6] take!
@ ./channels.jl:526 [inlined]
[7] iterate(c::Channel{OrderedCollections.LittleDict}, state::Nothing)
@ Base ./channels.jl:709
[8] iterate
@ ./channels.jl:707 [inlined]
[9] storagesize(s::S3Store, p::String)
@ Zarr ~/.julia/packages/Zarr/3QSdj/src/Storage/s3store.jl:42
[10] top-level scope
@ ~/.julia/packages/Zarr/3QSdj/test/storage.jl:174
[11] macro expansion
@ /opt/julia/share/julia/stdlib/v1.13/Test/src/Test.jl:1929 [inlined]
[12] macro expansion
@ ~/.julia/packages/Zarr/3QSdj/test/storage.jl:176 [inlined]
[13] macro expansion
@ /opt/julia/share/julia/stdlib/v1.13/Test/src/Test.jl:742 [inlined]
nested task error: AWS.AWSExceptions.AWSException: PermanentRedirect -- The bucket you are attempting to access must be addressed using the specified endpoint. Please send all future requests to this endpoint.
HTTP.Exceptions.StatusError(301, "GET", "/zarr-demo?list-type=2&prefix=store%2Ffoo%2F&delimiter=%2F", HTTP.Messages.Response:
"""
HTTP/1.1 301 Moved Permanently
x-amz-bucket-region: us-east-1
x-amz-request-id: 9Y4VTM8PSB76GENW
x-amz-id-2: LgggPtWdfchcngCZJR4DmxVQzv/Nuz7IcBGsdd8z5u/VZPl6IVN02t5yEdvWzO0ZDwaIS3JuG9EkSuI8yybKSkwwUkpkd561j3exOUlxhH4=
Content-Type: application/xml
Transfer-Encoding: chunked
Date: Tue, 12 Aug 2025 19:05:54 GMT
Server: AmazonS3
[Message Body was streamed]""")
PermanentRedirect
The bucket you are attempting to access must be addressed using the specified endpoint. Please send all future requests to this endpoint.s3.amazonaws.comzarr-demo9Y4VTM8PSB76GENWLgggPtWdfchcngCZJR4DmxVQzv/Nuz7IcBGsdd8z5u/VZPl6IVN02t5yEdvWzO0ZDwaIS3JuG9EkSuI8yybKSkwwUkpkd561j3exOUlxhH4=
Stacktrace:
[1] (::AWS.var"#42#43"{AWS.AWSConfig, AWS.Request, IOBuffer, Vector{Int64}})()
@ AWS ~/.julia/packages/AWS/ZEOyZ/src/utilities/request.jl:139
[2] (::AWS.var"#45#46"{AWS.var"#42#43"{AWS.AWSConfig, AWS.Request, IOBuffer, Vector{Int64}}, IOBuffer})()
@ AWS ~/.julia/packages/AWS/ZEOyZ/src/utilities/request.jl:146
[3] (::Base.var"#46#47"{Base.var"#48#49"{AWS.AWSExponentialBackoff, AWS.var"#47#48"{AWS.AWSConfig, Vector{String}, Vector{String}, Int64}, AWS.var"#45#46"{AWS.var"#42#43"{AWS.AWSConfig, AWS.Request, IOBuffer, Vector{Int64}}, IOBuffer}}})(; kwargs::@Kwargs{})
@ Base ./error.jl:311
[4] (::Base.var"#46#47"{Base.var"#48#49"{AWS.AWSExponentialBackoff, AWS.var"#47#48"{AWS.AWSConfig, Vector{String}, Vector{String}, Int64}, AWS.var"#45#46"{AWS.var"#42#43"{AWS.AWSConfig, AWS.Request, IOBuffer, Vector{Int64}}, IOBuffer}}})()
@ Base ./error.jl:306
[5] submit_request(aws::AWS.AWSConfig, request::AWS.Request; return_headers::Nothing)
@ AWS ~/.julia/packages/AWS/ZEOyZ/src/utilities/request.jl:197
[6] submit_request
@ ~/.julia/packages/AWS/ZEOyZ/src/utilities/request.jl:99 [inlined]
[7] (::AWS.RestXMLService)(request_method::String, request_uri::String, args::Dict{String, String}; aws_config::AWS.AWSConfig, feature_set::AWS.FeatureSet)
@ AWS ~/.julia/packages/AWS/ZEOyZ/src/AWS.jl:352
[8] RestXMLService
@ ~/.julia/packages/AWS/ZEOyZ/src/AWS.jl:316 [inlined]
[9] #list_objects_v2#132
@ ~/.julia/packages/AWS/ZEOyZ/src/services/s3.jl:4839 [inlined]
[10] list_objects_v2
@ ~/.julia/packages/AWS/ZEOyZ/src/services/s3.jl:4836 [inlined]
[11] macro expansion
@ ~/.julia/packages/AWSS3/A97Rh/src/AWSS3.jl:773 [inlined]
[12] macro expansion
@ ~/.julia/packages/Retry/vS1bg/src/repeat_try.jl:192 [inlined]
[13] (::AWSS3.var"#44#45"{String, String, Nothing, @Kwargs{}, AWS.AWSConfig, String, String})(chnl::Channel{OrderedCollections.LittleDict})
@ AWSS3 ~/.julia/packages/AWSS3/A97Rh/src/AWSS3.jl:771
[14] (::Base.var"#566#567"{AWSS3.var"#44#45"{String, String, Nothing, @Kwargs{}, AWS.AWSConfig, String, String}, Channel{OrderedCollections.LittleDict}})()
@ Base ./channels.jl:141
AWS S3 Storage: Error During Test at /home/pkgeval/.julia/packages/Zarr/3QSdj/test/storage.jl:177
Test threw exception
Expression: Zarr.is_zgroup(S3, p) == true
AWS.AWSExceptions.AWSException: PermanentRedirect -- The bucket you are attempting to access must be addressed using the specified endpoint. Please send all future requests to this endpoint.
HTTP.Exceptions.StatusError(301, "GET", "/zarr-demo?list-type=2&prefix=store%2Ffoo%2F.zgroup&delimiter=&max-keys=1", HTTP.Messages.Response:
"""
HTTP/1.1 301 Moved Permanently
x-amz-bucket-region: us-east-1
x-amz-request-id: 5KMCE6C36E5HM83W
x-amz-id-2: e4Co3o+qQRvyWtkNk2fF4Xgdy/6Btqz86nSgC/RFira9LiLPt7edIdoWpUcUe5qYRIQCKfHxq47orMt07buWnb5Uh5RyAJCIwcqdDBo1Uyc=
Content-Type: application/xml
Transfer-Encoding: chunked
Date: Tue, 12 Aug 2025 19:06:00 GMT
Server: AmazonS3
[Message Body was streamed]""")
PermanentRedirect
The bucket you are attempting to access must be addressed using the specified endpoint. Please send all future requests to this endpoint.s3.amazonaws.comzarr-demo5KMCE6C36E5HM83We4Co3o+qQRvyWtkNk2fF4Xgdy/6Btqz86nSgC/RFira9LiLPt7edIdoWpUcUe5qYRIQCKfHxq47orMt07buWnb5Uh5RyAJCIwcqdDBo1Uyc=
Stacktrace:
[1] (::AWS.var"#42#43"{AWS.AWSConfig, AWS.Request, IOBuffer, Vector{Int64}})()
@ AWS ~/.julia/packages/AWS/ZEOyZ/src/utilities/request.jl:139
[2] (::AWS.var"#45#46"{AWS.var"#42#43"{AWS.AWSConfig, AWS.Request, IOBuffer, Vector{Int64}}, IOBuffer})()
@ AWS ~/.julia/packages/AWS/ZEOyZ/src/utilities/request.jl:146
[3] (::Base.var"#46#47"{Base.var"#48#49"{AWS.AWSExponentialBackoff, AWS.var"#47#48"{AWS.AWSConfig, Vector{String}, Vector{String}, Int64}, AWS.var"#45#46"{AWS.var"#42#43"{AWS.AWSConfig, AWS.Request, IOBuffer, Vector{Int64}}, IOBuffer}}})(; kwargs::@Kwargs{})
@ Base ./error.jl:311
[4] (::Base.var"#46#47"{Base.var"#48#49"{AWS.AWSExponentialBackoff, AWS.var"#47#48"{AWS.AWSConfig, Vector{String}, Vector{String}, Int64}, AWS.var"#45#46"{AWS.var"#42#43"{AWS.AWSConfig, AWS.Request, IOBuffer, Vector{Int64}}, IOBuffer}}})()
@ Base ./error.jl:306
[5] submit_request(aws::AWS.AWSConfig, request::AWS.Request; return_headers::Nothing)
@ AWS ~/.julia/packages/AWS/ZEOyZ/src/utilities/request.jl:197
[6] kwcall(::@NamedTuple{return_headers::Nothing}, ::typeof(AWS.submit_request), aws::AWS.AWSConfig, request::AWS.Request)
@ AWS ~/.julia/packages/AWS/ZEOyZ/src/utilities/request.jl:99
[7] (::AWS.RestXMLService)(request_method::String, request_uri::String, args::Dict{String, Any}; aws_config::AWS.AWSConfig, feature_set::AWS.FeatureSet)
@ AWS ~/.julia/packages/AWS/ZEOyZ/src/AWS.jl:352
[8] RestXMLService
@ ~/.julia/packages/AWS/ZEOyZ/src/AWS.jl:316 [inlined]
[9] #list_objects_v2#132
@ ~/.julia/packages/AWS/ZEOyZ/src/services/s3.jl:4839 [inlined]
[10] list_objects_v2
@ ~/.julia/packages/AWS/ZEOyZ/src/services/s3.jl:4836 [inlined]
[11] _s3_exists_file(aws::AWS.AWSConfig, bucket::String, path::String)
@ AWSS3 ~/.julia/packages/AWSS3/A97Rh/src/AWSS3.jl:263
[12] s3_exists_unversioned
@ ~/.julia/packages/AWSS3/A97Rh/src/AWSS3.jl:358 [inlined]
[13] #s3_exists#13
@ ~/.julia/packages/AWSS3/A97Rh/src/AWSS3.jl:388 [inlined]
[14] s3_exists(aws::AWS.AWSConfig, bucket::String, path::String)
@ AWSS3 ~/.julia/packages/AWSS3/A97Rh/src/AWSS3.jl:384
[15] isinitialized(s::S3Store, i::String)
@ Zarr ~/.julia/packages/Zarr/3QSdj/src/Storage/s3store.jl:52
[16] is_zgroup(s::S3Store, p::String)
@ Zarr ~/.julia/packages/Zarr/3QSdj/src/Storage/Storage.jl:82
[17] top-level scope
@ ~/.julia/packages/Zarr/3QSdj/test/storage.jl:174
[18] macro expansion
@ /opt/julia/share/julia/stdlib/v1.13/Test/src/Test.jl:1929 [inlined]
[19] macro expansion
@ ~/.julia/packages/Zarr/3QSdj/test/storage.jl:177 [inlined]
[20] macro expansion
@ /opt/julia/share/julia/stdlib/v1.13/Test/src/Test.jl:742 [inlined]
AWS S3 Storage: Error During Test at /home/pkgeval/.julia/packages/Zarr/3QSdj/test/storage.jl:173
Got exception outside of a @test
AWS.AWSExceptions.AWSException: PermanentRedirect -- The bucket you are attempting to access must be addressed using the specified endpoint. Please send all future requests to this endpoint.
HTTP.Exceptions.StatusError(301, "GET", "/zarr-demo?list-type=2&prefix=store%2Ffoo%2F.zarray&delimiter=&max-keys=1", HTTP.Messages.Response:
"""
HTTP/1.1 301 Moved Permanently
x-amz-bucket-region: us-east-1
x-amz-request-id: ZEHSNN9NNPVVJ7M4
x-amz-id-2: ldNwQngZHRn9s3/JO1g8Syo8oOF4aHo9fR80sEgZMsD958kQxkV+JcZfFR62flRvFFGOfAFUxpeRAZMlG0znwtC4dtwTD/CDIBffebaJiic=
Content-Type: application/xml
Transfer-Encoding: chunked
Date: Tue, 12 Aug 2025 19:06:01 GMT
Server: AmazonS3
[Message Body was streamed]""")
PermanentRedirect
The bucket you are attempting to access must be addressed using the specified endpoint. Please send all future requests to this endpoint.s3.amazonaws.comzarr-demoZEHSNN9NNPVVJ7M4ldNwQngZHRn9s3/JO1g8Syo8oOF4aHo9fR80sEgZMsD958kQxkV+JcZfFR62flRvFFGOfAFUxpeRAZMlG0znwtC4dtwTD/CDIBffebaJiic=
Stacktrace:
[1] (::AWS.var"#42#43"{AWS.AWSConfig, AWS.Request, IOBuffer, Vector{Int64}})()
@ AWS ~/.julia/packages/AWS/ZEOyZ/src/utilities/request.jl:139
[2] (::AWS.var"#45#46"{AWS.var"#42#43"{AWS.AWSConfig, AWS.Request, IOBuffer, Vector{Int64}}, IOBuffer})()
@ AWS ~/.julia/packages/AWS/ZEOyZ/src/utilities/request.jl:146
[3] (::Base.var"#46#47"{Base.var"#48#49"{AWS.AWSExponentialBackoff, AWS.var"#47#48"{AWS.AWSConfig, Vector{String}, Vector{String}, Int64}, AWS.var"#45#46"{AWS.var"#42#43"{AWS.AWSConfig, AWS.Request, IOBuffer, Vector{Int64}}, IOBuffer}}})(; kwargs::@Kwargs{})
@ Base ./error.jl:311
[4] (::Base.var"#46#47"{Base.var"#48#49"{AWS.AWSExponentialBackoff, AWS.var"#47#48"{AWS.AWSConfig, Vector{String}, Vector{String}, Int64}, AWS.var"#45#46"{AWS.var"#42#43"{AWS.AWSConfig, AWS.Request, IOBuffer, Vector{Int64}}, IOBuffer}}})()
@ Base ./error.jl:306
[5] submit_request(aws::AWS.AWSConfig, request::AWS.Request; return_headers::Nothing)
@ AWS ~/.julia/packages/AWS/ZEOyZ/src/utilities/request.jl:197
[6] kwcall(::@NamedTuple{return_headers::Nothing}, ::typeof(AWS.submit_request), aws::AWS.AWSConfig, request::AWS.Request)
@ AWS ~/.julia/packages/AWS/ZEOyZ/src/utilities/request.jl:99
[7] (::AWS.RestXMLService)(request_method::String, request_uri::String, args::Dict{String, Any}; aws_config::AWS.AWSConfig, feature_set::AWS.FeatureSet)
@ AWS ~/.julia/packages/AWS/ZEOyZ/src/AWS.jl:352
[8] RestXMLService
@ ~/.julia/packages/AWS/ZEOyZ/src/AWS.jl:316 [inlined]
[9] #list_objects_v2#132
@ ~/.julia/packages/AWS/ZEOyZ/src/services/s3.jl:4839 [inlined]
[10] list_objects_v2
@ ~/.julia/packages/AWS/ZEOyZ/src/services/s3.jl:4836 [inlined]
[11] _s3_exists_file(aws::AWS.AWSConfig, bucket::String, path::String)
@ AWSS3 ~/.julia/packages/AWSS3/A97Rh/src/AWSS3.jl:263
[12] s3_exists_unversioned
@ ~/.julia/packages/AWSS3/A97Rh/src/AWSS3.jl:358 [inlined]
[13] #s3_exists#13
@ ~/.julia/packages/AWSS3/A97Rh/src/AWSS3.jl:388 [inlined]
[14] s3_exists(aws::AWS.AWSConfig, bucket::String, path::String)
@ AWSS3 ~/.julia/packages/AWSS3/A97Rh/src/AWSS3.jl:384
[15] isinitialized(s::S3Store, i::String)
@ Zarr ~/.julia/packages/Zarr/3QSdj/src/Storage/s3store.jl:52
[16] is_zarray
@ ~/.julia/packages/Zarr/3QSdj/src/Storage/Storage.jl:83 [inlined]
[17] zopen_noerr(s::S3Store, mode::String; consolidated::Bool, path::String, lru::Int64, fill_as_missing::Bool)
@ Zarr ~/.julia/packages/Zarr/3QSdj/src/ZGroup.jl:51
[18] kwcall(::@NamedTuple{consolidated::Bool, path::String, lru::Int64, fill_as_missing::Bool}, ::typeof(Zarr.zopen_noerr), s::S3Store, mode::String)
@ Zarr ~/.julia/packages/Zarr/3QSdj/src/ZGroup.jl:42
[19] #zopen#70
@ ~/.julia/packages/Zarr/3QSdj/src/ZGroup.jl:95 [inlined]
[20] zopen
@ ~/.julia/packages/Zarr/3QSdj/src/ZGroup.jl:89 [inlined]
[21] kwcall(::@NamedTuple{path::String}, ::typeof(zopen), s::S3Store)
@ Zarr ~/.julia/packages/Zarr/3QSdj/src/ZGroup.jl:89
[22] top-level scope
@ ~/.julia/packages/Zarr/3QSdj/test/storage.jl:174
[23] macro expansion
@ /opt/julia/share/julia/stdlib/v1.13/Test/src/Test.jl:1929 [inlined]
[24] macro expansion
@ ~/.julia/packages/Zarr/3QSdj/test/storage.jl:178 [inlined]
[25] include(mapexpr::Function, mod::Module, _path::String)
@ Base ./Base.jl:312
[26] top-level scope
@ ~/.julia/packages/Zarr/3QSdj/test/runtests.jl:17
[27] macro expansion
@ /opt/julia/share/julia/stdlib/v1.13/Test/src/Test.jl:1929 [inlined]
[28] macro expansion
@ ~/.julia/packages/Zarr/3QSdj/test/runtests.jl:260 [inlined]
[29] include(mapexpr::Function, mod::Module, _path::String)
@ Base ./Base.jl:312
[30] top-level scope
@ none:6
[31] eval(m::Module, e::Any)
@ Core ./boot.jl:489
[32] exec_options(opts::Base.JLOptions)
@ Base ./client.jl:286
[33] _start()
@ Base ./client.jl:553
[ Info: Listening on: 127.0.0.1:45559, thread id: 1
[ Info: Server on 127.0.0.1:45559 closing
[ Info: Listening on: 127.0.0.1:44325, thread id: 1
[ Info: Server on 127.0.0.1:44325 closing
[ Info: Installing zarr via the Conda zarr package...
[ Info: Running `conda install -q -y zarr` in root environment
Channels:
- conda-forge
Platform: linux-64
Collecting package metadata (repodata.json): ...working... done
Solving environment: ...working... done
## Package Plan ##
environment location: /home/pkgeval/.julia/conda/3/x86_64
added / updated specs:
- zarr
The following packages will be downloaded:
package | build
---------------------------|-----------------
crc32c-2.7.1 | py312h66e93f0_1 49 KB conda-forge
deprecated-1.2.18 | pyhd8ed1ab_0 14 KB conda-forge
donfig-0.8.1.post1 | pyhd8ed1ab_1 22 KB conda-forge
msgpack-python-1.1.1 | py312h68727a3_0 101 KB conda-forge
numcodecs-0.16.1 | py312hf9745cd_0 797 KB conda-forge
pyyaml-6.0.2 | py312h178313f_2 202 KB conda-forge
typing_extensions-4.14.1 | pyhe01879c_0 50 KB conda-forge
wrapt-1.17.3 | py312h4c3975b_0 63 KB conda-forge
yaml-0.2.5 | h280c20c_3 83 KB conda-forge
zarr-3.1.1 | pyhe01879c_0 262 KB conda-forge
------------------------------------------------------------
Total: 1.6 MB
The following NEW packages will be INSTALLED:
crc32c conda-forge/linux-64::crc32c-2.7.1-py312h66e93f0_1
deprecated conda-forge/noarch::deprecated-1.2.18-pyhd8ed1ab_0
donfig conda-forge/noarch::donfig-0.8.1.post1-pyhd8ed1ab_1
msgpack-python conda-forge/linux-64::msgpack-python-1.1.1-py312h68727a3_0
numcodecs conda-forge/linux-64::numcodecs-0.16.1-py312hf9745cd_0
pyyaml conda-forge/linux-64::pyyaml-6.0.2-py312h178313f_2
typing_extensions conda-forge/noarch::typing_extensions-4.14.1-pyhe01879c_0
wrapt conda-forge/linux-64::wrapt-1.17.3-py312h4c3975b_0
yaml conda-forge/linux-64::yaml-0.2.5-h280c20c_3
zarr conda-forge/noarch::zarr-3.1.1-pyhe01879c_0
Preparing transaction: ...working... done
Verifying transaction: ...working... done
Executing transaction: ...working... done
Python zarr implementation: Error During Test at /home/pkgeval/.julia/packages/Zarr/3QSdj/test/python.jl:6
Got exception outside of a @test
PyError ($(Expr(:escape, :(ccall(#= /home/pkgeval/.julia/packages/PyCall/1gn3u/src/pyeval.jl:38 =# @pysym(:PyEval_EvalCode), PyPtr, (PyPtr, PyPtr, PyPtr), o, globals, locals)))))
ValueError("No Zarr data type found that matches {'name': '
const Py_single_input = 256 # from Python.h
^^^^^^^^^^^^^^^^^^^^^^^
File "/home/pkgeval/.julia/conda/3/x86_64/lib/python3.12/site-packages/zarr/core/group.py", line 1892, in __getitem__
obj = self._sync(self._async_group.getitem(path))
^^^^^^^^^^^^^^^^^^^^^^^^^^^^^^^^^^^^^^^^^^^
File "/home/pkgeval/.julia/conda/3/x86_64/lib/python3.12/site-packages/zarr/core/sync.py", line 208, in _sync
return sync(
^^^^^
File "/home/pkgeval/.julia/conda/3/x86_64/lib/python3.12/site-packages/zarr/core/sync.py", line 163, in sync
raise return_result
File "/home/pkgeval/.julia/conda/3/x86_64/lib/python3.12/site-packages/zarr/core/sync.py", line 119, in _runner
return await coro
^^^^^^^^^^
File "/home/pkgeval/.julia/conda/3/x86_64/lib/python3.12/site-packages/zarr/core/group.py", line 704, in getitem
return await get_node(
^^^^^^^^^^^^^^^
File "/home/pkgeval/.julia/conda/3/x86_64/lib/python3.12/site-packages/zarr/core/group.py", line 3655, in get_node
return await _get_node_v2(store=store, path=path)
^^^^^^^^^^^^^^^^^^^^^^^^^^^^^^^^^^^^^^^^^^
File "/home/pkgeval/.julia/conda/3/x86_64/lib/python3.12/site-packages/zarr/core/group.py", line 3610, in _get_node_v2
metadata = await _read_metadata_v2(store=store, path=path)
^^^^^^^^^^^^^^^^^^^^^^^^^^^^^^^^^^^^^^^^^^^^^^^
File "/home/pkgeval/.julia/conda/3/x86_64/lib/python3.12/site-packages/zarr/core/group.py", line 3502, in _read_metadata_v2
return _build_metadata_v2(zmeta, zattrs)
^^^^^^^^^^^^^^^^^^^^^^^^^^^^^^^^^
File "/home/pkgeval/.julia/conda/3/x86_64/lib/python3.12/site-packages/zarr/core/group.py", line 3558, in _build_metadata_v2
return ArrayV2Metadata.from_dict(zarr_json | {"attributes": attrs_json})
^^^^^^^^^^^^^^^^^^^^^^^^^^^^^^^^^^^^^^^^^^^^^^^^^^^^^^^^^^^^^^^^^
File "/home/pkgeval/.julia/conda/3/x86_64/lib/python3.12/site-packages/zarr/core/metadata/v2.py", line 165, in from_dict
dtype = get_data_type_from_json(dtype_spec, zarr_format=2)
^^^^^^^^^^^^^^^^^^^^^^^^^^^^^^^^^^^^^^^^^^^^^^^^^^
File "/home/pkgeval/.julia/conda/3/x86_64/lib/python3.12/site-packages/zarr/core/dtype/__init__.py", line 184, in get_data_type_from_json
return data_type_registry.match_json(dtype_spec, zarr_format=zarr_format)
^^^^^^^^^^^^^^^^^^^^^^^^^^^^^^^^^^^^^^^^^^^^^^^^^^^^^^^^^^^^^^^^^^
File "/home/pkgeval/.julia/conda/3/x86_64/lib/python3.12/site-packages/zarr/core/dtype/registry.py", line 208, in match_json
raise ValueError(f"No Zarr data type found that matches {data!r}")
Stacktrace:
[1] pyerr_check(msg::String, val::Nothing)
@ PyCall ~/.julia/packages/PyCall/1gn3u/src/exception.jl:75
[2] pyerr_check
@ ~/.julia/packages/PyCall/1gn3u/src/exception.jl:79 [inlined]
[3] _handle_error(msg::String)
@ PyCall ~/.julia/packages/PyCall/1gn3u/src/exception.jl:96
[4] macro expansion
@ ~/.julia/packages/PyCall/1gn3u/src/exception.jl:110 [inlined]
[5] #pyeval_##0
@ ~/.julia/packages/PyCall/1gn3u/src/pyeval.jl:38 [inlined]
[6] disable_sigint
@ ./c.jl:167 [inlined]
[7] pyeval_(s::String, globals::PyDict{String, PyObject, true}, locals::PyDict{String, PyObject, true}, input_type::Int64, fname::String)
@ PyCall ~/.julia/packages/PyCall/1gn3u/src/pyeval.jl:37
[8] top-level scope
@ ~/.julia/packages/Zarr/3QSdj/test/python.jl:8
[9] macro expansion
@ /opt/julia/share/julia/stdlib/v1.13/Test/src/Test.jl:1929 [inlined]
[10] macro expansion
@ ~/.julia/packages/Zarr/3QSdj/test/python.jl:82 [inlined]
[11] macro expansion
@ ~/.julia/packages/PyCall/1gn3u/src/pyeval.jl:230 [inlined]
[12] include(mapexpr::Function, mod::Module, _path::String)
@ Base ./Base.jl:312
[13] top-level scope
@ ~/.julia/packages/Zarr/3QSdj/test/runtests.jl:17
[14] macro expansion
@ /opt/julia/share/julia/stdlib/v1.13/Test/src/Test.jl:1929 [inlined]
[15] macro expansion
@ ~/.julia/packages/Zarr/3QSdj/test/runtests.jl:264 [inlined]
[16] include(mapexpr::Function, mod::Module, _path::String)
@ Base ./Base.jl:312
[17] top-level scope
@ none:6
[18] eval(m::Module, e::Any)
@ Core ./boot.jl:489
[19] exec_options(opts::Base.JLOptions)
@ Base ./client.jl:286
[20] _start()
@ Base ./client.jl:553
Python datetime types: Error During Test at /home/pkgeval/.julia/packages/Zarr/3QSdj/test/runtests.jl:10
Test threw exception
Expression: convert(Bool, $(Expr(:escape, :(np.datetime64(((g_julia[unit])[1] |> DateTime) |> string) == get(getproperty(g_python, unit), 0)))))
KeyError: key "Week" not found
Stacktrace:
[1] __getproperty
@ ~/.julia/packages/PyCall/1gn3u/src/PyCall.jl:313 [inlined]
[2] getproperty(o::PyObject, s::String)
@ PyCall ~/.julia/packages/PyCall/1gn3u/src/PyCall.jl:317
[3] macro expansion
@ /opt/julia/share/julia/stdlib/v1.13/Test/src/Test.jl:742 [inlined]
[4] macro expansion
@ ~/.julia/packages/Zarr/3QSdj/test/runtests.jl:10 [inlined]
[5] macro expansion
@ ~/.julia/packages/Zarr/3QSdj/test/python.jl:242 [inlined]
[6] macro expansion
@ /opt/julia/share/julia/stdlib/v1.13/Test/src/Test.jl:1929 [inlined]
[7] top-level scope
@ ~/.julia/packages/Zarr/3QSdj/test/python.jl:208
Python datetime types: Error During Test at /home/pkgeval/.julia/packages/Zarr/3QSdj/test/runtests.jl:10
Test threw exception
Expression: convert(Bool, $(Expr(:escape, :(np.datetime64(((g_julia[unit])[10] |> DateTime) |> string) == get(getproperty(g_python, unit), 9)))))
KeyError: key "Week" not found
Stacktrace:
[1] __getproperty
@ ~/.julia/packages/PyCall/1gn3u/src/PyCall.jl:313 [inlined]
[2] getproperty(o::PyObject, s::String)
@ PyCall ~/.julia/packages/PyCall/1gn3u/src/PyCall.jl:317
[3] macro expansion
@ /opt/julia/share/julia/stdlib/v1.13/Test/src/Test.jl:742 [inlined]
[4] macro expansion
@ ~/.julia/packages/Zarr/3QSdj/test/runtests.jl:10 [inlined]
[5] macro expansion
@ ~/.julia/packages/Zarr/3QSdj/test/python.jl:243 [inlined]
[6] macro expansion
@ /opt/julia/share/julia/stdlib/v1.13/Test/src/Test.jl:1929 [inlined]
[7] top-level scope
@ ~/.julia/packages/Zarr/3QSdj/test/python.jl:208
Python datetime types: Error During Test at /home/pkgeval/.julia/packages/Zarr/3QSdj/test/runtests.jl:10
Test threw exception
Expression: convert(Bool, $(Expr(:escape, :(np.datetime64(((g_julia[unit])[100] |> DateTime) |> string) == get(getproperty(g_python, unit), 99)))))
KeyError: key "Week" not found
Stacktrace:
[1] __getproperty
@ ~/.julia/packages/PyCall/1gn3u/src/PyCall.jl:313 [inlined]
[2] getproperty(o::PyObject, s::String)
@ PyCall ~/.julia/packages/PyCall/1gn3u/src/PyCall.jl:317
[3] macro expansion
@ /opt/julia/share/julia/stdlib/v1.13/Test/src/Test.jl:742 [inlined]
[4] macro expansion
@ ~/.julia/packages/Zarr/3QSdj/test/runtests.jl:10 [inlined]
[5] macro expansion
@ ~/.julia/packages/Zarr/3QSdj/test/python.jl:244 [inlined]
[6] macro expansion
@ /opt/julia/share/julia/stdlib/v1.13/Test/src/Test.jl:1929 [inlined]
[7] top-level scope
@ ~/.julia/packages/Zarr/3QSdj/test/python.jl:208
Python datetime types: Error During Test at /home/pkgeval/.julia/packages/Zarr/3QSdj/test/runtests.jl:10
Test threw exception
Expression: convert(Bool, $(Expr(:escape, :(np.datetime64(((g_julia[unit])[1] |> DateTime) |> string) == get(getproperty(g_python, unit), 0)))))
KeyError: key "Day" not found
Stacktrace:
[1] __getproperty
@ ~/.julia/packages/PyCall/1gn3u/src/PyCall.jl:313 [inlined]
[2] getproperty(o::PyObject, s::String)
@ PyCall ~/.julia/packages/PyCall/1gn3u/src/PyCall.jl:317
[3] macro expansion
@ /opt/julia/share/julia/stdlib/v1.13/Test/src/Test.jl:742 [inlined]
[4] macro expansion
@ ~/.julia/packages/Zarr/3QSdj/test/runtests.jl:10 [inlined]
[5] macro expansion
@ ~/.julia/packages/Zarr/3QSdj/test/python.jl:242 [inlined]
[6] macro expansion
@ /opt/julia/share/julia/stdlib/v1.13/Test/src/Test.jl:1929 [inlined]
[7] top-level scope
@ ~/.julia/packages/Zarr/3QSdj/test/python.jl:208
Python datetime types: Error During Test at /home/pkgeval/.julia/packages/Zarr/3QSdj/test/runtests.jl:10
Test threw exception
Expression: convert(Bool, $(Expr(:escape, :(np.datetime64(((g_julia[unit])[10] |> DateTime) |> string) == get(getproperty(g_python, unit), 9)))))
KeyError: key "Day" not found
Stacktrace:
[1] __getproperty
@ ~/.julia/packages/PyCall/1gn3u/src/PyCall.jl:313 [inlined]
[2] getproperty(o::PyObject, s::String)
@ PyCall ~/.julia/packages/PyCall/1gn3u/src/PyCall.jl:317
[3] macro expansion
@ /opt/julia/share/julia/stdlib/v1.13/Test/src/Test.jl:742 [inlined]
[4] macro expansion
@ ~/.julia/packages/Zarr/3QSdj/test/runtests.jl:10 [inlined]
[5] macro expansion
@ ~/.julia/packages/Zarr/3QSdj/test/python.jl:243 [inlined]
[6] macro expansion
@ /opt/julia/share/julia/stdlib/v1.13/Test/src/Test.jl:1929 [inlined]
[7] top-level scope
@ ~/.julia/packages/Zarr/3QSdj/test/python.jl:208
Python datetime types: Error During Test at /home/pkgeval/.julia/packages/Zarr/3QSdj/test/runtests.jl:10
Test threw exception
Expression: convert(Bool, $(Expr(:escape, :(np.datetime64(((g_julia[unit])[100] |> DateTime) |> string) == get(getproperty(g_python, unit), 99)))))
KeyError: key "Day" not found
Stacktrace:
[1] __getproperty
@ ~/.julia/packages/PyCall/1gn3u/src/PyCall.jl:313 [inlined]
[2] getproperty(o::PyObject, s::String)
@ PyCall ~/.julia/packages/PyCall/1gn3u/src/PyCall.jl:317
[3] macro expansion
@ /opt/julia/share/julia/stdlib/v1.13/Test/src/Test.jl:742 [inlined]
[4] macro expansion
@ ~/.julia/packages/Zarr/3QSdj/test/runtests.jl:10 [inlined]
[5] macro expansion
@ ~/.julia/packages/Zarr/3QSdj/test/python.jl:244 [inlined]
[6] macro expansion
@ /opt/julia/share/julia/stdlib/v1.13/Test/src/Test.jl:1929 [inlined]
[7] top-level scope
@ ~/.julia/packages/Zarr/3QSdj/test/python.jl:208
Python datetime types: Error During Test at /home/pkgeval/.julia/packages/Zarr/3QSdj/test/runtests.jl:10
Test threw exception
Expression: convert(Bool, $(Expr(:escape, :(np.datetime64(((g_julia[unit])[1] |> DateTime) |> string) == get(getproperty(g_python, unit), 0)))))
KeyError: key "Hour" not found
Stacktrace:
[1] __getproperty
@ ~/.julia/packages/PyCall/1gn3u/src/PyCall.jl:313 [inlined]
[2] getproperty(o::PyObject, s::String)
@ PyCall ~/.julia/packages/PyCall/1gn3u/src/PyCall.jl:317
[3] macro expansion
@ /opt/julia/share/julia/stdlib/v1.13/Test/src/Test.jl:742 [inlined]
[4] macro expansion
@ ~/.julia/packages/Zarr/3QSdj/test/runtests.jl:10 [inlined]
[5] macro expansion
@ ~/.julia/packages/Zarr/3QSdj/test/python.jl:242 [inlined]
[6] macro expansion
@ /opt/julia/share/julia/stdlib/v1.13/Test/src/Test.jl:1929 [inlined]
[7] top-level scope
@ ~/.julia/packages/Zarr/3QSdj/test/python.jl:208
Python datetime types: Error During Test at /home/pkgeval/.julia/packages/Zarr/3QSdj/test/runtests.jl:10
Test threw exception
Expression: convert(Bool, $(Expr(:escape, :(np.datetime64(((g_julia[unit])[10] |> DateTime) |> string) == get(getproperty(g_python, unit), 9)))))
KeyError: key "Hour" not found
Stacktrace:
[1] __getproperty
@ ~/.julia/packages/PyCall/1gn3u/src/PyCall.jl:313 [inlined]
[2] getproperty(o::PyObject, s::String)
@ PyCall ~/.julia/packages/PyCall/1gn3u/src/PyCall.jl:317
[3] macro expansion
@ /opt/julia/share/julia/stdlib/v1.13/Test/src/Test.jl:742 [inlined]
[4] macro expansion
@ ~/.julia/packages/Zarr/3QSdj/test/runtests.jl:10 [inlined]
[5] macro expansion
@ ~/.julia/packages/Zarr/3QSdj/test/python.jl:243 [inlined]
[6] macro expansion
@ /opt/julia/share/julia/stdlib/v1.13/Test/src/Test.jl:1929 [inlined]
[7] top-level scope
@ ~/.julia/packages/Zarr/3QSdj/test/python.jl:208
Python datetime types: Error During Test at /home/pkgeval/.julia/packages/Zarr/3QSdj/test/runtests.jl:10
Test threw exception
Expression: convert(Bool, $(Expr(:escape, :(np.datetime64(((g_julia[unit])[100] |> DateTime) |> string) == get(getproperty(g_python, unit), 99)))))
KeyError: key "Hour" not found
Stacktrace:
[1] __getproperty
@ ~/.julia/packages/PyCall/1gn3u/src/PyCall.jl:313 [inlined]
[2] getproperty(o::PyObject, s::String)
@ PyCall ~/.julia/packages/PyCall/1gn3u/src/PyCall.jl:317
[3] macro expansion
@ /opt/julia/share/julia/stdlib/v1.13/Test/src/Test.jl:742 [inlined]
[4] macro expansion
@ ~/.julia/packages/Zarr/3QSdj/test/runtests.jl:10 [inlined]
[5] macro expansion
@ ~/.julia/packages/Zarr/3QSdj/test/python.jl:244 [inlined]
[6] macro expansion
@ /opt/julia/share/julia/stdlib/v1.13/Test/src/Test.jl:1929 [inlined]
[7] top-level scope
@ ~/.julia/packages/Zarr/3QSdj/test/python.jl:208
Python datetime types: Error During Test at /home/pkgeval/.julia/packages/Zarr/3QSdj/test/runtests.jl:10
Test threw exception
Expression: convert(Bool, $(Expr(:escape, :(np.datetime64(((g_julia[unit])[1] |> DateTime) |> string) == get(getproperty(g_python, unit), 0)))))
KeyError: key "Minute" not found
Stacktrace:
[1] __getproperty
@ ~/.julia/packages/PyCall/1gn3u/src/PyCall.jl:313 [inlined]
[2] getproperty(o::PyObject, s::String)
@ PyCall ~/.julia/packages/PyCall/1gn3u/src/PyCall.jl:317
[3] macro expansion
@ /opt/julia/share/julia/stdlib/v1.13/Test/src/Test.jl:742 [inlined]
[4] macro expansion
@ ~/.julia/packages/Zarr/3QSdj/test/runtests.jl:10 [inlined]
[5] macro expansion
@ ~/.julia/packages/Zarr/3QSdj/test/python.jl:242 [inlined]
[6] macro expansion
@ /opt/julia/share/julia/stdlib/v1.13/Test/src/Test.jl:1929 [inlined]
[7] top-level scope
@ ~/.julia/packages/Zarr/3QSdj/test/python.jl:208
Python datetime types: Error During Test at /home/pkgeval/.julia/packages/Zarr/3QSdj/test/runtests.jl:10
Test threw exception
Expression: convert(Bool, $(Expr(:escape, :(np.datetime64(((g_julia[unit])[10] |> DateTime) |> string) == get(getproperty(g_python, unit), 9)))))
KeyError: key "Minute" not found
Stacktrace:
[1] __getproperty
@ ~/.julia/packages/PyCall/1gn3u/src/PyCall.jl:313 [inlined]
[2] getproperty(o::PyObject, s::String)
@ PyCall ~/.julia/packages/PyCall/1gn3u/src/PyCall.jl:317
[3] macro expansion
@ /opt/julia/share/julia/stdlib/v1.13/Test/src/Test.jl:742 [inlined]
[4] macro expansion
@ ~/.julia/packages/Zarr/3QSdj/test/runtests.jl:10 [inlined]
[5] macro expansion
@ ~/.julia/packages/Zarr/3QSdj/test/python.jl:243 [inlined]
[6] macro expansion
@ /opt/julia/share/julia/stdlib/v1.13/Test/src/Test.jl:1929 [inlined]
[7] top-level scope
@ ~/.julia/packages/Zarr/3QSdj/test/python.jl:208
Python datetime types: Error During Test at /home/pkgeval/.julia/packages/Zarr/3QSdj/test/runtests.jl:10
Test threw exception
Expression: convert(Bool, $(Expr(:escape, :(np.datetime64(((g_julia[unit])[100] |> DateTime) |> string) == get(getproperty(g_python, unit), 99)))))
KeyError: key "Minute" not found
Stacktrace:
[1] __getproperty
@ ~/.julia/packages/PyCall/1gn3u/src/PyCall.jl:313 [inlined]
[2] getproperty(o::PyObject, s::String)
@ PyCall ~/.julia/packages/PyCall/1gn3u/src/PyCall.jl:317
[3] macro expansion
@ /opt/julia/share/julia/stdlib/v1.13/Test/src/Test.jl:742 [inlined]
[4] macro expansion
@ ~/.julia/packages/Zarr/3QSdj/test/runtests.jl:10 [inlined]
[5] macro expansion
@ ~/.julia/packages/Zarr/3QSdj/test/python.jl:244 [inlined]
[6] macro expansion
@ /opt/julia/share/julia/stdlib/v1.13/Test/src/Test.jl:1929 [inlined]
[7] top-level scope
@ ~/.julia/packages/Zarr/3QSdj/test/python.jl:208
Python datetime types: Error During Test at /home/pkgeval/.julia/packages/Zarr/3QSdj/test/runtests.jl:10
Test threw exception
Expression: convert(Bool, $(Expr(:escape, :(np.datetime64(((g_julia[unit])[1] |> DateTime) |> string) == get(getproperty(g_python, unit), 0)))))
KeyError: key "Second" not found
Stacktrace:
[1] __getproperty
@ ~/.julia/packages/PyCall/1gn3u/src/PyCall.jl:313 [inlined]
[2] getproperty(o::PyObject, s::String)
@ PyCall ~/.julia/packages/PyCall/1gn3u/src/PyCall.jl:317
[3] macro expansion
@ /opt/julia/share/julia/stdlib/v1.13/Test/src/Test.jl:742 [inlined]
[4] macro expansion
@ ~/.julia/packages/Zarr/3QSdj/test/runtests.jl:10 [inlined]
[5] macro expansion
@ ~/.julia/packages/Zarr/3QSdj/test/python.jl:242 [inlined]
[6] macro expansion
@ /opt/julia/share/julia/stdlib/v1.13/Test/src/Test.jl:1929 [inlined]
[7] top-level scope
@ ~/.julia/packages/Zarr/3QSdj/test/python.jl:208
Python datetime types: Error During Test at /home/pkgeval/.julia/packages/Zarr/3QSdj/test/runtests.jl:10
Test threw exception
Expression: convert(Bool, $(Expr(:escape, :(np.datetime64(((g_julia[unit])[10] |> DateTime) |> string) == get(getproperty(g_python, unit), 9)))))
KeyError: key "Second" not found
Stacktrace:
[1] __getproperty
@ ~/.julia/packages/PyCall/1gn3u/src/PyCall.jl:313 [inlined]
[2] getproperty(o::PyObject, s::String)
@ PyCall ~/.julia/packages/PyCall/1gn3u/src/PyCall.jl:317
[3] macro expansion
@ /opt/julia/share/julia/stdlib/v1.13/Test/src/Test.jl:742 [inlined]
[4] macro expansion
@ ~/.julia/packages/Zarr/3QSdj/test/runtests.jl:10 [inlined]
[5] macro expansion
@ ~/.julia/packages/Zarr/3QSdj/test/python.jl:243 [inlined]
[6] macro expansion
@ /opt/julia/share/julia/stdlib/v1.13/Test/src/Test.jl:1929 [inlined]
[7] top-level scope
@ ~/.julia/packages/Zarr/3QSdj/test/python.jl:208
Python datetime types: Error During Test at /home/pkgeval/.julia/packages/Zarr/3QSdj/test/runtests.jl:10
Test threw exception
Expression: convert(Bool, $(Expr(:escape, :(np.datetime64(((g_julia[unit])[100] |> DateTime) |> string) == get(getproperty(g_python, unit), 99)))))
KeyError: key "Second" not found
Stacktrace:
[1] __getproperty
@ ~/.julia/packages/PyCall/1gn3u/src/PyCall.jl:313 [inlined]
[2] getproperty(o::PyObject, s::String)
@ PyCall ~/.julia/packages/PyCall/1gn3u/src/PyCall.jl:317
[3] macro expansion
@ /opt/julia/share/julia/stdlib/v1.13/Test/src/Test.jl:742 [inlined]
[4] macro expansion
@ ~/.julia/packages/Zarr/3QSdj/test/runtests.jl:10 [inlined]
[5] macro expansion
@ ~/.julia/packages/Zarr/3QSdj/test/python.jl:244 [inlined]
[6] macro expansion
@ /opt/julia/share/julia/stdlib/v1.13/Test/src/Test.jl:1929 [inlined]
[7] top-level scope
@ ~/.julia/packages/Zarr/3QSdj/test/python.jl:208
Python datetime types: Error During Test at /home/pkgeval/.julia/packages/Zarr/3QSdj/test/runtests.jl:10
Test threw exception
Expression: convert(Bool, $(Expr(:escape, :(np.datetime64(((g_julia[unit])[1] |> DateTime) |> string) == get(getproperty(g_python, unit), 0)))))
KeyError: key "Millisecond" not found
Stacktrace:
[1] __getproperty
@ ~/.julia/packages/PyCall/1gn3u/src/PyCall.jl:313 [inlined]
[2] getproperty(o::PyObject, s::String)
@ PyCall ~/.julia/packages/PyCall/1gn3u/src/PyCall.jl:317
[3] macro expansion
@ /opt/julia/share/julia/stdlib/v1.13/Test/src/Test.jl:742 [inlined]
[4] macro expansion
@ ~/.julia/packages/Zarr/3QSdj/test/runtests.jl:10 [inlined]
[5] macro expansion
@ ~/.julia/packages/Zarr/3QSdj/test/python.jl:242 [inlined]
[6] macro expansion
@ /opt/julia/share/julia/stdlib/v1.13/Test/src/Test.jl:1929 [inlined]
[7] top-level scope
@ ~/.julia/packages/Zarr/3QSdj/test/python.jl:208
Python datetime types: Error During Test at /home/pkgeval/.julia/packages/Zarr/3QSdj/test/runtests.jl:10
Test threw exception
Expression: convert(Bool, $(Expr(:escape, :(np.datetime64(((g_julia[unit])[10] |> DateTime) |> string) == get(getproperty(g_python, unit), 9)))))
KeyError: key "Millisecond" not found
Stacktrace:
[1] __getproperty
@ ~/.julia/packages/PyCall/1gn3u/src/PyCall.jl:313 [inlined]
[2] getproperty(o::PyObject, s::String)
@ PyCall ~/.julia/packages/PyCall/1gn3u/src/PyCall.jl:317
[3] macro expansion
@ /opt/julia/share/julia/stdlib/v1.13/Test/src/Test.jl:742 [inlined]
[4] macro expansion
@ ~/.julia/packages/Zarr/3QSdj/test/runtests.jl:10 [inlined]
[5] macro expansion
@ ~/.julia/packages/Zarr/3QSdj/test/python.jl:243 [inlined]
[6] macro expansion
@ /opt/julia/share/julia/stdlib/v1.13/Test/src/Test.jl:1929 [inlined]
[7] top-level scope
@ ~/.julia/packages/Zarr/3QSdj/test/python.jl:208
Python datetime types: Error During Test at /home/pkgeval/.julia/packages/Zarr/3QSdj/test/runtests.jl:10
Test threw exception
Expression: convert(Bool, $(Expr(:escape, :(np.datetime64(((g_julia[unit])[100] |> DateTime) |> string) == get(getproperty(g_python, unit), 99)))))
KeyError: key "Millisecond" not found
Stacktrace:
[1] __getproperty
@ ~/.julia/packages/PyCall/1gn3u/src/PyCall.jl:313 [inlined]
[2] getproperty(o::PyObject, s::String)
@ PyCall ~/.julia/packages/PyCall/1gn3u/src/PyCall.jl:317
[3] macro expansion
@ /opt/julia/share/julia/stdlib/v1.13/Test/src/Test.jl:742 [inlined]
[4] macro expansion
@ ~/.julia/packages/Zarr/3QSdj/test/runtests.jl:10 [inlined]
[5] macro expansion
@ ~/.julia/packages/Zarr/3QSdj/test/python.jl:244 [inlined]
[6] macro expansion
@ /opt/julia/share/julia/stdlib/v1.13/Test/src/Test.jl:1929 [inlined]
[7] top-level scope
@ ~/.julia/packages/Zarr/3QSdj/test/python.jl:208
Test Summary: | Pass Error Total Time
Zarr | 238 23 261 7m21.1s
ZArray | 35 35 10.0s
Groups | 5 5 0.7s
Metadata | 38 38 1.3s
getindex/setindex | 13 13 20.2s
resize | 12 12 2.3s
string array getindex/setindex | 4 4 8.6s
ragged arrays | 5 5 9.6s
Fillvalue as missing | 8 8 6.6s
Path Normalization | 5 5 0.0s
DirectoryStore | 28 28 1.6s
DictStore | 24 24 0.9s
Minio S3 storage | 1 1 53.9s
AWS S3 Storage | 3 3 13.9s
GCS Storage | 24 24 14.0s
HTTP Storage | 5 5 16.7s
Zip Storage | 25 25 19.8s
Python zarr implementation | 3 1 4 3m55.7s
Python datetime types | 4 18 22 20.2s
RNG of the outermost testset: Random.Xoshiro(0x27cd7039096b6131, 0x05e8f7a435e883d3, 0x38b1ce3c224e079f, 0xed4dc1a0c10bfad0, 0xd221a9b79dfeee75)
ERROR: LoadError: Some tests did not pass: 238 passed, 0 failed, 23 errored, 0 broken.
in expression starting at /home/pkgeval/.julia/packages/Zarr/3QSdj/test/runtests.jl:14
Testing failed after 443.44s
ERROR: LoadError: Package Zarr errored during testing
Stacktrace:
[1] pkgerror(msg::String)
@ Pkg.Types /opt/julia/share/julia/stdlib/v1.13/Pkg/src/Types.jl:68
[2] test(ctx::Pkg.Types.Context, pkgs::Vector{PackageSpec}; coverage::Bool, julia_args::Cmd, test_args::Cmd, test_fn::Nothing, force_latest_compatible_version::Bool, allow_earlier_backwards_compatible_versions::Bool, allow_reresolve::Bool)
@ Pkg.Operations /opt/julia/share/julia/stdlib/v1.13/Pkg/src/Operations.jl:2672
[3] test
@ /opt/julia/share/julia/stdlib/v1.13/Pkg/src/Operations.jl:2521 [inlined]
[4] test(ctx::Pkg.Types.Context, pkgs::Vector{PackageSpec}; coverage::Bool, test_fn::Nothing, julia_args::Cmd, test_args::Cmd, force_latest_compatible_version::Bool, allow_earlier_backwards_compatible_versions::Bool, allow_reresolve::Bool, kwargs::@Kwargs{io::IOContext{IO}})
@ Pkg.API /opt/julia/share/julia/stdlib/v1.13/Pkg/src/API.jl:538
[5] kwcall(::@NamedTuple{julia_args::Cmd, io::IOContext{IO}}, ::typeof(Pkg.API.test), ctx::Pkg.Types.Context, pkgs::Vector{PackageSpec})
@ Pkg.API /opt/julia/share/julia/stdlib/v1.13/Pkg/src/API.jl:515
[6] test(pkgs::Vector{PackageSpec}; io::IOContext{IO}, kwargs::@Kwargs{julia_args::Cmd})
@ Pkg.API /opt/julia/share/julia/stdlib/v1.13/Pkg/src/API.jl:168
[7] kwcall(::@NamedTuple{julia_args::Cmd}, ::typeof(Pkg.API.test), pkgs::Vector{PackageSpec})
@ Pkg.API /opt/julia/share/julia/stdlib/v1.13/Pkg/src/API.jl:157
[8] test(pkgs::Vector{String}; kwargs::@Kwargs{julia_args::Cmd})
@ Pkg.API /opt/julia/share/julia/stdlib/v1.13/Pkg/src/API.jl:156
[9] test
@ /opt/julia/share/julia/stdlib/v1.13/Pkg/src/API.jl:156 [inlined]
[10] kwcall(::@NamedTuple{julia_args::Cmd}, ::typeof(Pkg.API.test), pkg::String)
@ Pkg.API /opt/julia/share/julia/stdlib/v1.13/Pkg/src/API.jl:155
[11] top-level scope
@ /PkgEval.jl/scripts/evaluate.jl:219
[12] include(mod::Module, _path::String)
@ Base ./Base.jl:311
[13] exec_options(opts::Base.JLOptions)
@ Base ./client.jl:320
[14] _start()
@ Base ./client.jl:553
in expression starting at /PkgEval.jl/scripts/evaluate.jl:210
PkgEval failed after 638.24s: networking-related issues were detected