{"text_format":"1","workbook":"xlsx","n_sheets":4,"sheets":["Welcome","Data","PriceList","Lists"],"not_rendered":{"charts":0,"images":1,"macros":1,"external_links":0,"defined_names":15,"comments":1,"pivot_tables":0},"unopened":[],"bounds":{"document_bytes":16777216,"sheet_cells":100000,"rows_first":2000,"rows_last":500,"rows_between":2000,"halvings":0,"cell_chars":16384,"cell_head_chars":4096},"cells_cut":0,"cells_raw":0,"read":"whole","date_system":"1900"}

{"sheet":"Welcome","index":0,"n_rows":33,"n_cols":12,"rows_kept":33,"cut":false,"hidden":false,"merged":[[28,1,28,2],[29,1,29,2],[30,1,30,2],[32,1,32,3],[1,1,1,4],[2,1,2,10],[0,1,0,14],[23,1,23,2],[25,1,25,2],[26,1,26,2],[27,1,27,2],[1,5,1,8],[2,11,2,14]]}
[null," Corporate Gifts Order Form 2025"]
[null,"If you ordered with us last year, please call us at 1-800-434-0500 8am-5pm or email us at Corporateorders@bostoncoffeecake.com for your 2023 recipient list. ",null,null,null,"Corporateorders@bostoncoffeecake.com",null,null,null,"for your 2024 recipient list. "]
[null,"Use the data tab for this form to enter your new gift orders.  When complete, save your spreadsheet to your desktop and then email it as an attachment to ",null,null,null,null,null,null,null,null,null,"Corporateorders@bostoncoffeecake.com"]
[]
[]
[]
[]
[]
[]
[]
[]
[]
[]
[]
[]
[]
[]
[]
[]
[]
[null,"     PLEASE COMPLETE your company information below:"]
[]
[null,"     CUSTOMER CONTACT INFORMATION:   "]
[null,"Customer Number",null," "]
[null,null,"Company Name"]
[null,"Contact Name",null," "]
[null,"Billing Address 1",null," "]
[null," Billing Address 2",null," "]
[null,"City, State, Zip ",null," "]
[null,"Phone",null," "]
[null,"Email",null," "]
[]
[null,"Your Total Order (not including shipping & discounts) = ",null,null,{"$f":"SUM(Data!D2:D427)","v":0}]

{"sheet":"Data","index":1,"n_rows":1003,"n_cols":22,"rows_kept":1003,"cut":false,"hidden":false,"merged":[]}
["Ship_Date","Quantity","Item","Price","Honorific","First Name","Last Name","Suffix","Company","Address_1","Address_2","City","State","Country","Zip","Phone","Greeting1","Greeting2","Greeting3","Greeting4","Greeting5","Greeting6"]
[null,null,null,{"$f":"IFERROR(VLOOKUP(C2,PriceList!A:C,3,FALSE),\"\")","v":""}]
[null,null,null,{"$f":"IFERROR(VLOOKUP(C3,PriceList!A:C,3,FALSE),\"\")","v":""}]
[null,null,null,{"$f":"IFERROR(VLOOKUP(C4,PriceList!A:C,3,FALSE),\"\")","v":""}]
[null,null,null,{"$f":"IFERROR(VLOOKUP(C5,PriceList!A:C,3,FALSE),\"\")","v":""}]
[null,null,null,{"$f":"IFERROR(VLOOKUP(C6,PriceList!A:C,3,FALSE),\"\")","v":""}]
[null,null,null,{"$f":"IFERROR(VLOOKUP(C7,PriceList!A:C,3,FALSE),\"\")","v":""}]
[null,null,null,{"$f":"IFERROR(VLOOKUP(C8,PriceList!A:C,3,FALSE),\"\")","v":""}]
[null,null,null,{"$f":"IFERROR(VLOOKUP(C9,PriceList!A:C,3,FALSE),\"\")","v":""}]
[null,null,null,{"$f":"IFERROR(VLOOKUP(C10,PriceList!A:C,3,FALSE),\"\")","v":""}]
[null,null,null,{"$f":"IFERROR(VLOOKUP(C11,PriceList!A:C,3,FALSE),\"\")","v":""}]
[null,null,null,{"$f":"IFERROR(VLOOKUP(C12,PriceList!A:C,3,FALSE),\"\")","v":""}]
[null,null,null,{"$f":"IFERROR(VLOOKUP(C13,PriceList!A:C,3,FALSE),\"\")","v":""}]
[null,null,null,{"$f":"IFERROR(VLOOKUP(C14,PriceList!A:C,3,FALSE),\"\")","v":""}]
[null,null,null,{"$f":"IFERROR(VLOOKUP(C15,PriceList!A:C,3,FALSE),\"\")","v":""}]
[null,null,null,{"$f":"IFERROR(VLOOKUP(C16,PriceList!A:C,3,FALSE),\"\")","v":""}]
[null,null,null,{"$f":"IFERROR(VLOOKUP(C17,PriceList!A:C,3,FALSE),\"\")","v":""}]
[null,null,null,{"$f":"IFERROR(VLOOKUP(C18,PriceList!A:C,3,FALSE),\"\")","v":""}]
[null,null,null,{"$f":"IFERROR(VLOOKUP(C19,PriceList!A:C,3,FALSE),\"\")","v":""}]
[null,null,null,{"$f":"IFERROR(VLOOKUP(C20,PriceList!A:C,3,FALSE),\"\")","v":""}]
[null,null,null,{"$f":"IFERROR(VLOOKUP(C21,PriceList!A:C,3,FALSE),\"\")","v":""}]
[null,null,null,{"$f":"IFERROR(VLOOKUP(C22,PriceList!A:C,3,FALSE),\"\")","v":""}]
[null,null,null,{"$f":"IFERROR(VLOOKUP(C23,PriceList!A:C,3,FALSE),\"\")","v":""}]
[null,null,null,{"$f":"IFERROR(VLOOKUP(C24,PriceList!A:C,3,FALSE),\"\")","v":""}]
[null,null,null,{"$f":"IFERROR(VLOOKUP(C25,PriceList!A:C,3,FALSE),\"\")","v":""}]
[null,null,null,{"$f":"IFERROR(VLOOKUP(C26,PriceList!A:C,3,FALSE),\"\")","v":""}]
[null,null,null,{"$f":"IFERROR(VLOOKUP(C27,PriceList!A:C,3,FALSE),\"\")","v":""}]
[null,null,null,{"$f":"IFERROR(VLOOKUP(C28,PriceList!A:C,3,FALSE),\"\")","v":""}]
[null,null,null,{"$f":"IFERROR(VLOOKUP(C29,PriceList!A:C,3,FALSE),\"\")","v":""}]
[null,null,null,{"$f":"IFERROR(VLOOKUP(C30,PriceList!A:C,3,FALSE),\"\")","v":""}]
[null,null,null,{"$f":"IFERROR(VLOOKUP(C31,PriceList!A:C,3,FALSE),\"\")","v":""}]
[null,null,null,{"$f":"IFERROR(VLOOKUP(C32,PriceList!A:C,3,FALSE),\"\")","v":""}]
[null,null,null,{"$f":"IFERROR(VLOOKUP(C33,PriceList!A:C,3,FALSE),\"\")","v":""}]
[null,null,null,{"$f":"IFERROR(VLOOKUP(C34,PriceList!A:C,3,FALSE),\"\")","v":""}]
[null,null,null,{"$f":"IFERROR(VLOOKUP(C35,PriceList!A:C,3,FALSE),\"\")","v":""}]
[null,null,null,{"$f":"IFERROR(VLOOKUP(C36,PriceList!A:C,3,FALSE),\"\")","v":""}]
[null,null,null,{"$f":"IFERROR(VLOOKUP(C37,PriceList!A:C,3,FALSE),\"\")","v":""}]
[null,null,null,{"$f":"IFERROR(VLOOKUP(C38,PriceList!A:C,3,FALSE),\"\")","v":""}]
[null,null,null,{"$f":"IFERROR(VLOOKUP(C39,PriceList!A:C,3,FALSE),\"\")","v":""}]
[null,null,null,{"$f":"IFERROR(VLOOKUP(C40,PriceList!A:C,3,FALSE),\"\")","v":""}]
[null,null,null,{"$f":"IFERROR(VLOOKUP(C41,PriceList!A:C,3,FALSE),\"\")","v":""}]
[null,null,null,{"$f":"IFERROR(VLOOKUP(C42,PriceList!A:C,3,FALSE),\"\")","v":""}]
[null,null,null,{"$f":"IFERROR(VLOOKUP(C43,PriceList!A:C,3,FALSE),\"\")","v":""}]
[null,null,null,{"$f":"IFERROR(VLOOKUP(C44,PriceList!A:C,3,FALSE),\"\")","v":""}]
[null,null,null,{"$f":"IFERROR(VLOOKUP(C45,PriceList!A:C,3,FALSE),\"\")","v":""}]
[null,null,null,{"$f":"IFERROR(VLOOKUP(C46,PriceList!A:C,3,FALSE),\"\")","v":""}]
[null,null,null,{"$f":"IFERROR(VLOOKUP(C47,PriceList!A:C,3,FALSE),\"\")","v":""}]
[null,null,null,{"$f":"IFERROR(VLOOKUP(C48,PriceList!A:C,3,FALSE),\"\")","v":""}]
[null,null,null,{"$f":"IFERROR(VLOOKUP(C49,PriceList!A:C,3,FALSE),\"\")","v":""}]
[null,null,null,{"$f":"IFERROR(VLOOKUP(C50,PriceList!A:C,3,FALSE),\"\")","v":""}]
[null,null,null,{"$f":"IFERROR(VLOOKUP(C51,PriceList!A:C,3,FALSE),\"\")","v":""}]
[null,null,null,{"$f":"IFERROR(VLOOKUP(C52,PriceList!A:C,3,FALSE),\"\")","v":""}]
[null,null,null,{"$f":"IFERROR(VLOOKUP(C53,PriceList!A:C,3,FALSE),\"\")","v":""}]
[null,null,null,{"$f":"IFERROR(VLOOKUP(C54,PriceList!A:C,3,FALSE),\"\")","v":""}]
[null,null,null,{"$f":"IFERROR(VLOOKUP(C55,PriceList!A:C,3,FALSE),\"\")","v":""}]
[null,null,null,{"$f":"IFERROR(VLOOKUP(C56,PriceList!A:C,3,FALSE),\"\")","v":""}]
[null,null,null,{"$f":"IFERROR(VLOOKUP(C57,PriceList!A:C,3,FALSE),\"\")","v":""}]
[null,null,null,{"$f":"IFERROR(VLOOKUP(C58,PriceList!A:C,3,FALSE),\"\")","v":""}]
[null,null,null,{"$f":"IFERROR(VLOOKUP(C59,PriceList!A:C,3,FALSE),\"\")","v":""}]
[null,null,null,{"$f":"IFERROR(VLOOKUP(C60,PriceList!A:C,3,FALSE),\"\")","v":""}]
[null,null,null,{"$f":"IFERROR(VLOOKUP(C61,PriceList!A:C,3,FALSE),\"\")","v":""}]
[null,null,null,{"$f":"IFERROR(VLOOKUP(C62,PriceList!A:C,3,FALSE),\"\")","v":""}]
[null,null,null,{"$f":"IFERROR(VLOOKUP(C63,PriceList!A:C,3,FALSE),\"\")","v":""}]
[null,null,null,{"$f":"IFERROR(VLOOKUP(C64,PriceList!A:C,3,FALSE),\"\")","v":""}]
[null,null,null,{"$f":"IFERROR(VLOOKUP(C65,PriceList!A:C,3,FALSE),\"\")","v":""}]
[null,null,null,{"$f":"IFERROR(VLOOKUP(C66,PriceList!A:C,3,FALSE),\"\")","v":""}]
[null,null,null,{"$f":"IFERROR(VLOOKUP(C67,PriceList!A:C,3,FALSE),\"\")","v":""}]
[null,null,null,{"$f":"IFERROR(VLOOKUP(C68,PriceList!A:C,3,FALSE),\"\")","v":""}]
[null,null,null,{"$f":"IFERROR(VLOOKUP(C69,PriceList!A:C,3,FALSE),\"\")","v":""}]
[null,null,null,{"$f":"IFERROR(VLOOKUP(C70,PriceList!A:C,3,FALSE),\"\")","v":""}]
[null,null,null,{"$f":"IFERROR(VLOOKUP(C71,PriceList!A:C,3,FALSE),\"\")","v":""}]
[null,null,null,{"$f":"IFERROR(VLOOKUP(C72,PriceList!A:C,3,FALSE),\"\")","v":""}]
[null,null,null,{"$f":"IFERROR(VLOOKUP(C73,PriceList!A:C,3,FALSE),\"\")","v":""}]
[null,null,null,{"$f":"IFERROR(VLOOKUP(C74,PriceList!A:C,3,FALSE),\"\")","v":""}]
[null,null,null,{"$f":"IFERROR(VLOOKUP(C75,PriceList!A:C,3,FALSE),\"\")","v":""}]
[null,null,null,{"$f":"IFERROR(VLOOKUP(C76,PriceList!A:C,3,FALSE),\"\")","v":""}]
[null,null,null,{"$f":"IFERROR(VLOOKUP(C77,PriceList!A:C,3,FALSE),\"\")","v":""}]
[null,null,null,{"$f":"IFERROR(VLOOKUP(C78,PriceList!A:C,3,FALSE),\"\")","v":""}]
[null,null,null,{"$f":"IFERROR(VLOOKUP(C79,PriceList!A:C,3,FALSE),\"\")","v":""}]
[null,null,null,{"$f":"IFERROR(VLOOKUP(C80,PriceList!A:C,3,FALSE),\"\")","v":""}]
[null,null,null,{"$f":"IFERROR(VLOOKUP(C81,PriceList!A:C,3,FALSE),\"\")","v":""}]
[null,null,null,{"$f":"IFERROR(VLOOKUP(C82,PriceList!A:C,3,FALSE),\"\")","v":""}]
[null,null,null,{"$f":"IFERROR(VLOOKUP(C83,PriceList!A:C,3,FALSE),\"\")","v":""}]
[null,null,null,{"$f":"IFERROR(VLOOKUP(C84,PriceList!A:C,3,FALSE),\"\")","v":""}]
[null,null,null,{"$f":"IFERROR(VLOOKUP(C85,PriceList!A:C,3,FALSE),\"\")","v":""}]
[null,null,null,{"$f":"IFERROR(VLOOKUP(C86,PriceList!A:C,3,FALSE),\"\")","v":""}]
[null,null,null,{"$f":"IFERROR(VLOOKUP(C87,PriceList!A:C,3,FALSE),\"\")","v":""}]
[null,null,null,{"$f":"IFERROR(VLOOKUP(C88,PriceList!A:C,3,FALSE),\"\")","v":""}]
[null,null,null,{"$f":"IFERROR(VLOOKUP(C89,PriceList!A:C,3,FALSE),\"\")","v":""}]
[null,null,null,{"$f":"IFERROR(VLOOKUP(C90,PriceList!A:C,3,FALSE),\"\")","v":""}]
[null,null,null,{"$f":"IFERROR(VLOOKUP(C91,PriceList!A:C,3,FALSE),\"\")","v":""}]
[null,null,null,{"$f":"IFERROR(VLOOKUP(C92,PriceList!A:C,3,FALSE),\"\")","v":""}]
[null,null,null,{"$f":"IFERROR(VLOOKUP(C93,PriceList!A:C,3,FALSE),\"\")","v":""}]
[null,null,null,{"$f":"IFERROR(VLOOKUP(C94,PriceList!A:C,3,FALSE),\"\")","v":""}]
[null,null,null,{"$f":"IFERROR(VLOOKUP(C95,PriceList!A:C,3,FALSE),\"\")","v":""}]
[null,null,null,{"$f":"IFERROR(VLOOKUP(C96,PriceList!A:C,3,FALSE),\"\")","v":""}]
[null,null,null,{"$f":"IFERROR(VLOOKUP(C97,PriceList!A:C,3,FALSE),\"\")","v":""}]
[null,null,null,{"$f":"IFERROR(VLOOKUP(C98,PriceList!A:C,3,FALSE),\"\")","v":""}]
[null,null,null,{"$f":"IFERROR(VLOOKUP(C99,PriceList!A:C,3,FALSE),\"\")","v":""}]
[null,null,null,{"$f":"IFERROR(VLOOKUP(C100,PriceList!A:C,3,FALSE),\"\")","v":""}]
[null,null,null,{"$f":"IFERROR(VLOOKUP(C101,PriceList!A:C,3,FALSE),\"\")","v":""}]
[null,null,null,{"$f":"IFERROR(VLOOKUP(C102,PriceList!A:C,3,FALSE),\"\")","v":""}]
[null,null,null,{"$f":"IFERROR(VLOOKUP(C103,PriceList!A:C,3,FALSE),\"\")","v":""}]
[null,null,null,{"$f":"IFERROR(VLOOKUP(C104,PriceList!A:C,3,FALSE),\"\")","v":""}]
[null,null,null,{"$f":"IFERROR(VLOOKUP(C105,PriceList!A:C,3,FALSE),\"\")","v":""}]
[null,null,null,{"$f":"IFERROR(VLOOKUP(C106,PriceList!A:C,3,FALSE),\"\")","v":""}]
[null,null,null,{"$f":"IFERROR(VLOOKUP(C107,PriceList!A:C,3,FALSE),\"\")","v":""}]
[null,null,null,{"$f":"IFERROR(VLOOKUP(C108,PriceList!A:C,3,FALSE),\"\")","v":""}]
[null,null,null,{"$f":"IFERROR(VLOOKUP(C109,PriceList!A:C,3,FALSE),\"\")","v":""}]
[null,null,null,{"$f":"IFERROR(VLOOKUP(C110,PriceList!A:C,3,FALSE),\"\")","v":""}]
[null,null,null,{"$f":"IFERROR(VLOOKUP(C111,PriceList!A:C,3,FALSE),\"\")","v":""}]
[null,null,null,{"$f":"IFERROR(VLOOKUP(C112,PriceList!A:C,3,FALSE),\"\")","v":""}]
[null,null,null,{"$f":"IFERROR(VLOOKUP(C113,PriceList!A:C,3,FALSE),\"\")","v":""}]
[null,null,null,{"$f":"IFERROR(VLOOKUP(C114,PriceList!A:C,3,FALSE),\"\")","v":""}]
[null,null,null,{"$f":"IFERROR(VLOOKUP(C115,PriceList!A:C,3,FALSE),\"\")","v":""}]
[null,null,null,{"$f":"IFERROR(VLOOKUP(C116,PriceList!A:C,3,FALSE),\"\")","v":""}]
[null,null,null,{"$f":"IFERROR(VLOOKUP(C117,PriceList!A:C,3,FALSE),\"\")","v":""}]
[null,null,null,{"$f":"IFERROR(VLOOKUP(C118,PriceList!A:C,3,FALSE),\"\")","v":""}]
[null,null,null,{"$f":"IFERROR(VLOOKUP(C119,PriceList!A:C,3,FALSE),\"\")","v":""}]
[null,null,null,{"$f":"IFERROR(VLOOKUP(C120,PriceList!A:C,3,FALSE),\"\")","v":""}]
[null,null,null,{"$f":"IFERROR(VLOOKUP(C121,PriceList!A:C,3,FALSE),\"\")","v":""}]
[null,null,null,{"$f":"IFERROR(VLOOKUP(C122,PriceList!A:C,3,FALSE),\"\")","v":""}]
[null,null,null,{"$f":"IFERROR(VLOOKUP(C123,PriceList!A:C,3,FALSE),\"\")","v":""}]
[null,null,null,{"$f":"IFERROR(VLOOKUP(C124,PriceList!A:C,3,FALSE),\"\")","v":""}]
[null,null,null,{"$f":"IFERROR(VLOOKUP(C125,PriceList!A:C,3,FALSE),\"\")","v":""}]
[null,null,null,{"$f":"IFERROR(VLOOKUP(C126,PriceList!A:C,3,FALSE),\"\")","v":""}]
[null,null,null,{"$f":"IFERROR(VLOOKUP(C127,PriceList!A:C,3,FALSE),\"\")","v":""}]
[null,null,null,{"$f":"IFERROR(VLOOKUP(C128,PriceList!A:C,3,FALSE),\"\")","v":""}]
[null,null,null,{"$f":"IFERROR(VLOOKUP(C129,PriceList!A:C,3,FALSE),\"\")","v":""}]
[null,null,null,{"$f":"IFERROR(VLOOKUP(C130,PriceList!A:C,3,FALSE),\"\")","v":""}]
[null,null,null,{"$f":"IFERROR(VLOOKUP(C131,PriceList!A:C,3,FALSE),\"\")","v":""}]
[null,null,null,{"$f":"IFERROR(VLOOKUP(C132,PriceList!A:C,3,FALSE),\"\")","v":""}]
[null,null,null,{"$f":"IFERROR(VLOOKUP(C133,PriceList!A:C,3,FALSE),\"\")","v":""}]
[null,null,null,{"$f":"IFERROR(VLOOKUP(C134,PriceList!A:C,3,FALSE),\"\")","v":""}]
[null,null,null,{"$f":"IFERROR(VLOOKUP(C135,PriceList!A:C,3,FALSE),\"\")","v":""}]
[null,null,null,{"$f":"IFERROR(VLOOKUP(C136,PriceList!A:C,3,FALSE),\"\")","v":""}]
[null,null,null,{"$f":"IFERROR(VLOOKUP(C137,PriceList!A:C,3,FALSE),\"\")","v":""}]
[null,null,null,{"$f":"IFERROR(VLOOKUP(C138,PriceList!A:C,3,FALSE),\"\")","v":""}]
[null,null,null,{"$f":"IFERROR(VLOOKUP(C139,PriceList!A:C,3,FALSE),\"\")","v":""}]
[null,null,null,{"$f":"IFERROR(VLOOKUP(C140,PriceList!A:C,3,FALSE),\"\")","v":""}]
[null,null,null,{"$f":"IFERROR(VLOOKUP(C141,PriceList!A:C,3,FALSE),\"\")","v":""}]
[null,null,null,{"$f":"IFERROR(VLOOKUP(C142,PriceList!A:C,3,FALSE),\"\")","v":""}]
[null,null,null,{"$f":"IFERROR(VLOOKUP(C143,PriceList!A:C,3,FALSE),\"\")","v":""}]
[null,null,null,{"$f":"IFERROR(VLOOKUP(C144,PriceList!A:C,3,FALSE),\"\")","v":""}]
[null,null,null,{"$f":"IFERROR(VLOOKUP(C145,PriceList!A:C,3,FALSE),\"\")","v":""}]
[null,null,null,{"$f":"IFERROR(VLOOKUP(C146,PriceList!A:C,3,FALSE),\"\")","v":""}]
[null,null,null,{"$f":"IFERROR(VLOOKUP(C147,PriceList!A:C,3,FALSE),\"\")","v":""}]
[null,null,null,{"$f":"IFERROR(VLOOKUP(C148,PriceList!A:C,3,FALSE),\"\")","v":""}]
[null,null,null,{"$f":"IFERROR(VLOOKUP(C149,PriceList!A:C,3,FALSE),\"\")","v":""}]
[null,null,null,{"$f":"IFERROR(VLOOKUP(C150,PriceList!A:C,3,FALSE),\"\")","v":""}]
[null,null,null,{"$f":"IFERROR(VLOOKUP(C151,PriceList!A:C,3,FALSE),\"\")","v":""}]
[null,null,null,{"$f":"IFERROR(VLOOKUP(C152,PriceList!A:C,3,FALSE),\"\")","v":""}]
[null,null,null,{"$f":"IFERROR(VLOOKUP(C153,PriceList!A:C,3,FALSE),\"\")","v":""}]
[null,null,null,{"$f":"IFERROR(VLOOKUP(C154,PriceList!A:C,3,FALSE),\"\")","v":""}]
[null,null,null,{"$f":"IFERROR(VLOOKUP(C155,PriceList!A:C,3,FALSE),\"\")","v":""}]
[null,null,null,{"$f":"IFERROR(VLOOKUP(C156,PriceList!A:C,3,FALSE),\"\")","v":""}]
[null,null,null,{"$f":"IFERROR(VLOOKUP(C157,PriceList!A:C,3,FALSE),\"\")","v":""}]
[null,null,null,{"$f":"IFERROR(VLOOKUP(C158,PriceList!A:C,3,FALSE),\"\")","v":""}]
[null,null,null,{"$f":"IFERROR(VLOOKUP(C159,PriceList!A:C,3,FALSE),\"\")","v":""}]
[null,null,null,{"$f":"IFERROR(VLOOKUP(C160,PriceList!A:C,3,FALSE),\"\")","v":""}]
[null,null,null,{"$f":"IFERROR(VLOOKUP(C161,PriceList!A:C,3,FALSE),\"\")","v":""}]
[null,null,null,{"$f":"IFERROR(VLOOKUP(C162,PriceList!A:C,3,FALSE),\"\")","v":""}]
[null,null,null,{"$f":"IFERROR(VLOOKUP(C163,PriceList!A:C,3,FALSE),\"\")","v":""}]
[null,null,null,{"$f":"IFERROR(VLOOKUP(C164,PriceList!A:C,3,FALSE),\"\")","v":""}]
[null,null,null,{"$f":"IFERROR(VLOOKUP(C165,PriceList!A:C,3,FALSE),\"\")","v":""}]
[null,null,null,{"$f":"IFERROR(VLOOKUP(C166,PriceList!A:C,3,FALSE),\"\")","v":""}]
[null,null,null,{"$f":"IFERROR(VLOOKUP(C167,PriceList!A:C,3,FALSE),\"\")","v":""}]
[null,null,null,{"$f":"IFERROR(VLOOKUP(C168,PriceList!A:C,3,FALSE),\"\")","v":""}]
[null,null,null,{"$f":"IFERROR(VLOOKUP(C169,PriceList!A:C,3,FALSE),\"\")","v":""}]
[null,null,null,{"$f":"IFERROR(VLOOKUP(C170,PriceList!A:C,3,FALSE),\"\")","v":""}]
[null,null,null,{"$f":"IFERROR(VLOOKUP(C171,PriceList!A:C,3,FALSE),\"\")","v":""}]
[null,null,null,{"$f":"IFERROR(VLOOKUP(C172,PriceList!A:C,3,FALSE),\"\")","v":""}]
[null,null,null,{"$f":"IFERROR(VLOOKUP(C173,PriceList!A:C,3,FALSE),\"\")","v":""}]
[null,null,null,{"$f":"IFERROR(VLOOKUP(C174,PriceList!A:C,3,FALSE),\"\")","v":""}]
[null,null,null,{"$f":"IFERROR(VLOOKUP(C175,PriceList!A:C,3,FALSE),\"\")","v":""}]
[null,null,null,{"$f":"IFERROR(VLOOKUP(C176,PriceList!A:C,3,FALSE),\"\")","v":""}]
[null,null,null,{"$f":"IFERROR(VLOOKUP(C177,PriceList!A:C,3,FALSE),\"\")","v":""}]
[null,null,null,{"$f":"IFERROR(VLOOKUP(C178,PriceList!A:C,3,FALSE),\"\")","v":""}]
[null,null,null,{"$f":"IFERROR(VLOOKUP(C179,PriceList!A:C,3,FALSE),\"\")","v":""}]
[null,null,null,{"$f":"IFERROR(VLOOKUP(C180,PriceList!A:C,3,FALSE),\"\")","v":""}]
[null,null,null,{"$f":"IFERROR(VLOOKUP(C181,PriceList!A:C,3,FALSE),\"\")","v":""}]
[null,null,null,{"$f":"IFERROR(VLOOKUP(C182,PriceList!A:C,3,FALSE),\"\")","v":""}]
[null,null,null,{"$f":"IFERROR(VLOOKUP(C183,PriceList!A:C,3,FALSE),\"\")","v":""}]
[null,null,null,{"$f":"IFERROR(VLOOKUP(C184,PriceList!A:C,3,FALSE),\"\")","v":""}]
[null,null,null,{"$f":"IFERROR(VLOOKUP(C185,PriceList!A:C,3,FALSE),\"\")","v":""}]
[null,null,null,{"$f":"IFERROR(VLOOKUP(C186,PriceList!A:C,3,FALSE),\"\")","v":""}]
[null,null,null,{"$f":"IFERROR(VLOOKUP(C187,PriceList!A:C,3,FALSE),\"\")","v":""}]
[null,null,null,{"$f":"IFERROR(VLOOKUP(C188,PriceList!A:C,3,FALSE),\"\")","v":""}]
[null,null,null,{"$f":"IFERROR(VLOOKUP(C189,PriceList!A:C,3,FALSE),\"\")","v":""}]
[null,null,null,{"$f":"IFERROR(VLOOKUP(C190,PriceList!A:C,3,FALSE),\"\")","v":""}]
[null,null,null,{"$f":"IFERROR(VLOOKUP(C191,PriceList!A:C,3,FALSE),\"\")","v":""}]
[null,null,null,{"$f":"IFERROR(VLOOKUP(C192,PriceList!A:C,3,FALSE),\"\")","v":""}]
[null,null,null,{"$f":"IFERROR(VLOOKUP(C193,PriceList!A:C,3,FALSE),\"\")","v":""}]
[null,null,null,{"$f":"IFERROR(VLOOKUP(C194,PriceList!A:C,3,FALSE),\"\")","v":""}]
[null,null,null,{"$f":"IFERROR(VLOOKUP(C195,PriceList!A:C,3,FALSE),\"\")","v":""}]
[null,null,null,{"$f":"IFERROR(VLOOKUP(C196,PriceList!A:C,3,FALSE),\"\")","v":""}]
[null,null,null,{"$f":"IFERROR(VLOOKUP(C197,PriceList!A:C,3,FALSE),\"\")","v":""}]
[null,null,null,{"$f":"IFERROR(VLOOKUP(C198,PriceList!A:C,3,FALSE),\"\")","v":""}]
[null,null,null,{"$f":"IFERROR(VLOOKUP(C199,PriceList!A:C,3,FALSE),\"\")","v":""}]
[null,null,null,{"$f":"IFERROR(VLOOKUP(C200,PriceList!A:C,3,FALSE),\"\")","v":""}]
{"$rows_left_out":804}
{"sheet":"PriceList","index":2,"n_rows":38,"n_cols":3,"rows_kept":38,"cut":false,"hidden":false,"merged":[]}
["2024 Boston Coffee Cake Mail Order Price List - Before Discounts"]
["Item","Name","Price"]
["4101700","3 lb. Original Cinnamon Walnut ",39.99]
["4101701","3 lb. Cinnamon Walnut- Red BCC Signature Tin",49.99]
["4101702","3 lb. Cinnamon Walnut- Scroll Tin",49.99]
["4101704","3 lb. Cinnamon Walnut- Snowy Drive Tin",49.99]
["4103700","3 lb. Blueberry Blizzard",39.99]
["4106700","3 lb. Lemon Burst",39.99]
["4109700","3 lb. Golden Pumpkin",39.99]
["4115700","3 lb. Marble Madness",39.99]
["4120700","3 lb. Caramel Apple Harvest",39.99]
["4121700","3 lb. Cranberry Orange Nut ",39.99]
["4123700","3 lb. N.E. Tradition Holiday Cake",39.99]
["4124700","3 lb. Triple Chocolate",39.99]
["4401202","1.5 lb. Cinnamon Walnut - 2 Pack",45.99]
["4401203","1.5 lb. Cinnamon Walnut - 3 Pack ",64.989999999999995]
["4401204","1.5 lb. Cinnamon Walnut - 4 Pack",79.989999999999995]
["4410081","1.5 lb. Assorted - 4 Pack",79.989999999999995]
["4401208","1.5 lb. Cinnamon Walnut - 8 Pack",149.99]
["4401904","3 lb. Cinnamon Walnut - 4 Pack",139.99]
["4410084","Celebration Tower",89.99]
["4410018","Boston Coffee Cake Tower",109.99]
["4440202","1.5 lb. 2 Pack Cinnamon Walnut & Blueberry Blizzard",45.99]
["4441202","1.5 lb. 2 Pack Cinnamon Walnut & Marble Madness",45.99]
["4449202","1.5 lb. 2 Pack Cinnamon Walnut & Triple Chocolate ",45.99]
["4451202","1.5 lb. 2 Pack Cinnamon Walnut & Caramel Apple",45.99]
["4466203","1.5 lb. 3 Pack Cinnamon Walnut/Caramel Apple/Triple Chocolate",64.989999999999995]
["4464203","1.5 lb. 3 Pack Cinnamon Walnut/Blueberry  Blizzard/Marble Madness",64.989999999999995]
["4552906","Mini Coffee Cakes - 6",45.99]
["4552912","Mini Coffee Cakes - 12",69.989999999999995]
["4410060","Boston Whoopies",38.99]
["4410061","Boston Goodies",54.99]
["4430700","The Great One - Cinnamon Swirl",29.99]
["4430748","The Grand One",45.99]
["4401704","1.5 lb. Cinnamon Walnut - Thank You Tin",39.99]
["4401703","1.5 lb. Cinnamon Walnut  - Thinking of You Tin",39.99]
["4401702","1.5 lb. Cinnamon Walnut - Happy Birthday Tin",39.99]
["4410082","The Big Whoop",54.99]

{"sheet":"Lists","index":3,"n_rows":252,"n_cols":3,"rows_kept":252,"cut":false,"hidden":false,"merged":[]}
["United States","Miss","Jr."]
["Canada","Ms.","Sr."]
["Australia","Miss","JD"]
["Austria","Mrs.","MD"]
["Azerbaijan","Mr.","DO"]
["Azores","Mr&Mrs","DC"]
["Bahamas","Rev.","PhD"]
["Bahrain","Fr.","II"]
["Bangladesh","Dr.","III"]
["Barbados","Dr&Mrs","IV"]
["Belgium","Atty.","V"]
["Belize","Prof.","VI"]
["Benin","Hon."]
["Bermuda","Pres."]
["Bhutan","Gov."]
["Bolivia","Ofc."]
["Bosnia (Hercgovina)","Msgr."]
["Botswana","Sr."]
["Bouvet Island","Br."]
["Brazil","Supt."]
["British Forces Post Office","Rep."]
["British Indian Ocean Terri","Sen."]
["British Virgin Islands","Amb."]
["Brunei","Treas."]
["Bulgaria","Sec."]
["Burkina Faso","Pvt."]
["Burma","Cpl."]
["Burundi","Sgt."]
["Byelorussia (Belarus)","Adm."]
["Cambodia","Maj."]
["Cameroon","Capt."]
["Canary Islands","Cmdr."]
["Cape Verde","Col."]
["Cayman Islands","Lt. "]
["Central African Republic","Gen."]
["Chad","The"]
["Chile"]
["China"]
["Christmas Island"]
["Cocos (keeling) Islands"]
["Colombia"]
["Comoros"]
["Congo"]
["Congo, The Democratic Repu"]
["Cook Islands"]
["Corsica"]
["Costa Rica"]
["Cote d'Ivoire"]
["Croatia"]
["Cuba"]
["Cyprus"]
["Czech Republic"]
["Czechoslovakia"]
["Denmark"]
["Djibouti"]
["Dominica"]
["Dominican Rep."]
["East Timor"]
["Ecuador"]
["Egypt"]
["El Salvador"]
["Equatorial Guinea"]
["Eritrea"]
["Estonia"]
["Ethiopia"]
["Falkland Islands"]
["Faroe Islands"]
["Fiji"]
["Finland"]
["France"]
["France, Metropolitan"]
["French Guiana"]
["French Polynesia"]
["French Southern Territorie"]
["Gabon"]
["Gambia"]
["Germany"]
["Ghana"]
["Gibraltar"]
["Great Britain"]
["Greece"]
["Greenland"]
["Grenada"]
["Guadeloupe"]
["Guam"]
["Guatemala"]
["Guinea"]
["Guinea-Bissau"]
["Guyana"]
["Haiti"]
["Heard And Mc Donald Island"]
["Honduras"]
["Hong Kong"]
["Hungary"]
["Iceland"]
["India"]
["Indonesia"]
["Iran"]
["Iraq"]
["Ireland (Eire)"]
["Israel"]
["Italy"]
["Jamaica"]
["Japan"]
["Jordan"]
["Kampuchea"]
["Kazakhstan"]
["Kenya"]
["Kirghizia (Kyrgyzstan)"]
["Kiribati"]
["Korea, Democ. Peoples Rep."]
["Korea, Democratic People's"]
["Kuwait, Republic of Kuwait"]
["La Luia"]
["Lao"]
["Lao People's Democratic Re"]
["Latvia"]
["Lebanon"]
["Lesotho"]
["Liberia"]
["Libya"]
["Liechtenstein"]
["Lithuania"]
["Lithvania"]
["Luxembourg"]
["Macao"]
["Macedonia"]
["Macedonia, The Former Yugo"]
["Madagascar"]
["Madeira Islands"]
["Malawi"]
["Malaysia"]
["Maldives"]
["Mali"]
["Malta"]
["Marshall Islands"]
["Martinique"]
["Mauritania"]
["Mauritius"]
["Mayotte"]
["Mexico"]
["Micronesia, Federated Stat"]
["MocDavia"]
["Moldova, Republic Of"]
["Monaco"]
["Mongolia"]
["Montserrat"]
["Morocco"]
["Mozambique"]
["Myanmar"]
["name"]
["Namibia"]
["Nauru"]
["Nepal"]
["Netherlands"]
["Netherlands Antilies"]
["New Caledonia"]
["New Zealand"]
["Nicaragua"]
["Niger"]
["Nigeria"]
["Niue"]
["Norfolk Island"]
["Northern Mariana Islands"]
["Norway"]
["Oman"]
["Pakistan"]
["Palau"]
["Palestinian Territory, Occ"]
["Panama"]
["Papua New Guinea"]
["Paraguay"]
["Peru"]
["Philippines"]
["Pitcairn Islands"]
["Poland"]
["Portugal"]
["Puerto Rico"]
["Qatar"]
["Republic of Georgia"]
["Reunion"]
["Romania"]
["Russia"]
["Rwanda"]
["Saint Helena"]
["Saint Lucia"]
["Saint Pierre & Miquelon"]
["Saint Vincent And The Gren"]
["San Marino"]
["Sao Tome & Principe"]
["Saudi Arabia"]
["Scotland"]
["Senegal"]
["Serbia (Montenegro)"]
["Seychelles"]
["Sierra Leone"]
["Singapore"]
["Slovakia"]
["Slovakia (slovak Republic)"]
["Slovenia"]
{"$rows_left_out":52}