+ ln -s /usr/share/clickhouse-test/ci/stress.py /usr/bin/stress + ln -s /usr/share/clickhouse-test/clickhouse-test /usr/bin/clickhouse-test + source /usr/share/clickhouse-test/ci/attach_gdb.lib ++ source /usr/share/clickhouse-test/ci/utils.lib + source /usr/share/clickhouse-test/ci/stress_tests.lib ++ sysctl kernel.core_pattern=core.%e.%p-%P kernel.core_pattern = core.%e.%p-%P ++ OK='\tOK\t\N\t' ++ FAIL='\tFAIL\t\N\t' ++ FAILURE_CONTEXT_LINES=100 ++ FAILURE_CONTEXT_MAX_LINE_WIDTH=300 + install_packages package_folder + dpkg -i package_folder/clickhouse-common-static_23.8.16.10044.altinitystable+asan_amd64.deb Selecting previously unselected package clickhouse-common-static. (Reading database ... 58864 files and directories currently installed.) Preparing to unpack .../clickhouse-common-static_23.8.16.10044.altinitystable+asan_amd64.deb ... Unpacking clickhouse-common-static (23.8.16.10044.altinitystable+asan) ... Setting up clickhouse-common-static (23.8.16.10044.altinitystable+asan) ... + dpkg -i package_folder/clickhouse-common-static-dbg_23.8.16.10044.altinitystable+asan_amd64.deb Selecting previously unselected package clickhouse-common-static-dbg. (Reading database ... 58878 files and directories currently installed.) Preparing to unpack .../clickhouse-common-static-dbg_23.8.16.10044.altinitystable+asan_amd64.deb ... Unpacking clickhouse-common-static-dbg (23.8.16.10044.altinitystable+asan) ... Setting up clickhouse-common-static-dbg (23.8.16.10044.altinitystable+asan) ... + dpkg -i package_folder/clickhouse-server_23.8.16.10044.altinitystable+asan_amd64.deb Selecting previously unselected package clickhouse-server. (Reading database ... 58887 files and directories currently installed.) Preparing to unpack .../clickhouse-server_23.8.16.10044.altinitystable+asan_amd64.deb ... Unpacking clickhouse-server (23.8.16.10044.altinitystable+asan) ... Setting up clickhouse-server (23.8.16.10044.altinitystable+asan) ... ClickHouse binary is already located at /usr/bin/clickhouse Symlink /usr/bin/clickhouse-server already exists but it points to /clickhouse. Will replace the old symlink to /usr/bin/clickhouse. Creating symlink /usr/bin/clickhouse-server to /usr/bin/clickhouse. Creating symlink /usr/bin/clickhouse-client to /usr/bin/clickhouse. Creating symlink /usr/bin/clickhouse-local to /usr/bin/clickhouse. Creating symlink /usr/bin/clickhouse-benchmark to /usr/bin/clickhouse. Symlink /usr/bin/clickhouse-copier already exists but it points to /clickhouse. Will replace the old symlink to /usr/bin/clickhouse. Creating symlink /usr/bin/clickhouse-copier to /usr/bin/clickhouse. Creating symlink /usr/bin/clickhouse-obfuscator to /usr/bin/clickhouse. Creating symlink /usr/bin/clickhouse-git-import to /usr/bin/clickhouse. Creating symlink /usr/bin/clickhouse-compressor to /usr/bin/clickhouse. Creating symlink /usr/bin/clickhouse-format to /usr/bin/clickhouse. Symlink /usr/bin/clickhouse-extract-from-config already exists but it points to /clickhouse. Will replace the old symlink to /usr/bin/clickhouse. Creating symlink /usr/bin/clickhouse-extract-from-config to /usr/bin/clickhouse. Symlink /usr/bin/clickhouse-keeper already exists but it points to /clickhouse. Will replace the old symlink to /usr/bin/clickhouse. Creating symlink /usr/bin/clickhouse-keeper to /usr/bin/clickhouse. Symlink /usr/bin/clickhouse-keeper-converter already exists but it points to /clickhouse. Will replace the old symlink to /usr/bin/clickhouse. Creating symlink /usr/bin/clickhouse-keeper-converter to /usr/bin/clickhouse. Creating symlink /usr/bin/clickhouse-disks to /usr/bin/clickhouse. Creating clickhouse group if it does not exist. groupadd -r clickhouse Creating clickhouse user if it does not exist. useradd -r --shell /bin/false --home-dir /nonexistent -g clickhouse clickhouse Will set ulimits for clickhouse user in /etc/security/limits.d/clickhouse.conf. Creating config directory /etc/clickhouse-server/config.d that is used for tweaks of main server configuration. Creating config directory /etc/clickhouse-server/users.d that is used for tweaks of users configuration. Config file /etc/clickhouse-server/config.xml already exists, will keep it and extract path info from it. /etc/clickhouse-server/config.xml has /var/lib/clickhouse/ as data path. /etc/clickhouse-server/config.xml has /var/log/clickhouse-server/ as log path. Users config file /etc/clickhouse-server/users.xml already exists, will keep it and extract users info from it. Log directory /var/log/clickhouse-server/ already exists. Creating data directory /var/lib/clickhouse/. Creating pid directory /var/run/clickhouse-server. chown -R clickhouse:clickhouse '/var/log/clickhouse-server/' chown -R clickhouse:clickhouse '/var/run/clickhouse-server' chown clickhouse:clickhouse '/var/lib/clickhouse/' groupadd -r clickhouse-bridge useradd -r --shell /bin/false --home-dir /nonexistent -g clickhouse-bridge clickhouse-bridge chown -R clickhouse-bridge:clickhouse-bridge '/usr/bin/clickhouse-odbc-bridge' chown -R clickhouse-bridge:clickhouse-bridge '/usr/bin/clickhouse-library-bridge' Password for default user is empty string. See /etc/clickhouse-server/users.xml and /etc/clickhouse-server/users.d to change it. Setting capabilities for clickhouse binary. This is optional. chown -R clickhouse:clickhouse '/etc/clickhouse-server' ClickHouse has been successfully installed. Start clickhouse-server with: sudo clickhouse start Start clickhouse-client with: clickhouse-client + dpkg -i package_folder/clickhouse-client_23.8.16.10044.altinitystable+asan_amd64.deb Selecting previously unselected package clickhouse-client. (Reading database ... 58906 files and directories currently installed.) Preparing to unpack .../clickhouse-client_23.8.16.10044.altinitystable+asan_amd64.deb ... Unpacking clickhouse-client (23.8.16.10044.altinitystable+asan) ... Setting up clickhouse-client (23.8.16.10044.altinitystable+asan) ... + export THREAD_FUZZER_CPU_TIME_PERIOD_US=1000 + THREAD_FUZZER_CPU_TIME_PERIOD_US=1000 + export THREAD_FUZZER_SLEEP_PROBABILITY=0.1 + THREAD_FUZZER_SLEEP_PROBABILITY=0.1 + export THREAD_FUZZER_SLEEP_TIME_US=100000 + THREAD_FUZZER_SLEEP_TIME_US=100000 + export THREAD_FUZZER_pthread_mutex_lock_BEFORE_MIGRATE_PROBABILITY=1 + THREAD_FUZZER_pthread_mutex_lock_BEFORE_MIGRATE_PROBABILITY=1 + export THREAD_FUZZER_pthread_mutex_lock_AFTER_MIGRATE_PROBABILITY=1 + THREAD_FUZZER_pthread_mutex_lock_AFTER_MIGRATE_PROBABILITY=1 + export THREAD_FUZZER_pthread_mutex_unlock_BEFORE_MIGRATE_PROBABILITY=1 + THREAD_FUZZER_pthread_mutex_unlock_BEFORE_MIGRATE_PROBABILITY=1 + export THREAD_FUZZER_pthread_mutex_unlock_AFTER_MIGRATE_PROBABILITY=1 + THREAD_FUZZER_pthread_mutex_unlock_AFTER_MIGRATE_PROBABILITY=1 + export THREAD_FUZZER_pthread_mutex_lock_BEFORE_SLEEP_PROBABILITY=0.001 + THREAD_FUZZER_pthread_mutex_lock_BEFORE_SLEEP_PROBABILITY=0.001 + export THREAD_FUZZER_pthread_mutex_lock_AFTER_SLEEP_PROBABILITY=0.001 + THREAD_FUZZER_pthread_mutex_lock_AFTER_SLEEP_PROBABILITY=0.001 + export THREAD_FUZZER_pthread_mutex_unlock_BEFORE_SLEEP_PROBABILITY=0.001 + THREAD_FUZZER_pthread_mutex_unlock_BEFORE_SLEEP_PROBABILITY=0.001 + export THREAD_FUZZER_pthread_mutex_unlock_AFTER_SLEEP_PROBABILITY=0.001 + THREAD_FUZZER_pthread_mutex_unlock_AFTER_SLEEP_PROBABILITY=0.001 + export THREAD_FUZZER_pthread_mutex_lock_BEFORE_SLEEP_TIME_US=10000 + THREAD_FUZZER_pthread_mutex_lock_BEFORE_SLEEP_TIME_US=10000 + export THREAD_FUZZER_pthread_mutex_lock_AFTER_SLEEP_TIME_US=10000 + THREAD_FUZZER_pthread_mutex_lock_AFTER_SLEEP_TIME_US=10000 + export THREAD_FUZZER_pthread_mutex_unlock_BEFORE_SLEEP_TIME_US=10000 + THREAD_FUZZER_pthread_mutex_unlock_BEFORE_SLEEP_TIME_US=10000 + export THREAD_FUZZER_pthread_mutex_unlock_AFTER_SLEEP_TIME_US=10000 + THREAD_FUZZER_pthread_mutex_unlock_AFTER_SLEEP_TIME_US=10000 + export THREAD_FUZZER_EXPLICIT_SLEEP_PROBABILITY=0.01 + THREAD_FUZZER_EXPLICIT_SLEEP_PROBABILITY=0.01 + export THREAD_FUZZER_EXPLICIT_MEMORY_EXCEPTION_PROBABILITY=0.01 + THREAD_FUZZER_EXPLICIT_MEMORY_EXCEPTION_PROBABILITY=0.01 + export ZOOKEEPER_FAULT_INJECTION=1 + ZOOKEEPER_FAULT_INJECTION=1 + configure + export USE_DATABASE_ORDINARY=1 + USE_DATABASE_ORDINARY=1 + export EXPORT_S3_STORAGE_POLICIES=1 + EXPORT_S3_STORAGE_POLICIES=1 + /usr/share/clickhouse-test/config/install.sh + DEST_SERVER_PATH=/etc/clickhouse-server + DEST_CLIENT_PATH=/etc/clickhouse-client +++ dirname /usr/share/clickhouse-test/config/install.sh ++ cd /usr/share/clickhouse-test/config ++ pwd -P + SRC_PATH=/usr/share/clickhouse-test/config + echo 'Going to install test configs from /usr/share/clickhouse-test/config into /etc/clickhouse-server' + mkdir -p /etc/clickhouse-server/config.d/ Going to install test configs from /usr/share/clickhouse-test/config into /etc/clickhouse-server + mkdir -p /etc/clickhouse-server/users.d/ + mkdir -p /etc/clickhouse-client + ln -sf /usr/share/clickhouse-test/config/config.d/zookeeper_write.xml /etc/clickhouse-server/config.d/ + ln -sf /usr/share/clickhouse-test/config/config.d/listen.xml /etc/clickhouse-server/config.d/ + ln -sf /usr/share/clickhouse-test/config/config.d/text_log.xml /etc/clickhouse-server/config.d/ + ln -sf /usr/share/clickhouse-test/config/config.d/custom_settings_prefixes.xml /etc/clickhouse-server/config.d/ + ln -sf /usr/share/clickhouse-test/config/config.d/enable_access_control_improvements.xml /etc/clickhouse-server/config.d/ + ln -sf /usr/share/clickhouse-test/config/config.d/macros.xml /etc/clickhouse-server/config.d/ + ln -sf /usr/share/clickhouse-test/config/config.d/disks.xml /etc/clickhouse-server/config.d/ + ln -sf /usr/share/clickhouse-test/config/config.d/secure_ports.xml /etc/clickhouse-server/config.d/ + ln -sf /usr/share/clickhouse-test/config/config.d/clusters.xml /etc/clickhouse-server/config.d/ + ln -sf /usr/share/clickhouse-test/config/config.d/graphite.xml /etc/clickhouse-server/config.d/ + ln -sf /usr/share/clickhouse-test/config/config.d/database_atomic.xml /etc/clickhouse-server/config.d/ + ln -sf /usr/share/clickhouse-test/config/config.d/max_concurrent_queries.xml /etc/clickhouse-server/config.d/ + ln -sf /usr/share/clickhouse-test/config/config.d/merge_tree_settings.xml /etc/clickhouse-server/config.d/ + ln -sf /usr/share/clickhouse-test/config/config.d/merge_tree_old_dirs_cleanup.xml /etc/clickhouse-server/config.d/ + ln -sf /usr/share/clickhouse-test/config/config.d/test_cluster_with_incorrect_pw.xml /etc/clickhouse-server/config.d/ + ln -sf /usr/share/clickhouse-test/config/config.d/keeper_port.xml /etc/clickhouse-server/config.d/ + ln -sf /usr/share/clickhouse-test/config/config.d/logging_no_rotate.xml /etc/clickhouse-server/config.d/ + ln -sf /usr/share/clickhouse-test/config/config.d/merge_tree.xml /etc/clickhouse-server/config.d/ + ln -sf /usr/share/clickhouse-test/config/config.d/lost_forever_check.xml /etc/clickhouse-server/config.d/ + ln -sf /usr/share/clickhouse-test/config/config.d/metadata_cache.xml /etc/clickhouse-server/config.d/ + ln -sf /usr/share/clickhouse-test/config/config.d/tcp_with_proxy.xml /etc/clickhouse-server/config.d/ + ln -sf /usr/share/clickhouse-test/config/config.d/prometheus.xml /etc/clickhouse-server/config.d/ + ln -sf /usr/share/clickhouse-test/config/config.d/top_level_domains_lists.xml /etc/clickhouse-server/config.d/ + ln -sf /usr/share/clickhouse-test/config/config.d/top_level_domains_path.xml /etc/clickhouse-server/config.d/ + ln -sf /usr/share/clickhouse-test/config/config.d/transactions.xml /etc/clickhouse-server/config.d/ + ln -sf /usr/share/clickhouse-test/config/config.d/encryption.xml /etc/clickhouse-server/config.d/ + ln -sf /usr/share/clickhouse-test/config/config.d/CORS.xml /etc/clickhouse-server/config.d/ + ln -sf /usr/share/clickhouse-test/config/config.d/zookeeper_log.xml /etc/clickhouse-server/config.d/ + ln -sf /usr/share/clickhouse-test/config/config.d/logger_trace.xml /etc/clickhouse-server/config.d/ + ln -sf /usr/share/clickhouse-test/config/config.d/named_collection.xml /etc/clickhouse-server/config.d/ + ln -sf /usr/share/clickhouse-test/config/config.d/ssl_certs.xml /etc/clickhouse-server/config.d/ + ln -sf /usr/share/clickhouse-test/config/config.d/filesystem_cache_log.xml /etc/clickhouse-server/config.d/ + ln -sf /usr/share/clickhouse-test/config/config.d/session_log.xml /etc/clickhouse-server/config.d/ + ln -sf /usr/share/clickhouse-test/config/config.d/system_unfreeze.xml /etc/clickhouse-server/config.d/ + ln -sf /usr/share/clickhouse-test/config/config.d/enable_zero_copy_replication.xml /etc/clickhouse-server/config.d/ + ln -sf /usr/share/clickhouse-test/config/config.d/nlp.xml /etc/clickhouse-server/config.d/ + ln -sf /usr/share/clickhouse-test/config/config.d/forbidden_headers.xml /etc/clickhouse-server/config.d/ + ln -sf /usr/share/clickhouse-test/config/config.d/enable_keeper_map.xml /etc/clickhouse-server/config.d/ + ln -sf /usr/share/clickhouse-test/config/config.d/custom_disks_base_path.xml /etc/clickhouse-server/config.d/ + ln -sf /usr/share/clickhouse-test/config/config.d/display_name.xml /etc/clickhouse-server/config.d/ + ln -sf /usr/share/clickhouse-test/config/config.d/reverse_dns_query_function.xml /etc/clickhouse-server/config.d/ + ln -sf /usr/share/clickhouse-test/config/config.d/compressed_marks_and_index.xml /etc/clickhouse-server/config.d/ + ln -sf /usr/share/clickhouse-test/config/config.d/disable_s3_env_credentials.xml /etc/clickhouse-server/config.d/ + ln -sf /usr/share/clickhouse-test/config/config.d/enable_wait_for_shutdown_replicated_tables.xml /etc/clickhouse-server/config.d/ + ln -sf /usr/share/clickhouse-test/config/config.d/backups.xml /etc/clickhouse-server/config.d/ + ln -sf /usr/share/clickhouse-test/config/config.d/filesystem_caches_path.xml /etc/clickhouse-server/config.d/ + ln -sf /usr/share/clickhouse-test/config/config.d/validate_tcp_client_information.xml /etc/clickhouse-server/config.d/ + '[' /etc/clickhouse-server = /etc/clickhouse-server ']' + ln -sf /usr/share/clickhouse-test/config/config.d/legacy_geobase.xml /etc/clickhouse-server/config.d/ + ln -sf /usr/share/clickhouse-test/config/users.d/log_queries.xml /etc/clickhouse-server/users.d/ + ln -sf /usr/share/clickhouse-test/config/users.d/readonly.xml /etc/clickhouse-server/users.d/ + ln -sf /usr/share/clickhouse-test/config/users.d/access_management.xml /etc/clickhouse-server/users.d/ + ln -sf /usr/share/clickhouse-test/config/users.d/database_atomic_drop_detach_sync.xml /etc/clickhouse-server/users.d/ + ln -sf /usr/share/clickhouse-test/config/users.d/opentelemetry.xml /etc/clickhouse-server/users.d/ + ln -sf /usr/share/clickhouse-test/config/users.d/remote_queries.xml /etc/clickhouse-server/users.d/ + ln -sf /usr/share/clickhouse-test/config/users.d/session_log_test.xml /etc/clickhouse-server/users.d/ + ln -sf /usr/share/clickhouse-test/config/users.d/memory_profiler.xml /etc/clickhouse-server/users.d/ + ln -sf /usr/share/clickhouse-test/config/users.d/no_fsync_metadata.xml /etc/clickhouse-server/users.d/ + ln -sf /usr/share/clickhouse-test/config/users.d/filelog.xml /etc/clickhouse-server/users.d/ + ln -sf /usr/share/clickhouse-test/config/users.d/enable_blobs_check.xml /etc/clickhouse-server/users.d/ + ln -sf /usr/share/clickhouse-test/config/users.d/marks.xml /etc/clickhouse-server/users.d/ + ln -sf /usr/share/clickhouse-test/config/users.d/insert_keeper_retries.xml /etc/clickhouse-server/users.d/ + ln -sf /usr/share/clickhouse-test/config/users.d/prefetch_settings.xml /etc/clickhouse-server/users.d/ + ln -sf /usr/share/clickhouse-test/config/users.d/nonconst_timezone.xml /etc/clickhouse-server/users.d/ + [[ -n '' ]] + ln -sf /usr/share/clickhouse-test/config/users.d/timeouts.xml /etc/clickhouse-server/users.d/ + ln -sf /usr/share/clickhouse-test/config/ints_dictionary.xml /etc/clickhouse-server/ + ln -sf /usr/share/clickhouse-test/config/strings_dictionary.xml /etc/clickhouse-server/ + ln -sf /usr/share/clickhouse-test/config/decimals_dictionary.xml /etc/clickhouse-server/ + ln -sf /usr/share/clickhouse-test/config/executable_dictionary.xml /etc/clickhouse-server/ + ln -sf /usr/share/clickhouse-test/config/executable_pool_dictionary.xml /etc/clickhouse-server/ + ln -sf /usr/share/clickhouse-test/config/test_function.xml /etc/clickhouse-server/ + ln -sf /usr/share/clickhouse-test/config/top_level_domains /etc/clickhouse-server/ + ln -sf /usr/share/clickhouse-test/config/regions_hierarchy.txt /etc/clickhouse-server/config.d/ + ln -sf /usr/share/clickhouse-test/config/regions_names_en.txt /etc/clickhouse-server/config.d/ + ln -sf /usr/share/clickhouse-test/config/ext-en.txt /etc/clickhouse-server/config.d/ + ln -sf /usr/share/clickhouse-test/config/ext-ru.txt /etc/clickhouse-server/config.d/ + ln -sf /usr/share/clickhouse-test/config/lem-en.bin /etc/clickhouse-server/config.d/ + ln -sf /usr/share/clickhouse-test/config/server.key /etc/clickhouse-server/ + ln -sf /usr/share/clickhouse-test/config/server.crt /etc/clickhouse-server/ + ln -sf /usr/share/clickhouse-test/config/dhparam.pem /etc/clickhouse-server/ + ln -sf --backup=simple --suffix=_original.xml /usr/share/clickhouse-test/config/config.d/query_masking_rules.xml /etc/clickhouse-server/config.d/ + [[ -n 1 ]] + [[ 1 -eq 1 ]] + rm -f /etc/clickhouse-server/config.d/zookeeper.xml + ln -sf /usr/share/clickhouse-test/config/config.d/zookeeper_fault_injection.xml /etc/clickhouse-server/config.d/ + create_snapshot_on_exit=0 + sed --follow-symlinks -i 's|true|0|' /etc/clickhouse-server/config.d/keeper_port.xml + [[ -n '' ]] + [[ -n 1 ]] + [[ 1 -eq 1 ]] + ln -sf /usr/share/clickhouse-test/config/users.d/database_ordinary.xml /etc/clickhouse-server/users.d/ + [[ -n '' ]] + ARM=aarch64 ++ uname -m + OS=x86_64 + [[ -n 1 ]] + echo x86_64 + [[ '' -eq 1 ]] x86_64 Adding azure configuration + [[ x86_64 == \a\a\r\c\h\6\4 ]] + echo 'Adding azure configuration' + ln -sf /usr/share/clickhouse-test/config/config.d/azure_storage_conf.xml /etc/clickhouse-server/config.d/ + ln -sf /usr/share/clickhouse-test/config/config.d/storage_conf.xml /etc/clickhouse-server/config.d/ + ln -sf /usr/share/clickhouse-test/config/users.d/s3_cache.xml /etc/clickhouse-server/users.d/ + [[ -n '' ]] + ln -sf /usr/share/clickhouse-test/config/client_config.xml /etc/clickhouse-client/config.xml + sudo cat /etc/clickhouse-server/config.d/keeper_port.xml + sed 's|100000|10000|' + sudo mv /etc/clickhouse-server/config.d/keeper_port.xml.tmp /etc/clickhouse-server/config.d/keeper_port.xml + sudo chown clickhouse /etc/clickhouse-server/config.d/keeper_port.xml + sudo chgrp clickhouse /etc/clickhouse-server/config.d/keeper_port.xml + echo 'ASAN_OPTIONS='\''malloc_context_size=10 verbosity=1 allocator_release_to_os_interval_ms=10000'\''' + export 'ASAN_OPTIONS=malloc_context_size=10 allocator_release_to_os_interval_ms=10000' + ASAN_OPTIONS='malloc_context_size=10 allocator_release_to_os_interval_ms=10000' + sudo chown root: /var/lib/clickhouse + echo '1' + local total_mem ++ awk '/MemTotal/ { print $(NF-1) }' /proc/meminfo + total_mem=32080792 + total_mem=32850731008 + max_server_memory_usage_to_ram_ratio=0.5 + echo 'Setting max_server_memory_usage_to_ram_ratio to 0.5' + cat Setting max_server_memory_usage_to_ram_ratio to 0.5 + local max_users_mem + max_users_mem=9855219302 + echo 'Setting max_memory_usage_for_user=9855219302 and max_memory_usage for queries to 10G' + cat Setting max_memory_usage_for_user=9855219302 and max_memory_usage for queries to 10G + cat + cat + ./setup_minio.sh stateless + azurite-blob --blobHost 0.0.0.0 --blobPort 10000 --debug /azurite_log + export MINIO_ROOT_USER=clickhouse + MINIO_ROOT_USER=clickhouse + export MINIO_ROOT_PASSWORD=clickhouse + MINIO_ROOT_PASSWORD=clickhouse + main stateless + local query_dir ++ check_arg stateless ++ local query_dir ++ '[' '!' 1 -eq 1 ']' ++ case "$1" in ++ query_dir=0_stateless ++ echo 0_stateless + query_dir=0_stateless + '[' '!' -f ./minio ']' + start_minio + mkdir -p ./minio_data + ./minio --version minio version RELEASE.2024-07-31T05-46-26Z (commit-id=a9dc061d847277e30c5c6918d6de6f0606f9d285) Runtime: go1.22.5 linux/amd64 License: GNU AGPLv3 - https://www.gnu.org/licenses/agpl-3.0.html Copyright: 2015-2024 MinIO, Inc. + wait_for_it + ./minio server --address :11111 ./minio_data + local counter=0 + local max_counter=60 + local url=http://localhost:11111 + params=('--silent' '--verbose') + local params + curl --silent --verbose http://localhost:11111 + grep AccessDenied trying to connect to minio + [[ 0 == \6\0 ]] + echo 'trying to connect to minio' + sleep 1 Azurite Blob service is starting on 0.0.0.0:10000 Azurite Blob service successfully listens on http://0.0.0.0:10000 INFO: Formatting 1st pool, 1 set(s), 1 drives per set. INFO: WARNING: Host local has more than 0 drives of set. A host failure will result in data becoming unavailable. MinIO Object Storage Server Copyright: 2015-2026 MinIO, Inc. License: GNU AGPLv3 - https://www.gnu.org/licenses/agpl-3.0.html Version: RELEASE.2024-07-31T05-46-26Z (go1.22.5 linux/amd64) API: http://172.17.0.2:11111 http://127.0.0.1:11111 WebUI: http://172.17.0.2:40509 http://127.0.0.1:40509 Docs: https://min.io/docs/minio/linux/index.html + counter=1 + curl --silent --verbose http://localhost:11111 + grep AccessDenied AccessDeniedAccess Denied./18E37005DE48FE4C7dc7eb22d3288ec80374614e9088e31d3668a6922ead55932dd2a8e56373820f + lsof -i :11111 COMMAND PID USER FD TYPE DEVICE SIZE/OFF NODE NAME minio 239 root 8u IPv6 25252 0t0 TCP *:11111 (LISTEN) minio 239 root 9u IPv4 25251 0t0 TCP localhost:11111 (LISTEN) minio 239 root 10u IPv6 25253 0t0 TCP localhost:11111 (LISTEN) + sleep 5 + setup_minio stateless + local test_type=stateless + ./mc alias set clickminio http://localhost:11111 clickhouse clickhouse Added `clickminio` successfully. + ./mc admin user add clickminio test testtest Added user `test` successfully. + ./mc admin policy attach clickminio readwrite --user=test Attached Policies: [readwrite] To User: test + ./mc mb clickminio/test Bucket created successfully `clickminio/test`. + '[' stateless = stateless ']' + ./mc anonymous set public clickminio/test Access permission for `clickminio/test` is set to `public` + upload_data 0_stateless /usr/share/clickhouse-test + local query_dir=0_stateless + local test_path=/usr/share/clickhouse-test + local data_path=/usr/share/clickhouse-test/queries/0_stateless/data_minio ++ ls /usr/share/clickhouse-test/queries/0_stateless/data_minio 02366_data.jsonl + for file in $(ls "${data_path}") + echo 02366_data.jsonl + ./mc cp /usr/share/clickhouse-test/queries/0_stateless/data_minio/02366_data.jsonl clickminio/test/02366_data.jsonl `/usr/share/clickhouse-test/queries/0_stateless/data_minio/02366_data.jsonl` -> `clickminio/test/02366_data.jsonl` Total: 0 B, Transferred: 0 B, Speed: 0 B/s 02731.arrow + for file in $(ls "${data_path}") + echo 02731.arrow + ./mc cp /usr/share/clickhouse-test/queries/0_stateless/data_minio/02731.arrow clickminio/test/02731.arrow `/usr/share/clickhouse-test/queries/0_stateless/data_minio/02731.arrow` -> `clickminio/test/02731.arrow` Total: 3.82 MiB, Transferred: 3.82 MiB, Speed: 85.37 MiB/s 02731.parquet + for file in $(ls "${data_path}") + echo 02731.parquet + ./mc cp /usr/share/clickhouse-test/queries/0_stateless/data_minio/02731.parquet clickminio/test/02731.parquet `/usr/share/clickhouse-test/queries/0_stateless/data_minio/02731.parquet` -> `clickminio/test/02731.parquet` Total: 1.57 MiB, Transferred: 1.57 MiB, Speed: 54.84 MiB/s a.tsv + for file in $(ls "${data_path}") + echo a.tsv + ./mc cp /usr/share/clickhouse-test/queries/0_stateless/data_minio/a.tsv clickminio/test/a.tsv `/usr/share/clickhouse-test/queries/0_stateless/data_minio/a.tsv` -> `clickminio/test/a.tsv` Total: 24 B, Transferred: 24 B, Speed: 1.77 KiB/s + for file in $(ls "${data_path}") + echo b.tsv + ./mc cp /usr/share/clickhouse-test/queries/0_stateless/data_minio/b.tsv clickminio/test/b.tsv b.tsv `/usr/share/clickhouse-test/queries/0_stateless/data_minio/b.tsv` -> `clickminio/test/b.tsv` Total: 33 B, Transferred: 33 B, Speed: 2.46 KiB/s + for file in $(ls "${data_path}") + echo c.tsv + ./mc cp /usr/share/clickhouse-test/queries/0_stateless/data_minio/c.tsv clickminio/test/c.tsv c.tsv `/usr/share/clickhouse-test/queries/0_stateless/data_minio/c.tsv` -> `clickminio/test/c.tsv` Total: 33 B, Transferred: 33 B, Speed: 2.30 KiB/s tsv_with_header.tsv + for file in $(ls "${data_path}") + echo tsv_with_header.tsv + ./mc cp /usr/share/clickhouse-test/queries/0_stateless/data_minio/tsv_with_header.tsv clickminio/test/tsv_with_header.tsv `/usr/share/clickhouse-test/queries/0_stateless/data_minio/tsv_with_header.tsv` -> `clickminio/test/tsv_with_header.tsv` Total: 44 B, Transferred: 44 B, Speed: 3.52 KiB/s + setup_aws_credentials + local minio_root_user=clickhouse + local minio_root_password=clickhouse + mkdir -p /root/.aws + cat + config_logs_export_cluster /etc/clickhouse-server/config.d/system_logs_export.yaml + set +x File /tmp/export-logs-config.sh does not exist, do not setup + start + counter=0 + clickhouse-client --query 'SELECT 1' Code: 210. DB::NetException: Connection refused (localhost:9000). (NETWORK_ERROR) + '[' 0 -gt 120 ']' + clickhouse start --user root + sleep 0.5 + counter=1 + clickhouse-client --query 'SELECT 1' Code: 210. DB::NetException: Connection refused (localhost:9000). (NETWORK_ERROR) + '[' 1 -gt 120 ']' + clickhouse start --user root + sleep 0.5 + counter=2 + clickhouse-client --query 'SELECT 1' Code: 210. DB::NetException: Connection refused (localhost:9000). (NETWORK_ERROR) + '[' 2 -gt 120 ']' + clickhouse start --user root + sleep 0.5 + counter=3 + clickhouse-client --query 'SELECT 1' Code: 210. DB::NetException: Connection refused (localhost:9000). (NETWORK_ERROR) + '[' 3 -gt 120 ']' + clickhouse start --user root + sleep 0.5 + counter=4 + clickhouse-client --query 'SELECT 1' Code: 210. DB::NetException: Connection refused (localhost:9000). (NETWORK_ERROR) + '[' 4 -gt 120 ']' + clickhouse start --user root + sleep 0.5 + counter=5 + clickhouse-client --query 'SELECT 1' Code: 210. DB::NetException: Connection refused (localhost:9000). (NETWORK_ERROR) + '[' 5 -gt 120 ']' + clickhouse start --user root + sleep 0.5 + counter=6 + clickhouse-client --query 'SELECT 1' Code: 210. DB::NetException: Connection refused (localhost:9000). (NETWORK_ERROR) + '[' 6 -gt 120 ']' + clickhouse start --user root + sleep 0.5 + counter=7 + clickhouse-client --query 'SELECT 1' Code: 210. DB::NetException: Connection refused (localhost:9000). (NETWORK_ERROR) + '[' 7 -gt 120 ']' + clickhouse start --user root + sleep 0.5 + counter=8 + clickhouse-client --query 'SELECT 1' Code: 210. DB::NetException: Connection refused (localhost:9000). (NETWORK_ERROR) + '[' 8 -gt 120 ']' + clickhouse start --user root + sleep 0.5 + counter=9 + clickhouse-client --query 'SELECT 1' Code: 210. DB::NetException: Connection refused (localhost:9000). (NETWORK_ERROR) + '[' 9 -gt 120 ']' + clickhouse start --user root + sleep 0.5 + counter=10 + clickhouse-client --query 'SELECT 1' Code: 210. DB::NetException: Connection refused (localhost:9000). (NETWORK_ERROR) + '[' 10 -gt 120 ']' + clickhouse start --user root + sleep 0.5 + counter=11 + clickhouse-client --query 'SELECT 1' Code: 210. DB::NetException: Connection refused (localhost:9000). (NETWORK_ERROR) + '[' 11 -gt 120 ']' + clickhouse start --user root + sleep 0.5 + counter=12 + clickhouse-client --query 'SELECT 1' Code: 210. DB::NetException: Connection refused (localhost:9000). (NETWORK_ERROR) + '[' 12 -gt 120 ']' + clickhouse start --user root + sleep 0.5 + counter=13 + clickhouse-client --query 'SELECT 1' Code: 210. DB::NetException: Connection refused (localhost:9000). (NETWORK_ERROR) + '[' 13 -gt 120 ']' + clickhouse start --user root + sleep 0.5 127.0.0.1 - - [30/Oct/2026:22:44:27 +0000] "PUT /devstoreaccount1/cont?restype=container HTTP/1.1" 201 - 127.0.0.1 - - [30/Oct/2026:22:44:27 +0000] "PUT /devstoreaccount1/cont/xqnctgzpwkmdzvixnnwryvnidexfyqpn?blockid=fpcrnnkhlhymbvpqiagykwfcxsdtewjddurppgnnbybclbekrurpowiqqmiwwfhp&comp=block HTTP/1.1" 201 - 127.0.0.1 - - [30/Oct/2026:22:44:27 +0000] "PUT /devstoreaccount1/cont/xqnctgzpwkmdzvixnnwryvnidexfyqpn?comp=blocklist HTTP/1.1" 201 - 127.0.0.1 - - [30/Oct/2026:22:44:27 +0000] "GET /devstoreaccount1/cont/xqnctgzpwkmdzvixnnwryvnidexfyqpn HTTP/1.1" 206 4 127.0.0.1 - - [30/Oct/2026:22:44:27 +0000] "GET /devstoreaccount1/cont/xqnctgzpwkmdzvixnnwryvnidexfyqpn HTTP/1.1" 206 2 127.0.0.1 - - [30/Oct/2026:22:44:27 +0000] "DELETE /devstoreaccount1/cont/xqnctgzpwkmdzvixnnwryvnidexfyqpn HTTP/1.1" 202 - + counter=14 + clickhouse-client --query 'SELECT 1' 1 + attach_gdb_to_clickhouse ++ kill -l SIGRTMIN + RTMIN=34 + echo ' set follow-fork-mode parent handle SIGHUP nostop noprint pass handle SIGINT nostop noprint pass handle SIGQUIT nostop noprint pass handle SIGPIPE nostop noprint pass handle SIGTERM nostop noprint pass handle SIGUSR1 nostop noprint pass handle SIGUSR2 nostop noprint pass handle SIG34 nostop noprint pass info signals continue backtrace full thread apply all backtrace full info registers disassemble /s up disassemble /s up disassemble /s p "done" detach quit ' + sleep 5 + ts '%Y-%m-%d %H:%M:%S' ++ cat /var/run/clickhouse-server/clickhouse-server.pid + gdb -batch -command script.gdb -p 454 + run_with_retry 60 clickhouse-client --query 'SELECT '\''Connected to clickhouse-server after attaching gdb'\''' + [[ hxB =~ e ]] + set_e=false + set +e + local total_retries=60 + shift + local retry=0 + '[' 0 -ge 60 ']' + clickhouse-client --query 'SELECT '\''Connected to clickhouse-server after attaching gdb'\''' Connected to clickhouse-server after attaching gdb + false + return + setup_logs_replication + set +x File /tmp/export-logs-config.sh does not exist, do not setup + /s3downloader --url-prefix https://s3.amazonaws.com/clickhouse-datasets --dataset-names hits visits INFO:root:Will fetch following datasets: hits, visits INFO:root:Processing hits INFO:root:Downloading from https://s3.amazonaws.com/clickhouse-datasets/hits/partitions/hits_v1.tar to temp path /tmp/0qle13q4 INFO:root:Content length is 1271623680 bytes INFO:root:Downloading finished INFO:root:Will unpack data from temp path /tmp/0qle13q4 to clickhouse db /var/lib/clickhouse/ INFO:root:Unpack finished INFO:root:Will remove downloaded file /tmp/0qle13q4 from filesystem if it exists INFO:root:Processing of hits finished INFO:root:Processing visits INFO:root:Downloading from https://s3.amazonaws.com/clickhouse-datasets/visits/partitions/visits_v1.tar to temp path /tmp/r5qtfwtg INFO:root:Content length is 563968000 bytes INFO:root:Downloading finished INFO:root:Will unpack data from temp path /tmp/r5qtfwtg to clickhouse db /var/lib/clickhouse/ INFO:root:Unpack finished INFO:root:Will remove downloaded file /tmp/r5qtfwtg from filesystem if it exists INFO:root:Processing of visits finished INFO:root:Fetch finished, enjoy your tables! + chmod 777 -R /var/lib/clickhouse + clickhouse-client --query 'ATTACH DATABASE IF NOT EXISTS datasets ENGINE = Ordinary' + clickhouse-client --query 'CREATE DATABASE IF NOT EXISTS test' + stop + local max_tries=90 + local check_hang=true + local pid ++ cat /var/run/clickhouse-server/clickhouse-server.pid + pid=454 + clickhouse stop --max-tries 90 --do-not-kill script.gdb:13: Error in sourced command file: No stack. /var/run/clickhouse-server/clickhouse-server.pid file exists and contains pid = 454. The process with pid = 454 is running. Sent terminate signal to process with pid 454. Waiting for server to stop /var/run/clickhouse-server/clickhouse-server.pid file exists and contains pid = 454. The process with pid = 454 is running. Waiting for server to stop /var/run/clickhouse-server/clickhouse-server.pid file exists and contains pid = 454. The process with pid = 454 is running. Waiting for server to stop /var/run/clickhouse-server/clickhouse-server.pid file exists and contains pid = 454. The process with pid = 454 is running. Waiting for server to stop /var/run/clickhouse-server/clickhouse-server.pid file exists and contains pid = 454. The process with pid = 454 is running. Waiting for server to stop /var/run/clickhouse-server/clickhouse-server.pid file exists and contains pid = 454. The process with pid = 454 is running. Waiting for server to stop /var/run/clickhouse-server/clickhouse-server.pid file exists and contains pid = 454. The process with pid = 454 is running. Waiting for server to stop /var/run/clickhouse-server/clickhouse-server.pid file exists and contains pid = 454. The process with pid = 454 is running. Waiting for server to stop Found pid = 454 in the list of running processes. The process with pid = 454 is running. Waiting for server to stop Found pid = 454 in the list of running processes. The process with pid = 454 is running. Waiting for server to stop Found pid = 454 in the list of running processes. The process with pid = 454 is running. Waiting for server to stop Found pid = 454 in the list of running processes. The process with pid = 454 is running. Waiting for server to stop Found pid = 454 in the list of running processes. The process with pid = 454 is running. Waiting for server to stop Found pid = 454 in the list of running processes. The process with pid = 454 is running. Waiting for server to stop Found pid = 454 in the list of running processes. The process with pid = 454 is running. Waiting for server to stop Found pid = 454 in the list of running processes. The process with pid = 454 is running. Waiting for server to stop Found pid = 454 in the list of running processes. The process with pid = 454 is running. Waiting for server to stop Found pid = 454 in the list of running processes. The process with pid = 454 is running. Waiting for server to stop Found pid = 454 in the list of running processes. The process with pid = 454 is running. Waiting for server to stop Found pid = 454 in the list of running processes. The process with pid = 454 is running. Waiting for server to stop Found pid = 454 in the list of running processes. The process with pid = 454 is running. Waiting for server to stop Found pid = 454 in the list of running processes. The process with pid = 454 is running. Waiting for server to stop Found pid = 454 in the list of running processes. The process with pid = 454 is running. Waiting for server to stop Found pid = 454 in the list of running processes. The process with pid = 454 is running. Waiting for server to stop Found pid = 454 in the list of running processes. The process with pid = 454 is running. Waiting for server to stop Found pid = 454 in the list of running processes. The process with pid = 454 is running. Waiting for server to stop Found pid = 454 in the list of running processes. The process with pid = 454 is running. Waiting for server to stop Found pid = 454 in the list of running processes. The process with pid = 454 is running. Waiting for server to stop Now there is no clickhouse-server process. Server stopped + return + mv /var/log/clickhouse-server/clickhouse-server.log /var/log/clickhouse-server/clickhouse-server.initial.log + start + counter=0 + clickhouse-client --query 'SELECT 1' Code: 210. DB::NetException: Connection refused (localhost:9000). (NETWORK_ERROR) + '[' 0 -gt 120 ']' + clickhouse start --user root + sleep 0.5 + counter=1 + clickhouse-client --query 'SELECT 1' Code: 210. DB::NetException: Connection refused (localhost:9000). (NETWORK_ERROR) + '[' 1 -gt 120 ']' + clickhouse start --user root + sleep 0.5 + counter=2 + clickhouse-client --query 'SELECT 1' Code: 210. DB::NetException: Connection refused (localhost:9000). (NETWORK_ERROR) + '[' 2 -gt 120 ']' + clickhouse start --user root + sleep 0.5 + counter=3 + clickhouse-client --query 'SELECT 1' Code: 210. DB::NetException: Connection refused (localhost:9000). (NETWORK_ERROR) + '[' 3 -gt 120 ']' + clickhouse start --user root + sleep 0.5 + counter=4 + clickhouse-client --query 'SELECT 1' Code: 210. DB::NetException: Connection refused (localhost:9000). (NETWORK_ERROR) + '[' 4 -gt 120 ']' + clickhouse start --user root + sleep 0.5 + counter=5 + clickhouse-client --query 'SELECT 1' Code: 210. DB::NetException: Connection refused (localhost:9000). (NETWORK_ERROR) + '[' 5 -gt 120 ']' + clickhouse start --user root + sleep 0.5 + counter=6 + clickhouse-client --query 'SELECT 1' Code: 210. DB::NetException: Connection refused (localhost:9000). (NETWORK_ERROR) + '[' 6 -gt 120 ']' + clickhouse start --user root + sleep 0.5 + counter=7 + clickhouse-client --query 'SELECT 1' Code: 210. DB::NetException: Connection refused (localhost:9000). (NETWORK_ERROR) + '[' 7 -gt 120 ']' + clickhouse start --user root + sleep 0.5 + counter=8 + clickhouse-client --query 'SELECT 1' Code: 210. DB::NetException: Connection refused (localhost:9000). (NETWORK_ERROR) + '[' 8 -gt 120 ']' + clickhouse start --user root + sleep 0.5 + counter=9 + clickhouse-client --query 'SELECT 1' Code: 210. DB::NetException: Connection refused (localhost:9000). (NETWORK_ERROR) + '[' 9 -gt 120 ']' + clickhouse start --user root + sleep 0.5 + counter=10 + clickhouse-client --query 'SELECT 1' Code: 210. DB::NetException: Connection refused (localhost:9000). (NETWORK_ERROR) + '[' 10 -gt 120 ']' + clickhouse start --user root + sleep 0.5 + counter=11 + clickhouse-client --query 'SELECT 1' Code: 210. DB::NetException: Connection refused (localhost:9000). (NETWORK_ERROR) + '[' 11 -gt 120 ']' + clickhouse start --user root + sleep 0.5 + counter=12 + clickhouse-client --query 'SELECT 1' Code: 210. DB::NetException: Connection refused (localhost:9000). (NETWORK_ERROR) + '[' 12 -gt 120 ']' + clickhouse start --user root + sleep 0.5 + counter=13 + clickhouse-client --query 'SELECT 1' Code: 210. DB::NetException: Connection refused (localhost:9000). (NETWORK_ERROR) + '[' 13 -gt 120 ']' + clickhouse start --user root + sleep 0.5 + counter=14 + clickhouse-client --query 'SELECT 1' Code: 210. DB::NetException: Connection refused (localhost:9000). (NETWORK_ERROR) + '[' 14 -gt 120 ']' + clickhouse start --user root + sleep 0.5 127.0.0.1 - - [30/Oct/2026:22:47:38 +0000] "PUT /devstoreaccount1/cont?restype=container HTTP/1.1" 409 - 127.0.0.1 - - [30/Oct/2026:22:47:38 +0000] "PUT /devstoreaccount1/cont/zgjjkiihkrxnwbulomcanmhhrithjafm?blockid=ytbyfsznwfzldvdxcmuintsgidsrshtxlrdzzeaswvxtglnykkahmmzwruoqupdm&comp=block HTTP/1.1" 201 - 127.0.0.1 - - [30/Oct/2026:22:47:38 +0000] "PUT /devstoreaccount1/cont/zgjjkiihkrxnwbulomcanmhhrithjafm?comp=blocklist HTTP/1.1" 201 - 127.0.0.1 - - [30/Oct/2026:22:47:38 +0000] "GET /devstoreaccount1/cont/zgjjkiihkrxnwbulomcanmhhrithjafm HTTP/1.1" 206 4 127.0.0.1 - - [30/Oct/2026:22:47:38 +0000] "GET /devstoreaccount1/cont/zgjjkiihkrxnwbulomcanmhhrithjafm HTTP/1.1" 206 2 127.0.0.1 - - [30/Oct/2026:22:47:38 +0000] "DELETE /devstoreaccount1/cont/zgjjkiihkrxnwbulomcanmhhrithjafm HTTP/1.1" 202 - + counter=15 + clickhouse-client --query 'SELECT 1' Code: 210. DB::NetException: Connection refused (localhost:9000). (NETWORK_ERROR) + '[' 15 -gt 120 ']' + clickhouse start --user root + sleep 0.5 + counter=16 + clickhouse-client --query 'SELECT 1' Code: 210. DB::NetException: Connection refused (localhost:9000). (NETWORK_ERROR) + '[' 16 -gt 120 ']' + clickhouse start --user root + sleep 0.5 + counter=17 + clickhouse-client --query 'SELECT 1' Code: 210. DB::NetException: Connection refused (localhost:9000). (NETWORK_ERROR) + '[' 17 -gt 120 ']' + clickhouse start --user root + sleep 0.5 + counter=18 + clickhouse-client --query 'SELECT 1' Code: 210. DB::NetException: Connection refused (localhost:9000). (NETWORK_ERROR) + '[' 18 -gt 120 ']' + clickhouse start --user root + sleep 0.5 + counter=19 + clickhouse-client --query 'SELECT 1' Code: 210. DB::NetException: Connection refused (localhost:9000). (NETWORK_ERROR) + '[' 19 -gt 120 ']' + clickhouse start --user root + sleep 0.5 + counter=20 + clickhouse-client --query 'SELECT 1' 1 + attach_gdb_to_clickhouse ++ kill -l SIGRTMIN + RTMIN=34 + echo ' set follow-fork-mode parent handle SIGHUP nostop noprint pass handle SIGINT nostop noprint pass handle SIGQUIT nostop noprint pass handle SIGPIPE nostop noprint pass handle SIGTERM nostop noprint pass handle SIGUSR1 nostop noprint pass handle SIGUSR2 nostop noprint pass handle SIG34 nostop noprint pass info signals continue backtrace full thread apply all backtrace full info registers disassemble /s up disassemble /s up disassemble /s p "done" detach quit ' + sleep 5 + ts '%Y-%m-%d %H:%M:%S' ++ cat /var/run/clickhouse-server/clickhouse-server.pid + gdb -batch -command script.gdb -p 977 + run_with_retry 60 clickhouse-client --query 'SELECT '\''Connected to clickhouse-server after attaching gdb'\''' + [[ hxB =~ e ]] + set_e=false + set +e + local total_retries=60 + shift + local retry=0 + '[' 0 -ge 60 ']' + clickhouse-client --query 'SELECT '\''Connected to clickhouse-server after attaching gdb'\''' Connected to clickhouse-server after attaching gdb + false + return + clickhouse-client --query 'SHOW TABLES FROM datasets' hits_v1 visits_v1 + clickhouse-client --query 'SHOW TABLES FROM test' + clickhouse-client --query 'CREATE TABLE test.hits_s3 (WatchID UInt64, JavaEnable UInt8, Title String, GoodEvent Int16, EventTime DateTime, EventDate Date, CounterID UInt32, ClientIP UInt32, ClientIP6 FixedString(16), RegionID UInt32, UserID UInt64, CounterClass Int8, OS UInt8, UserAgent UInt8, URL String, Referer String, URLDomain String, RefererDomain String, Refresh UInt8, IsRobot UInt8, RefererCategories Array(UInt16), URLCategories Array(UInt16), URLRegions Array(UInt32), RefererRegions Array(UInt32), ResolutionWidth UInt16, ResolutionHeight UInt16, ResolutionDepth UInt8, FlashMajor UInt8, FlashMinor UInt8, FlashMinor2 String, NetMajor UInt8, NetMinor UInt8, UserAgentMajor UInt16, UserAgentMinor FixedString(2), CookieEnable UInt8, JavascriptEnable UInt8, IsMobile UInt8, MobilePhone UInt8, MobilePhoneModel String, Params String, IPNetworkID UInt32, TraficSourceID Int8, SearchEngineID UInt16, SearchPhrase String, AdvEngineID UInt8, IsArtifical UInt8, WindowClientWidth UInt16, WindowClientHeight UInt16, ClientTimeZone Int16, ClientEventTime DateTime, SilverlightVersion1 UInt8, SilverlightVersion2 UInt8, SilverlightVersion3 UInt32, SilverlightVersion4 UInt16, PageCharset String, CodeVersion UInt32, IsLink UInt8, IsDownload UInt8, IsNotBounce UInt8, FUniqID UInt64, HID UInt32, IsOldCounter UInt8, IsEvent UInt8, IsParameter UInt8, DontCountHits UInt8, WithHash UInt8, HitColor FixedString(1), UTCEventTime DateTime, Age UInt8, Sex UInt8, Income UInt8, Interests UInt16, Robotness UInt8, GeneralInterests Array(UInt16), RemoteIP UInt32, RemoteIP6 FixedString(16), WindowName Int32, OpenerName Int32, HistoryLength Int16, BrowserLanguage FixedString(2), BrowserCountry FixedString(2), SocialNetwork String, SocialAction String, HTTPError UInt16, SendTiming Int32, DNSTiming Int32, ConnectTiming Int32, ResponseStartTiming Int32, ResponseEndTiming Int32, FetchTiming Int32, RedirectTiming Int32, DOMInteractiveTiming Int32, DOMContentLoadedTiming Int32, DOMCompleteTiming Int32, LoadEventStartTiming Int32, LoadEventEndTiming Int32, NSToDOMContentLoadedTiming Int32, FirstPaintTiming Int32, RedirectCount Int8, SocialSourceNetworkID UInt8, SocialSourcePage String, ParamPrice Int64, ParamOrderID String, ParamCurrency FixedString(3), ParamCurrencyID UInt16, GoalsReached Array(UInt32), OpenstatServiceName String, OpenstatCampaignID String, OpenstatAdID String, OpenstatSourceID String, UTMSource String, UTMMedium String, UTMCampaign String, UTMContent String, UTMTerm String, FromTag String, HasGCLID UInt8, RefererHash UInt64, URLHash UInt64, CLID UInt32, YCLID UInt64, ShareService String, ShareURL String, ShareTitle String, ParsedParams Nested(Key1 String, Key2 String, Key3 String, Key4 String, Key5 String, ValueDouble Float64), IslandID FixedString(16), RequestNum UInt32, RequestTry UInt8) ENGINE = MergeTree() PARTITION BY toYYYYMM(EventDate) ORDER BY (CounterID, EventDate, intHash32(UserID)) SAMPLE BY intHash32(UserID) SETTINGS index_granularity = 8192, storage_policy='\''s3_cache'\''' + clickhouse-client --query 'CREATE TABLE test.hits (WatchID UInt64, JavaEnable UInt8, Title String, GoodEvent Int16, EventTime DateTime, EventDate Date, CounterID UInt32, ClientIP UInt32, ClientIP6 FixedString(16), RegionID UInt32, UserID UInt64, CounterClass Int8, OS UInt8, UserAgent UInt8, URL String, Referer String, URLDomain String, RefererDomain String, Refresh UInt8, IsRobot UInt8, RefererCategories Array(UInt16), URLCategories Array(UInt16), URLRegions Array(UInt32), RefererRegions Array(UInt32), ResolutionWidth UInt16, ResolutionHeight UInt16, ResolutionDepth UInt8, FlashMajor UInt8, FlashMinor UInt8, FlashMinor2 String, NetMajor UInt8, NetMinor UInt8, UserAgentMajor UInt16, UserAgentMinor FixedString(2), CookieEnable UInt8, JavascriptEnable UInt8, IsMobile UInt8, MobilePhone UInt8, MobilePhoneModel String, Params String, IPNetworkID UInt32, TraficSourceID Int8, SearchEngineID UInt16, SearchPhrase String, AdvEngineID UInt8, IsArtifical UInt8, WindowClientWidth UInt16, WindowClientHeight UInt16, ClientTimeZone Int16, ClientEventTime DateTime, SilverlightVersion1 UInt8, SilverlightVersion2 UInt8, SilverlightVersion3 UInt32, SilverlightVersion4 UInt16, PageCharset String, CodeVersion UInt32, IsLink UInt8, IsDownload UInt8, IsNotBounce UInt8, FUniqID UInt64, HID UInt32, IsOldCounter UInt8, IsEvent UInt8, IsParameter UInt8, DontCountHits UInt8, WithHash UInt8, HitColor FixedString(1), UTCEventTime DateTime, Age UInt8, Sex UInt8, Income UInt8, Interests UInt16, Robotness UInt8, GeneralInterests Array(UInt16), RemoteIP UInt32, RemoteIP6 FixedString(16), WindowName Int32, OpenerName Int32, HistoryLength Int16, BrowserLanguage FixedString(2), BrowserCountry FixedString(2), SocialNetwork String, SocialAction String, HTTPError UInt16, SendTiming Int32, DNSTiming Int32, ConnectTiming Int32, ResponseStartTiming Int32, ResponseEndTiming Int32, FetchTiming Int32, RedirectTiming Int32, DOMInteractiveTiming Int32, DOMContentLoadedTiming Int32, DOMCompleteTiming Int32, LoadEventStartTiming Int32, LoadEventEndTiming Int32, NSToDOMContentLoadedTiming Int32, FirstPaintTiming Int32, RedirectCount Int8, SocialSourceNetworkID UInt8, SocialSourcePage String, ParamPrice Int64, ParamOrderID String, ParamCurrency FixedString(3), ParamCurrencyID UInt16, GoalsReached Array(UInt32), OpenstatServiceName String, OpenstatCampaignID String, OpenstatAdID String, OpenstatSourceID String, UTMSource String, UTMMedium String, UTMCampaign String, UTMContent String, UTMTerm String, FromTag String, HasGCLID UInt8, RefererHash UInt64, URLHash UInt64, CLID UInt32, YCLID UInt64, ShareService String, ShareURL String, ShareTitle String, ParsedParams Nested(Key1 String, Key2 String, Key3 String, Key4 String, Key5 String, ValueDouble Float64), IslandID FixedString(16), RequestNum UInt32, RequestTry UInt8) ENGINE = MergeTree() PARTITION BY toYYYYMM(EventDate) ORDER BY (CounterID, EventDate, intHash32(UserID)) SAMPLE BY intHash32(UserID) SETTINGS index_granularity = 8192, storage_policy='\''s3_cache'\''' + clickhouse-client --query 'CREATE TABLE test.visits (CounterID UInt32, StartDate Date, Sign Int8, IsNew UInt8, VisitID UInt64, UserID UInt64, StartTime DateTime, Duration UInt32, UTCStartTime DateTime, PageViews Int32, Hits Int32, IsBounce UInt8, Referer String, StartURL String, RefererDomain String, StartURLDomain String, EndURL String, LinkURL String, IsDownload UInt8, TraficSourceID Int8, SearchEngineID UInt16, SearchPhrase String, AdvEngineID UInt8, PlaceID Int32, RefererCategories Array(UInt16), URLCategories Array(UInt16), URLRegions Array(UInt32), RefererRegions Array(UInt32), IsYandex UInt8, GoalReachesDepth Int32, GoalReachesURL Int32, GoalReachesAny Int32, SocialSourceNetworkID UInt8, SocialSourcePage String, MobilePhoneModel String, ClientEventTime DateTime, RegionID UInt32, ClientIP UInt32, ClientIP6 FixedString(16), RemoteIP UInt32, RemoteIP6 FixedString(16), IPNetworkID UInt32, SilverlightVersion3 UInt32, CodeVersion UInt32, ResolutionWidth UInt16, ResolutionHeight UInt16, UserAgentMajor UInt16, UserAgentMinor UInt16, WindowClientWidth UInt16, WindowClientHeight UInt16, SilverlightVersion2 UInt8, SilverlightVersion4 UInt16, FlashVersion3 UInt16, FlashVersion4 UInt16, ClientTimeZone Int16, OS UInt8, UserAgent UInt8, ResolutionDepth UInt8, FlashMajor UInt8, FlashMinor UInt8, NetMajor UInt8, NetMinor UInt8, MobilePhone UInt8, SilverlightVersion1 UInt8, Age UInt8, Sex UInt8, Income UInt8, JavaEnable UInt8, CookieEnable UInt8, JavascriptEnable UInt8, IsMobile UInt8, BrowserLanguage UInt16, BrowserCountry UInt16, Interests UInt16, Robotness UInt8, GeneralInterests Array(UInt16), Params Array(String), Goals Nested(ID UInt32, Serial UInt32, EventTime DateTime, Price Int64, OrderID String, CurrencyID UInt32), WatchIDs Array(UInt64), ParamSumPrice Int64, ParamCurrency FixedString(3), ParamCurrencyID UInt16, ClickLogID UInt64, ClickEventID Int32, ClickGoodEvent Int32, ClickEventTime DateTime, ClickPriorityID Int32, ClickPhraseID Int32, ClickPageID Int32, ClickPlaceID Int32, ClickTypeID Int32, ClickResourceID Int32, ClickCost UInt32, ClickClientIP UInt32, ClickDomainID UInt32, ClickURL String, ClickAttempt UInt8, ClickOrderID UInt32, ClickBannerID UInt32, ClickMarketCategoryID UInt32, ClickMarketPP UInt32, ClickMarketCategoryName String, ClickMarketPPName String, ClickAWAPSCampaignName String, ClickPageName String, ClickTargetType UInt16, ClickTargetPhraseID UInt64, ClickContextType UInt8, ClickSelectType Int8, ClickOptions String, ClickGroupBannerID Int32, OpenstatServiceName String, OpenstatCampaignID String, OpenstatAdID String, OpenstatSourceID String, UTMSource String, UTMMedium String, UTMCampaign String, UTMContent String, UTMTerm String, FromTag String, HasGCLID UInt8, FirstVisit DateTime, PredLastVisit Date, LastVisit Date, TotalVisits UInt32, TraficSource Nested(ID Int8, SearchEngineID UInt16, AdvEngineID UInt8, PlaceID UInt16, SocialSourceNetworkID UInt8, Domain String, SearchPhrase String, SocialSourcePage String), Attendance FixedString(16), CLID UInt32, YCLID UInt64, NormalizedRefererHash UInt64, SearchPhraseHash UInt64, RefererDomainHash UInt64, NormalizedStartURLHash UInt64, StartURLDomainHash UInt64, NormalizedEndURLHash UInt64, TopLevelDomain UInt64, URLScheme UInt64, OpenstatServiceNameHash UInt64, OpenstatCampaignIDHash UInt64, OpenstatAdIDHash UInt64, OpenstatSourceIDHash UInt64, UTMSourceHash UInt64, UTMMediumHash UInt64, UTMCampaignHash UInt64, UTMContentHash UInt64, UTMTermHash UInt64, FromHash UInt64, WebVisorEnabled UInt8, WebVisorActivity UInt32, ParsedParams Nested(Key1 String, Key2 String, Key3 String, Key4 String, Key5 String, ValueDouble Float64), Market Nested(Type UInt8, GoalID UInt32, OrderID String, OrderPrice Int64, PP UInt32, DirectPlaceID UInt32, DirectOrderID UInt32, DirectBannerID UInt32, GoodID String, GoodName String, GoodQuantity Int32, GoodPrice Int64), IslandID FixedString(16)) ENGINE = CollapsingMergeTree(Sign) PARTITION BY toYYYYMM(StartDate) ORDER BY (CounterID, StartDate, intHash32(UserID), VisitID) SAMPLE BY intHash32(UserID) SETTINGS index_granularity = 8192, storage_policy='\''s3_cache'\''' + clickhouse-client --query 'INSERT INTO test.hits_s3 SELECT * FROM datasets.hits_v1 SETTINGS enable_filesystem_cache_on_write_operations=0' + clickhouse-client --query 'INSERT INTO test.hits SELECT * FROM datasets.hits_v1 SETTINGS enable_filesystem_cache_on_write_operations=0' + clickhouse-client --query 'INSERT INTO test.visits SELECT * FROM datasets.visits_v1 SETTINGS enable_filesystem_cache_on_write_operations=0' + clickhouse-client --query 'DROP TABLE datasets.visits_v1 SYNC' + clickhouse-client --query 'DROP TABLE datasets.hits_v1 SYNC' + clickhouse-client --query 'SHOW TABLES FROM test' hits hits_s3 visits + clickhouse-client --query 'SYSTEM STOP THREAD FUZZER' + stop + local max_tries=90 + local check_hang=true + local pid ++ cat /var/run/clickhouse-server/clickhouse-server.pid + pid=977 + clickhouse stop --max-tries 90 --do-not-kill /var/run/clickhouse-server/clickhouse-server.pid file exists and contains pid = 977. The process with pid = 977 is running. Sent terminate signal to process with pid 977. Waiting for server to stop /var/run/clickhouse-server/clickhouse-server.pid file exists and contains pid = 977. The process with pid = 977 is running. Waiting for server to stop /var/run/clickhouse-server/clickhouse-server.pid file exists and contains pid = 977. The process with pid = 977 is running. Waiting for server to stop /var/run/clickhouse-server/clickhouse-server.pid file exists and contains pid = 977. The process with pid = 977 is running. Waiting for server to stop /var/run/clickhouse-server/clickhouse-server.pid file exists and contains pid = 977. The process with pid = 977 is running. Waiting for server to stop Found pid = 977 in the list of running processes. The process with pid = 977 is running. Waiting for server to stop Found pid = 977 in the list of running processes. The process with pid = 977 is running. Waiting for server to stop Found pid = 977 in the list of running processes. The process with pid = 977 is running. Waiting for server to stop Found pid = 977 in the list of running processes. The process with pid = 977 is running. Waiting for server to stop Found pid = 977 in the list of running processes. The process with pid = 977 is running. Waiting for server to stop Found pid = 977 in the list of running processes. The process with pid = 977 is running. Waiting for server to stop Found pid = 977 in the list of running processes. The process with pid = 977 is running. Waiting for server to stop Found pid = 977 in the list of running processes. The process with pid = 977 is running. Waiting for server to stop Found pid = 977 in the list of running processes. The process with pid = 977 is running. Waiting for server to stop Found pid = 977 in the list of running processes. The process with pid = 977 is running. Waiting for server to stop Found pid = 977 in the list of running processes. The process with pid = 977 is running. Waiting for server to stop Found pid = 977 in the list of running processes. The process with pid = 977 is running. Waiting for server to stop Found pid = 977 in the list of running processes. The process with pid = 977 is running. Waiting for server to stop Found pid = 977 in the list of running processes. The process with pid = 977 is running. Waiting for server to stop Found pid = 977 in the list of running processes. The process with pid = 977 is running. Waiting for server to stop Found pid = 977 in the list of running processes. The process with pid = 977 is running. Waiting for server to stop Found pid = 977 in the list of running processes. The process with pid = 977 is running. Waiting for server to stop Found pid = 977 in the list of running processes. The process with pid = 977 is running. Waiting for server to stop Found pid = 977 in the list of running processes. The process with pid = 977 is running. Waiting for server to stop Found pid = 977 in the list of running processes. The process with pid = 977 is running. Waiting for server to stop Now there is no clickhouse-server process. Server stopped script.gdb:13: Error in sourced command file: No stack. + return + export USE_S3_STORAGE_FOR_MERGE_TREE=1 + USE_S3_STORAGE_FOR_MERGE_TREE=1 + export ZOOKEEPER_FAULT_INJECTION=1 + ZOOKEEPER_FAULT_INJECTION=1 + configure + export USE_DATABASE_ORDINARY=1 + USE_DATABASE_ORDINARY=1 + export EXPORT_S3_STORAGE_POLICIES=1 + EXPORT_S3_STORAGE_POLICIES=1 + /usr/share/clickhouse-test/config/install.sh + DEST_SERVER_PATH=/etc/clickhouse-server + DEST_CLIENT_PATH=/etc/clickhouse-client +++ dirname /usr/share/clickhouse-test/config/install.sh ++ cd /usr/share/clickhouse-test/config ++ pwd -P + SRC_PATH=/usr/share/clickhouse-test/config + echo 'Going to install test configs from /usr/share/clickhouse-test/config into /etc/clickhouse-server' + mkdir -p /etc/clickhouse-server/config.d/ Going to install test configs from /usr/share/clickhouse-test/config into /etc/clickhouse-server + mkdir -p /etc/clickhouse-server/users.d/ + mkdir -p /etc/clickhouse-client + ln -sf /usr/share/clickhouse-test/config/config.d/zookeeper_write.xml /etc/clickhouse-server/config.d/ + ln -sf /usr/share/clickhouse-test/config/config.d/listen.xml /etc/clickhouse-server/config.d/ + ln -sf /usr/share/clickhouse-test/config/config.d/text_log.xml /etc/clickhouse-server/config.d/ + ln -sf /usr/share/clickhouse-test/config/config.d/custom_settings_prefixes.xml /etc/clickhouse-server/config.d/ + ln -sf /usr/share/clickhouse-test/config/config.d/enable_access_control_improvements.xml /etc/clickhouse-server/config.d/ + ln -sf /usr/share/clickhouse-test/config/config.d/macros.xml /etc/clickhouse-server/config.d/ + ln -sf /usr/share/clickhouse-test/config/config.d/disks.xml /etc/clickhouse-server/config.d/ + ln -sf /usr/share/clickhouse-test/config/config.d/secure_ports.xml /etc/clickhouse-server/config.d/ + ln -sf /usr/share/clickhouse-test/config/config.d/clusters.xml /etc/clickhouse-server/config.d/ + ln -sf /usr/share/clickhouse-test/config/config.d/graphite.xml /etc/clickhouse-server/config.d/ + ln -sf /usr/share/clickhouse-test/config/config.d/database_atomic.xml /etc/clickhouse-server/config.d/ + ln -sf /usr/share/clickhouse-test/config/config.d/max_concurrent_queries.xml /etc/clickhouse-server/config.d/ + ln -sf /usr/share/clickhouse-test/config/config.d/merge_tree_settings.xml /etc/clickhouse-server/config.d/ + ln -sf /usr/share/clickhouse-test/config/config.d/merge_tree_old_dirs_cleanup.xml /etc/clickhouse-server/config.d/ + ln -sf /usr/share/clickhouse-test/config/config.d/test_cluster_with_incorrect_pw.xml /etc/clickhouse-server/config.d/ + ln -sf /usr/share/clickhouse-test/config/config.d/keeper_port.xml /etc/clickhouse-server/config.d/ + ln -sf /usr/share/clickhouse-test/config/config.d/logging_no_rotate.xml /etc/clickhouse-server/config.d/ + ln -sf /usr/share/clickhouse-test/config/config.d/merge_tree.xml /etc/clickhouse-server/config.d/ + ln -sf /usr/share/clickhouse-test/config/config.d/lost_forever_check.xml /etc/clickhouse-server/config.d/ + ln -sf /usr/share/clickhouse-test/config/config.d/metadata_cache.xml /etc/clickhouse-server/config.d/ + ln -sf /usr/share/clickhouse-test/config/config.d/tcp_with_proxy.xml /etc/clickhouse-server/config.d/ + ln -sf /usr/share/clickhouse-test/config/config.d/prometheus.xml /etc/clickhouse-server/config.d/ + ln -sf /usr/share/clickhouse-test/config/config.d/top_level_domains_lists.xml /etc/clickhouse-server/config.d/ + ln -sf /usr/share/clickhouse-test/config/config.d/top_level_domains_path.xml /etc/clickhouse-server/config.d/ + ln -sf /usr/share/clickhouse-test/config/config.d/transactions.xml /etc/clickhouse-server/config.d/ + ln -sf /usr/share/clickhouse-test/config/config.d/encryption.xml /etc/clickhouse-server/config.d/ + ln -sf /usr/share/clickhouse-test/config/config.d/CORS.xml /etc/clickhouse-server/config.d/ + ln -sf /usr/share/clickhouse-test/config/config.d/zookeeper_log.xml /etc/clickhouse-server/config.d/ + ln -sf /usr/share/clickhouse-test/config/config.d/logger_trace.xml /etc/clickhouse-server/config.d/ + ln -sf /usr/share/clickhouse-test/config/config.d/named_collection.xml /etc/clickhouse-server/config.d/ + ln -sf /usr/share/clickhouse-test/config/config.d/ssl_certs.xml /etc/clickhouse-server/config.d/ + ln -sf /usr/share/clickhouse-test/config/config.d/filesystem_cache_log.xml /etc/clickhouse-server/config.d/ + ln -sf /usr/share/clickhouse-test/config/config.d/session_log.xml /etc/clickhouse-server/config.d/ + ln -sf /usr/share/clickhouse-test/config/config.d/system_unfreeze.xml /etc/clickhouse-server/config.d/ + ln -sf /usr/share/clickhouse-test/config/config.d/enable_zero_copy_replication.xml /etc/clickhouse-server/config.d/ + ln -sf /usr/share/clickhouse-test/config/config.d/nlp.xml /etc/clickhouse-server/config.d/ + ln -sf /usr/share/clickhouse-test/config/config.d/forbidden_headers.xml /etc/clickhouse-server/config.d/ + ln -sf /usr/share/clickhouse-test/config/config.d/enable_keeper_map.xml /etc/clickhouse-server/config.d/ + ln -sf /usr/share/clickhouse-test/config/config.d/custom_disks_base_path.xml /etc/clickhouse-server/config.d/ + ln -sf /usr/share/clickhouse-test/config/config.d/display_name.xml /etc/clickhouse-server/config.d/ + ln -sf /usr/share/clickhouse-test/config/config.d/reverse_dns_query_function.xml /etc/clickhouse-server/config.d/ + ln -sf /usr/share/clickhouse-test/config/config.d/compressed_marks_and_index.xml /etc/clickhouse-server/config.d/ + ln -sf /usr/share/clickhouse-test/config/config.d/disable_s3_env_credentials.xml /etc/clickhouse-server/config.d/ + ln -sf /usr/share/clickhouse-test/config/config.d/enable_wait_for_shutdown_replicated_tables.xml /etc/clickhouse-server/config.d/ + ln -sf /usr/share/clickhouse-test/config/config.d/backups.xml /etc/clickhouse-server/config.d/ + ln -sf /usr/share/clickhouse-test/config/config.d/filesystem_caches_path.xml /etc/clickhouse-server/config.d/ + ln -sf /usr/share/clickhouse-test/config/config.d/validate_tcp_client_information.xml /etc/clickhouse-server/config.d/ + '[' /etc/clickhouse-server = /etc/clickhouse-server ']' + ln -sf /usr/share/clickhouse-test/config/config.d/legacy_geobase.xml /etc/clickhouse-server/config.d/ + ln -sf /usr/share/clickhouse-test/config/users.d/log_queries.xml /etc/clickhouse-server/users.d/ + ln -sf /usr/share/clickhouse-test/config/users.d/readonly.xml /etc/clickhouse-server/users.d/ + ln -sf /usr/share/clickhouse-test/config/users.d/access_management.xml /etc/clickhouse-server/users.d/ + ln -sf /usr/share/clickhouse-test/config/users.d/database_atomic_drop_detach_sync.xml /etc/clickhouse-server/users.d/ + ln -sf /usr/share/clickhouse-test/config/users.d/opentelemetry.xml /etc/clickhouse-server/users.d/ + ln -sf /usr/share/clickhouse-test/config/users.d/remote_queries.xml /etc/clickhouse-server/users.d/ + ln -sf /usr/share/clickhouse-test/config/users.d/session_log_test.xml /etc/clickhouse-server/users.d/ + ln -sf /usr/share/clickhouse-test/config/users.d/memory_profiler.xml /etc/clickhouse-server/users.d/ + ln -sf /usr/share/clickhouse-test/config/users.d/no_fsync_metadata.xml /etc/clickhouse-server/users.d/ + ln -sf /usr/share/clickhouse-test/config/users.d/filelog.xml /etc/clickhouse-server/users.d/ + ln -sf /usr/share/clickhouse-test/config/users.d/enable_blobs_check.xml /etc/clickhouse-server/users.d/ + ln -sf /usr/share/clickhouse-test/config/users.d/marks.xml /etc/clickhouse-server/users.d/ + ln -sf /usr/share/clickhouse-test/config/users.d/insert_keeper_retries.xml /etc/clickhouse-server/users.d/ + ln -sf /usr/share/clickhouse-test/config/users.d/prefetch_settings.xml /etc/clickhouse-server/users.d/ + ln -sf /usr/share/clickhouse-test/config/users.d/nonconst_timezone.xml /etc/clickhouse-server/users.d/ + [[ -n '' ]] + ln -sf /usr/share/clickhouse-test/config/users.d/timeouts.xml /etc/clickhouse-server/users.d/ + ln -sf /usr/share/clickhouse-test/config/ints_dictionary.xml /etc/clickhouse-server/ + ln -sf /usr/share/clickhouse-test/config/strings_dictionary.xml /etc/clickhouse-server/ + ln -sf /usr/share/clickhouse-test/config/decimals_dictionary.xml /etc/clickhouse-server/ + ln -sf /usr/share/clickhouse-test/config/executable_dictionary.xml /etc/clickhouse-server/ + ln -sf /usr/share/clickhouse-test/config/executable_pool_dictionary.xml /etc/clickhouse-server/ + ln -sf /usr/share/clickhouse-test/config/test_function.xml /etc/clickhouse-server/ + ln -sf /usr/share/clickhouse-test/config/top_level_domains /etc/clickhouse-server/ + ln -sf /usr/share/clickhouse-test/config/regions_hierarchy.txt /etc/clickhouse-server/config.d/ + ln -sf /usr/share/clickhouse-test/config/regions_names_en.txt /etc/clickhouse-server/config.d/ + ln -sf /usr/share/clickhouse-test/config/ext-en.txt /etc/clickhouse-server/config.d/ + ln -sf /usr/share/clickhouse-test/config/ext-ru.txt /etc/clickhouse-server/config.d/ + ln -sf /usr/share/clickhouse-test/config/lem-en.bin /etc/clickhouse-server/config.d/ + ln -sf /usr/share/clickhouse-test/config/server.key /etc/clickhouse-server/ + ln -sf /usr/share/clickhouse-test/config/server.crt /etc/clickhouse-server/ + ln -sf /usr/share/clickhouse-test/config/dhparam.pem /etc/clickhouse-server/ + ln -sf --backup=simple --suffix=_original.xml /usr/share/clickhouse-test/config/config.d/query_masking_rules.xml /etc/clickhouse-server/config.d/ + [[ -n 1 ]] + [[ 1 -eq 1 ]] + rm -f /etc/clickhouse-server/config.d/zookeeper.xml + ln -sf /usr/share/clickhouse-test/config/config.d/zookeeper_fault_injection.xml /etc/clickhouse-server/config.d/ + create_snapshot_on_exit=0 + sed --follow-symlinks -i 's|true|0|' /etc/clickhouse-server/config.d/keeper_port.xml + [[ -n '' ]] + [[ -n 1 ]] + [[ 1 -eq 1 ]] + ln -sf /usr/share/clickhouse-test/config/users.d/database_ordinary.xml /etc/clickhouse-server/users.d/ + [[ -n 1 ]] + [[ 1 -eq 1 ]] + ln -sf /usr/share/clickhouse-test/config/config.d/s3_storage_policy_by_default.xml /etc/clickhouse-server/config.d/ + ARM=aarch64 ++ uname -m x86_64 Adding azure configuration + OS=x86_64 + [[ -n 1 ]] + echo x86_64 + [[ '' -eq 1 ]] + [[ x86_64 == \a\a\r\c\h\6\4 ]] + echo 'Adding azure configuration' + ln -sf /usr/share/clickhouse-test/config/config.d/azure_storage_conf.xml /etc/clickhouse-server/config.d/ + ln -sf /usr/share/clickhouse-test/config/config.d/storage_conf.xml /etc/clickhouse-server/config.d/ + ln -sf /usr/share/clickhouse-test/config/users.d/s3_cache.xml /etc/clickhouse-server/users.d/ + [[ -n '' ]] + ln -sf /usr/share/clickhouse-test/config/client_config.xml /etc/clickhouse-client/config.xml + sudo cat /etc/clickhouse-server/config.d/keeper_port.xml + sed 's|100000|10000|' + sudo mv /etc/clickhouse-server/config.d/keeper_port.xml.tmp /etc/clickhouse-server/config.d/keeper_port.xml + sudo chown clickhouse /etc/clickhouse-server/config.d/keeper_port.xml + sudo chgrp clickhouse /etc/clickhouse-server/config.d/keeper_port.xml + echo 'ASAN_OPTIONS='\''malloc_context_size=10 verbosity=1 allocator_release_to_os_interval_ms=10000'\''' + export 'ASAN_OPTIONS=malloc_context_size=10 allocator_release_to_os_interval_ms=10000' + ASAN_OPTIONS='malloc_context_size=10 allocator_release_to_os_interval_ms=10000' + sudo chown root: /var/lib/clickhouse + echo '1' + local total_mem ++ awk '/MemTotal/ { print $(NF-1) }' /proc/meminfo + total_mem=32080792 + total_mem=32850731008 + max_server_memory_usage_to_ram_ratio=0.5 Setting max_server_memory_usage_to_ram_ratio to 0.5 + echo 'Setting max_server_memory_usage_to_ram_ratio to 0.5' + cat Setting max_memory_usage_for_user=9855219302 and max_memory_usage for queries to 10G + local max_users_mem + max_users_mem=9855219302 + echo 'Setting max_memory_usage_for_user=9855219302 and max_memory_usage for queries to 10G' + cat + cat + cat + sudo cat /etc/clickhouse-server/config.d/s3_storage_policy_by_default.xml + sed 's|
s3
|
s3
default|' + mv /etc/clickhouse-server/config.d/s3_storage_policy_by_default.xml.tmp /etc/clickhouse-server/config.d/s3_storage_policy_by_default.xml + sudo chown clickhouse /etc/clickhouse-server/config.d/s3_storage_policy_by_default.xml + sudo chgrp clickhouse /etc/clickhouse-server/config.d/s3_storage_policy_by_default.xml + sudo cat /etc/clickhouse-server/config.d/logger_trace.xml + sed 's|trace|test|' + mv /etc/clickhouse-server/config.d/logger_trace.xml.tmp /etc/clickhouse-server/config.d/logger_trace.xml + start + counter=0 + clickhouse-client --query 'SELECT 1' Code: 210. DB::NetException: Connection refused (localhost:9000). (NETWORK_ERROR) + '[' 0 -gt 120 ']' + clickhouse start --user root + sleep 0.5 + counter=1 + clickhouse-client --query 'SELECT 1' Code: 210. DB::NetException: Connection refused (localhost:9000). (NETWORK_ERROR) + '[' 1 -gt 120 ']' + clickhouse start --user root + sleep 0.5 + counter=2 + clickhouse-client --query 'SELECT 1' Code: 210. DB::NetException: Connection refused (localhost:9000). (NETWORK_ERROR) + '[' 2 -gt 120 ']' + clickhouse start --user root + sleep 0.5 + counter=3 + clickhouse-client --query 'SELECT 1' Code: 210. DB::NetException: Connection refused (localhost:9000). (NETWORK_ERROR) + '[' 3 -gt 120 ']' + clickhouse start --user root + sleep 0.5 + counter=4 + clickhouse-client --query 'SELECT 1' Code: 210. DB::NetException: Connection refused (localhost:9000). (NETWORK_ERROR) + '[' 4 -gt 120 ']' + clickhouse start --user root + sleep 0.5 + counter=5 + clickhouse-client --query 'SELECT 1' Code: 210. DB::NetException: Connection refused (localhost:9000). (NETWORK_ERROR) + '[' 5 -gt 120 ']' + clickhouse start --user root + sleep 0.5 + counter=6 + clickhouse-client --query 'SELECT 1' Code: 210. DB::NetException: Connection refused (localhost:9000). (NETWORK_ERROR) + '[' 6 -gt 120 ']' + clickhouse start --user root + sleep 0.5 + counter=7 + clickhouse-client --query 'SELECT 1' Code: 210. DB::NetException: Connection refused (localhost:9000). (NETWORK_ERROR) + '[' 7 -gt 120 ']' + clickhouse start --user root + sleep 0.5 + counter=8 + clickhouse-client --query 'SELECT 1' Code: 210. DB::NetException: Connection refused (localhost:9000). (NETWORK_ERROR) + '[' 8 -gt 120 ']' + clickhouse start --user root + sleep 0.5 + counter=9 + clickhouse-client --query 'SELECT 1' Code: 210. DB::NetException: Connection refused (localhost:9000). (NETWORK_ERROR) + '[' 9 -gt 120 ']' + clickhouse start --user root + sleep 0.5 + counter=10 + clickhouse-client --query 'SELECT 1' Code: 210. DB::NetException: Connection refused (localhost:9000). (NETWORK_ERROR) + '[' 10 -gt 120 ']' + clickhouse start --user root + sleep 0.5 + counter=11 + clickhouse-client --query 'SELECT 1' Code: 210. DB::NetException: Connection refused (localhost:9000). (NETWORK_ERROR) + '[' 11 -gt 120 ']' + clickhouse start --user root + sleep 0.5 + counter=12 + clickhouse-client --query 'SELECT 1' Code: 210. DB::NetException: Connection refused (localhost:9000). (NETWORK_ERROR) + '[' 12 -gt 120 ']' + clickhouse start --user root + sleep 0.5 + counter=13 + clickhouse-client --query 'SELECT 1' Code: 210. DB::NetException: Connection refused (localhost:9000). (NETWORK_ERROR) + '[' 13 -gt 120 ']' + clickhouse start --user root + sleep 0.5 127.0.0.1 - - [30/Oct/2026:23:14:45 +0000] "PUT /devstoreaccount1/cont?restype=container HTTP/1.1" 409 - 127.0.0.1 - - [30/Oct/2026:23:14:45 +0000] "PUT /devstoreaccount1/cont/weumkvfmyktibwvfpapyzwygaezifjfp?blockid=frwghcbuodsfsvsoowgsgmgjgxbbawtfzhntawoadgcbmfdqgyeeudavbatxkbmw&comp=block HTTP/1.1" 201 - 127.0.0.1 - - [30/Oct/2026:23:14:45 +0000] "PUT /devstoreaccount1/cont/weumkvfmyktibwvfpapyzwygaezifjfp?comp=blocklist HTTP/1.1" 201 - 127.0.0.1 - - [30/Oct/2026:23:14:45 +0000] "GET /devstoreaccount1/cont/weumkvfmyktibwvfpapyzwygaezifjfp HTTP/1.1" 206 4 127.0.0.1 - - [30/Oct/2026:23:14:45 +0000] "GET /devstoreaccount1/cont/weumkvfmyktibwvfpapyzwygaezifjfp HTTP/1.1" 206 2 127.0.0.1 - - [30/Oct/2026:23:14:45 +0000] "DELETE /devstoreaccount1/cont/weumkvfmyktibwvfpapyzwygaezifjfp HTTP/1.1" 202 - + counter=14 + clickhouse-client --query 'SELECT 1' Code: 210. DB::NetException: Connection refused (localhost:9000). (NETWORK_ERROR) + '[' 14 -gt 120 ']' + clickhouse start --user root + sleep 0.5 + counter=15 + clickhouse-client --query 'SELECT 1' Code: 210. DB::NetException: Connection refused (localhost:9000). (NETWORK_ERROR) + '[' 15 -gt 120 ']' + clickhouse start --user root + sleep 0.5 + counter=16 + clickhouse-client --query 'SELECT 1' Code: 210. DB::NetException: Connection refused (localhost:9000). (NETWORK_ERROR) + '[' 16 -gt 120 ']' + clickhouse start --user root + sleep 0.5 + counter=17 + clickhouse-client --query 'SELECT 1' Code: 210. DB::NetException: Connection refused (localhost:9000). (NETWORK_ERROR) + '[' 17 -gt 120 ']' + clickhouse start --user root + sleep 0.5 + counter=18 + clickhouse-client --query 'SELECT 1' Code: 210. DB::NetException: Connection refused (localhost:9000). (NETWORK_ERROR) + '[' 18 -gt 120 ']' + clickhouse start --user root + sleep 0.5 + counter=19 + clickhouse-client --query 'SELECT 1' Code: 210. DB::NetException: Connection refused (localhost:9000). (NETWORK_ERROR) + '[' 19 -gt 120 ']' + clickhouse start --user root + sleep 0.5 + counter=20 + clickhouse-client --query 'SELECT 1' Code: 210. DB::NetException: Connection refused (localhost:9000). (NETWORK_ERROR) + '[' 20 -gt 120 ']' + clickhouse start --user root + sleep 0.5 + counter=21 + clickhouse-client --query 'SELECT 1' Code: 210. DB::NetException: Connection refused (localhost:9000). (NETWORK_ERROR) + '[' 21 -gt 120 ']' + clickhouse start --user root + sleep 0.5 + counter=22 + clickhouse-client --query 'SELECT 1' Code: 210. DB::NetException: Connection refused (localhost:9000). (NETWORK_ERROR) + '[' 22 -gt 120 ']' + clickhouse start --user root + sleep 0.5 + counter=23 + clickhouse-client --query 'SELECT 1' Code: 210. DB::NetException: Connection refused (localhost:9000). (NETWORK_ERROR) + '[' 23 -gt 120 ']' + clickhouse start --user root + sleep 0.5 + counter=24 + clickhouse-client --query 'SELECT 1' 1 + attach_gdb_to_clickhouse ++ kill -l SIGRTMIN + RTMIN=34 + echo ' set follow-fork-mode parent handle SIGHUP nostop noprint pass handle SIGINT nostop noprint pass handle SIGQUIT nostop noprint pass handle SIGPIPE nostop noprint pass handle SIGTERM nostop noprint pass handle SIGUSR1 nostop noprint pass handle SIGUSR2 nostop noprint pass handle SIG34 nostop noprint pass info signals continue backtrace full thread apply all backtrace full info registers disassemble /s up disassemble /s up disassemble /s p "done" detach quit ' + sleep 5 + ts '%Y-%m-%d %H:%M:%S' ++ cat /var/run/clickhouse-server/clickhouse-server.pid + gdb -batch -command script.gdb -p 1887 + run_with_retry 60 clickhouse-client --query 'SELECT '\''Connected to clickhouse-server after attaching gdb'\''' + [[ hxB =~ e ]] + set_e=false + set +e + local total_retries=60 + shift + local retry=0 + '[' 0 -ge 60 ']' + clickhouse-client --query 'SELECT '\''Connected to clickhouse-server after attaching gdb'\''' Connected to clickhouse-server after attaching gdb + false + return + stress --hung-check --drop-databases --output-folder test_output --skip-func-tests '' --global-time-limit 1200 2026-10-31 00:15:39,792 Run func tests '/usr/bin/clickhouse-test --global_time_limit=1200 ' 2026-10-31 00:15:40,293 Run func tests '/usr/bin/clickhouse-test --order=random --database=test_1 --client-option join_use_nulls=1 join_algorithm='parallel_hash' use_query_cache=1 memory_tracker_fault_probability=0.001 group_by_use_nulls=1 --global_time_limit=1200 ' 2026-10-31 00:15:40,795 Run func tests '/usr/bin/clickhouse-test --order=random --db-engine="Replicated('/test/db/test_2', 's1', 'r1')" --client-option allow_experimental_database_replicated=1 enable_deflate_qpl_codec=1 --global_time_limit=1200 ' 2026-10-31 00:15:41,296 Run func tests '/usr/bin/clickhouse-test --order=random --database=test_3 --client-option join_algorithm='partial_merge' use_query_cache=1 group_by_use_nulls=1 --global_time_limit=1200 ' 2026-10-31 00:15:41,798 Run func tests '/usr/bin/clickhouse-test --order=random --client-option join_use_nulls=1 --global_time_limit=1200 ' 2026-10-31 00:15:42,299 Run func tests '/usr/bin/clickhouse-test --order=random --db-engine="Replicated('/test/db/test_5', 's1', 'r1')" --database=test_5 --client-option allow_experimental_database_replicated=1 enable_deflate_qpl_codec=1 join_algorithm='full_sorting_merge' group_by_use_nulls=1 --global_time_limit=1200 ' 2026-10-31 00:15:42,801 Run func tests '/usr/bin/clickhouse-test --order=random --client-option use_query_cache=1 memory_tracker_fault_probability=0.001 --global_time_limit=1200 ' 2026-10-31 00:15:43,301 Run func tests '/usr/bin/clickhouse-test --order=random --database=test_7 --client-option join_use_nulls=1 join_algorithm='grace_hash' group_by_use_nulls=1 --global_time_limit=1200 ' 2026-10-31 00:15:43,802 Run func tests '/usr/bin/clickhouse-test --order=random --db-engine="Replicated('/test/db/test_8', 's1', 'r1')" --client-option allow_experimental_database_replicated=1 enable_deflate_qpl_codec=1 --global_time_limit=1200 ' 2026-10-31 00:15:44,304 Run func tests '/usr/bin/clickhouse-test --order=random --database=test_9 --client-option join_algorithm='auto' max_rows_in_join=1000 group_by_use_nulls=1 --global_time_limit=1200 ' 2026-10-31 00:15:44,805 Run func tests '/usr/bin/clickhouse-test --order=random --client-option join_use_nulls=1 --global_time_limit=1200 ' 2026-10-31 00:15:45,307 Run func tests '/usr/bin/clickhouse-test --order=random --db-engine="Replicated('/test/db/test_11', 's1', 'r1')" --database=test_11 --client-option allow_experimental_database_replicated=1 enable_deflate_qpl_codec=1 join_algorithm='parallel_hash' memory_tracker_fault_probability=0.001 group_by_use_nulls=1 --global_time_limit=1200 ' 2026-10-31 00:15:45,808 Run func tests '/usr/bin/clickhouse-test --order=random --client-option implicit_transaction=1 throw_on_unsupported_query_inside_transaction=0 --global_time_limit=1200 ' 2026-10-31 00:15:46,309 Run func tests '/usr/bin/clickhouse-test --order=random --database=test_13 --client-option join_use_nulls=1 join_algorithm='partial_merge' use_query_cache=1 group_by_use_nulls=1 --global_time_limit=1200 ' 2026-10-31 00:15:46,811 Run func tests '/usr/bin/clickhouse-test --order=random --db-engine="Replicated('/test/db/test_14', 's1', 'r1')" --client-option allow_experimental_database_replicated=1 enable_deflate_qpl_codec=1 --global_time_limit=1200 ' 2026-10-31 00:15:47,313 Run func tests '/usr/bin/clickhouse-test --order=random --database=test_15 --client-option join_algorithm='full_sorting_merge' group_by_use_nulls=1 --global_time_limit=1200 ' 2026-10-31 00:15:47,814 Will wait functests to finish 2026-10-31 00:15:47,814 Finished 0 from 16 processes 2026-10-31 00:15:52,817 Finished 0 from 16 processes 2026-10-31 00:15:57,821 Finished 0 from 16 processes 2026-10-31 00:16:02,825 Finished 0 from 16 processes 2026-10-31 00:16:07,829 Finished 0 from 16 processes 2026-10-31 00:16:12,833 Finished 0 from 16 processes 2026-10-31 00:16:17,837 Finished 0 from 16 processes 2026-10-31 00:16:22,842 Finished 0 from 16 processes 2026-10-31 00:16:27,845 Finished 0 from 16 processes 2026-10-31 00:16:32,849 Finished 0 from 16 processes 2026-10-31 00:16:37,853 Finished 0 from 16 processes 2026-10-31 00:16:42,857 Finished 0 from 16 processes 2026-10-31 00:16:47,861 Finished 0 from 16 processes 2026-10-31 00:16:52,865 Finished 0 from 16 processes 2026-10-31 00:16:57,870 Finished 1 from 16 processes 2026-10-31 00:17:02,873 Finished 1 from 16 processes 2026-10-31 00:17:07,877 Finished 1 from 16 processes 2026-10-31 00:17:12,883 Finished 1 from 16 processes 2026-10-31 00:17:17,885 Finished 1 from 16 processes 2026-10-31 00:17:22,891 Finished 1 from 16 processes 2026-10-31 00:17:27,896 Finished 1 from 16 processes 2026-10-31 00:17:32,897 Finished 1 from 16 processes 2026-10-31 00:17:37,901 Finished 1 from 16 processes 2026-10-31 00:17:42,905 Finished 1 from 16 processes 2026-10-31 00:17:47,909 Finished 1 from 16 processes 2026-10-31 00:17:52,914 Finished 1 from 16 processes 2026-10-31 00:17:57,917 Finished 1 from 16 processes 2026-10-31 00:18:02,921 Finished 1 from 16 processes 2026-10-31 00:18:07,925 Finished 1 from 16 processes 2026-10-31 00:18:12,929 Finished 1 from 16 processes 2026-10-31 00:18:17,933 Finished 1 from 16 processes 2026-10-31 00:18:22,938 Finished 1 from 16 processes 2026-10-31 00:18:27,941 Finished 1 from 16 processes 2026-10-31 00:18:32,945 Finished 1 from 16 processes 2026-10-31 00:18:37,946 Finished 1 from 16 processes 2026-10-31 00:18:42,949 Finished 1 from 16 processes 2026-10-31 00:18:47,955 Finished 1 from 16 processes 2026-10-31 00:18:52,958 Finished 1 from 16 processes 2026-10-31 00:18:57,961 Finished 1 from 16 processes 2026-10-31 00:19:02,965 Finished 1 from 16 processes 2026-10-31 00:19:07,969 Finished 1 from 16 processes 2026-10-31 00:19:12,973 Finished 1 from 16 processes 2026-10-31 00:19:17,977 Finished 1 from 16 processes 2026-10-31 00:19:22,983 Finished 1 from 16 processes 2026-10-31 00:19:27,985 Finished 1 from 16 processes 2026-10-31 00:19:32,989 Finished 1 from 16 processes 2026-10-31 00:19:37,993 Finished 1 from 16 processes 2026-10-31 00:19:42,997 Finished 1 from 16 processes 2026-10-31 00:19:48,001 Finished 1 from 16 processes 2026-10-31 00:19:53,002 Finished 1 from 16 processes 2026-10-31 00:19:58,005 Finished 1 from 16 processes 2026-10-31 00:20:03,011 Finished 1 from 16 processes 2026-10-31 00:20:08,013 Finished 1 from 16 processes 2026-10-31 00:20:13,017 Finished 1 from 16 processes 2026-10-31 00:20:18,021 Finished 1 from 16 processes 2026-10-31 00:20:23,025 Finished 1 from 16 processes 2026-10-31 00:20:28,030 Finished 1 from 16 processes 2026-10-31 00:20:33,034 Finished 1 from 16 processes 2026-10-31 00:20:38,037 Finished 1 from 16 processes 2026-10-31 00:20:43,041 Finished 1 from 16 processes 2026-10-31 00:20:48,045 Finished 1 from 16 processes 2026-10-31 00:20:53,049 Finished 1 from 16 processes 2026-10-31 00:20:58,053 Finished 1 from 16 processes 2026-10-31 00:21:03,057 Finished 1 from 16 processes 2026-10-31 00:21:08,061 Finished 1 from 16 processes 2026-10-31 00:21:13,065 Finished 1 from 16 processes 2026-10-31 00:21:18,071 Finished 1 from 16 processes 2026-10-31 00:21:23,073 Finished 1 from 16 processes 2026-10-31 00:21:28,077 Finished 1 from 16 processes 2026-10-31 00:21:33,081 Finished 1 from 16 processes 2026-10-31 00:21:38,082 Finished 1 from 16 processes 2026-10-31 00:21:43,085 Finished 1 from 16 processes 2026-10-31 00:21:48,089 Finished 1 from 16 processes 2026-10-31 00:21:53,093 Finished 1 from 16 processes 2026-10-31 00:21:58,096 Finished 1 from 16 processes 2026-10-31 00:22:03,101 Finished 1 from 16 processes 2026-10-31 00:22:08,105 Finished 1 from 16 processes 2026-10-31 00:22:13,109 Finished 1 from 16 processes 2026-10-31 00:22:18,113 Finished 1 from 16 processes 2026-10-31 00:22:23,117 Finished 1 from 16 processes 2026-10-31 00:22:28,122 Finished 1 from 16 processes 2026-10-31 00:22:33,125 Finished 1 from 16 processes 2026-10-31 00:22:38,129 Finished 1 from 16 processes 2026-10-31 00:22:43,130 Finished 1 from 16 processes 2026-10-31 00:22:48,133 Finished 1 from 16 processes 2026-10-31 00:22:53,137 Finished 1 from 16 processes 2026-10-31 00:22:58,141 Finished 1 from 16 processes 2026-10-31 00:23:03,145 Finished 1 from 16 processes 2026-10-31 00:23:08,149 Finished 1 from 16 processes 2026-10-31 00:23:13,154 Finished 1 from 16 processes 2026-10-31 00:23:18,160 Finished 1 from 16 processes 2026-10-31 00:23:23,161 Finished 1 from 16 processes 2026-10-31 00:23:28,167 Finished 1 from 16 processes 2026-10-31 00:23:33,169 Finished 1 from 16 processes 2026-10-31 00:23:38,173 Finished 1 from 16 processes 2026-10-31 00:23:43,177 Finished 1 from 16 processes 2026-10-31 00:23:48,183 Finished 1 from 16 processes 2026-10-31 00:23:53,187 Finished 1 from 16 processes 2026-10-31 00:23:58,189 Finished 1 from 16 processes 2026-10-31 00:24:03,193 Finished 1 from 16 processes 2026-10-31 00:24:08,197 Finished 1 from 16 processes 2026-10-31 00:24:13,201 Finished 1 from 16 processes 2026-10-31 00:24:18,205 Finished 1 from 16 processes 2026-10-31 00:24:23,209 Finished 1 from 16 processes 2026-10-31 00:24:28,213 Finished 1 from 16 processes 2026-10-31 00:24:33,217 Finished 1 from 16 processes 2026-10-31 00:24:38,223 Finished 1 from 16 processes 2026-10-31 00:24:43,226 Finished 1 from 16 processes 2026-10-31 00:24:48,228 Finished 1 from 16 processes 2026-10-31 00:24:53,232 Finished 1 from 16 processes 2026-10-31 00:24:58,233 Finished 1 from 16 processes 2026-10-31 00:25:03,237 Finished 1 from 16 processes 2026-10-31 00:25:08,238 Finished 1 from 16 processes 2026-10-31 00:25:13,241 Finished 1 from 16 processes 2026-10-31 00:25:18,243 Finished 1 from 16 processes 2026-10-31 00:25:23,249 Finished 1 from 16 processes 2026-10-31 00:25:28,254 Finished 1 from 16 processes 2026-10-31 00:25:33,259 Finished 1 from 16 processes 2026-10-31 00:25:38,261 Finished 1 from 16 processes 2026-10-31 00:25:43,267 Finished 1 from 16 processes 2026-10-31 00:25:48,272 Finished 1 from 16 processes 2026-10-31 00:25:53,277 Finished 1 from 16 processes 2026-10-31 00:25:58,281 Finished 1 from 16 processes 2026-10-31 00:26:03,285 Finished 1 from 16 processes 2026-10-31 00:26:08,288 Finished 1 from 16 processes 2026-10-31 00:26:13,293 Finished 1 from 16 processes 2026-10-31 00:26:18,296 Finished 1 from 16 processes 2026-10-31 00:26:23,301 Finished 1 from 16 processes 2026-10-31 00:26:28,305 Finished 1 from 16 processes 2026-10-31 00:26:33,309 Finished 1 from 16 processes 2026-10-31 00:26:38,313 Finished 1 from 16 processes 2026-10-31 00:26:43,317 Finished 1 from 16 processes 2026-10-31 00:26:48,321 Finished 1 from 16 processes 2026-10-31 00:26:53,325 Finished 1 from 16 processes 2026-10-31 00:26:58,329 Finished 1 from 16 processes 2026-10-31 00:27:03,333 Finished 1 from 16 processes 2026-10-31 00:27:08,337 Finished 1 from 16 processes 2026-10-31 00:27:13,343 Finished 1 from 16 processes 2026-10-31 00:27:18,345 Finished 1 from 16 processes 2026-10-31 00:27:23,349 Finished 1 from 16 processes 2026-10-31 00:27:28,355 Finished 1 from 16 processes 2026-10-31 00:27:33,357 Finished 1 from 16 processes 2026-10-31 00:27:38,361 Finished 1 from 16 processes 2026-10-31 00:27:43,365 Finished 1 from 16 processes 2026-10-31 00:27:48,369 Finished 1 from 16 processes 2026-10-31 00:27:53,373 Finished 1 from 16 processes 2026-10-31 00:27:58,379 Finished 1 from 16 processes 2026-10-31 00:28:03,381 Finished 1 from 16 processes 2026-10-31 00:28:08,385 Finished 1 from 16 processes 2026-10-31 00:28:13,391 Finished 1 from 16 processes 2026-10-31 00:28:18,396 Finished 1 from 16 processes 2026-10-31 00:28:23,401 Finished 1 from 16 processes 2026-10-31 00:28:28,406 Finished 1 from 16 processes 2026-10-31 00:28:33,410 Finished 1 from 16 processes 2026-10-31 00:28:38,413 Finished 1 from 16 processes 2026-10-31 00:28:43,417 Finished 1 from 16 processes 2026-10-31 00:28:48,422 Finished 1 from 16 processes 2026-10-31 00:28:53,425 Finished 1 from 16 processes 2026-10-31 00:28:58,431 Finished 1 from 16 processes 2026-10-31 00:29:03,433 Finished 1 from 16 processes 2026-10-31 00:29:08,437 Finished 1 from 16 processes 2026-10-31 00:29:13,441 Finished 1 from 16 processes 2026-10-31 00:29:18,447 Finished 1 from 16 processes 2026-10-31 00:29:23,449 Finished 1 from 16 processes 2026-10-31 00:29:28,454 Finished 1 from 16 processes 2026-10-31 00:29:33,459 Finished 1 from 16 processes 2026-10-31 00:29:38,461 Finished 2 from 16 processes 2026-10-31 00:29:43,465 Finished 2 from 16 processes 2026-10-31 00:29:48,467 Finished 2 from 16 processes 2026-10-31 00:29:53,469 Finished 2 from 16 processes 2026-10-31 00:29:58,473 Finished 2 from 16 processes 2026-10-31 00:30:03,477 Finished 3 from 16 processes 2026-10-31 00:30:08,482 Finished 3 from 16 processes 2026-10-31 00:30:13,485 Finished 3 from 16 processes 2026-10-31 00:30:18,491 Finished 3 from 16 processes 2026-10-31 00:30:23,493 Finished 3 from 16 processes 2026-10-31 00:30:28,497 Finished 3 from 16 processes 2026-10-31 00:30:33,500 Finished 3 from 16 processes 2026-10-31 00:30:38,506 Finished 3 from 16 processes 2026-10-31 00:30:43,509 Finished 3 from 16 processes 2026-10-31 00:30:48,513 Finished 3 from 16 processes 2026-10-31 00:30:53,517 Finished 3 from 16 processes 2026-10-31 00:30:58,519 Finished 3 from 16 processes 2026-10-31 00:31:03,521 Finished 6 from 16 processes 2026-10-31 00:31:08,525 Finished 8 from 16 processes 2026-10-31 00:31:13,530 Finished 8 from 16 processes 2026-10-31 00:31:18,535 Finished 8 from 16 processes 2026-10-31 00:31:23,540 Finished 8 from 16 processes 2026-10-31 00:31:28,545 Finished 8 from 16 processes 2026-10-31 00:31:33,551 Finished 8 from 16 processes 2026-10-31 00:31:38,553 Finished 8 from 16 processes 2026-10-31 00:31:43,557 Finished 8 from 16 processes 2026-10-31 00:31:48,561 Finished 8 from 16 processes 2026-10-31 00:31:53,565 Finished 8 from 16 processes 2026-10-31 00:31:58,569 Finished 8 from 16 processes 2026-10-31 00:32:03,573 Finished 8 from 16 processes 2026-10-31 00:32:08,577 Finished 8 from 16 processes 2026-10-31 00:32:13,581 Finished 8 from 16 processes 2026-10-31 00:32:18,585 Finished 8 from 16 processes 2026-10-31 00:32:23,589 Finished 8 from 16 processes 2026-10-31 00:32:28,593 Finished 8 from 16 processes 2026-10-31 00:32:33,599 Finished 8 from 16 processes 2026-10-31 00:32:38,604 Finished 8 from 16 processes 2026-10-31 00:32:43,607 Finished 8 from 16 processes 2026-10-31 00:32:48,613 Finished 8 from 16 processes 2026-10-31 00:32:53,618 Finished 8 from 16 processes 2026-10-31 00:32:58,623 Finished 8 from 16 processes Recursive internal problem. 2026-10-31 00:33:03,628 Finished 8 from 16 processes 2026-10-31 00:33:08,633 Finished 8 from 16 processes 2026-10-31 00:33:13,637 Finished 8 from 16 processes 2026-10-31 00:33:18,641 Finished 8 from 16 processes 2026-10-31 00:33:23,645 Finished 8 from 16 processes 2026-10-31 00:33:28,651 Finished 8 from 16 processes 2026-10-31 00:33:33,653 Finished 8 from 16 processes 2026-10-31 00:33:38,658 Finished 9 from 16 processes 2026-10-31 00:33:43,663 Finished 10 from 16 processes 2026-10-31 00:33:48,665 Finished 10 from 16 processes 2026-10-31 00:33:53,669 Finished 10 from 16 processes 2026-10-31 00:33:58,673 Finished 10 from 16 processes 2026-10-31 00:34:03,679 Finished 10 from 16 processes 2026-10-31 00:34:08,684 Finished 11 from 16 processes 2026-10-31 00:34:13,685 Finished 11 from 16 processes 2026-10-31 00:34:18,691 Finished 11 from 16 processes 2026-10-31 00:34:23,691 Finished 11 from 16 processes 2026-10-31 00:34:28,696 Finished 11 from 16 processes 2026-10-31 00:34:33,697 Finished 11 from 16 processes 2026-10-31 00:34:38,701 Finished 11 from 16 processes 2026-10-31 00:34:43,707 Finished 11 from 16 processes 2026-10-31 00:34:48,712 Finished 11 from 16 processes 2026-10-31 00:34:53,717 Finished 11 from 16 processes 2026-10-31 00:34:58,723 Finished 12 from 16 processes 2026-10-31 00:35:03,728 Finished 12 from 16 processes 2026-10-31 00:35:08,733 Finished 12 from 16 processes 2026-10-31 00:35:13,739 Finished 12 from 16 processes 2026-10-31 00:35:18,744 Finished 12 from 16 processes 2026-10-31 00:35:23,749 Finished 12 from 16 processes 2026-10-31 00:35:28,755 Finished 12 from 16 processes 2026-10-31 00:35:33,760 Finished 12 from 16 processes 2026-10-31 00:35:38,761 Finished 12 from 16 processes 2026-10-31 00:35:43,767 Finished 13 from 16 processes 2026-10-31 00:35:48,772 Finished 13 from 16 processes 2026-10-31 00:35:53,777 Finished 13 from 16 processes 2026-10-31 00:35:58,783 Finished 13 from 16 processes 2026-10-31 00:36:03,788 Finished 13 from 16 processes 2026-10-31 00:36:08,793 Finished 13 from 16 processes 2026-10-31 00:36:13,797 Finished 13 from 16 processes 2026-10-31 00:36:18,803 Finished 13 from 16 processes 2026-10-31 00:36:23,808 Finished 13 from 16 processes 2026-10-31 00:36:28,813 Finished 14 from 16 processes 2026-10-31 00:36:33,818 Finished 14 from 16 processes 2026-10-31 00:36:38,823 Finished 14 from 16 processes 2026-10-31 00:36:43,828 Finished 14 from 16 processes 2026-10-31 00:36:48,834 Finished 14 from 16 processes 2026-10-31 00:36:53,839 Finished 14 from 16 processes 2026-10-31 00:36:58,844 Finished 14 from 16 processes 2026-10-31 00:37:03,850 Finished 14 from 16 processes 2026-10-31 00:37:08,855 Finished 14 from 16 processes 2026-10-31 00:37:13,860 Finished 14 from 16 processes 2026-10-31 00:37:18,866 Finished 14 from 16 processes 2026-10-31 00:37:23,871 Finished 14 from 16 processes 2026-10-31 00:37:28,876 Finished 14 from 16 processes 2026-10-31 00:37:33,882 Finished 14 from 16 processes 2026-10-31 00:37:38,885 Finished 14 from 16 processes 2026-10-31 00:37:43,891 Finished 14 from 16 processes 2026-10-31 00:37:48,896 Finished 14 from 16 processes 2026-10-31 00:37:53,901 Finished 14 from 16 processes 2026-10-31 00:37:58,907 Finished 14 from 16 processes 2026-10-31 00:38:03,912 Finished 14 from 16 processes 2026-10-31 00:38:08,915 Finished 14 from 16 processes 2026-10-31 00:38:13,920 Finished 14 from 16 processes 2026-10-31 00:38:18,925 Finished 14 from 16 processes 2026-10-31 00:38:23,931 Finished 14 from 16 processes 2026-10-31 00:38:28,936 Finished 14 from 16 processes 2026-10-31 00:38:33,941 Finished 14 from 16 processes 2026-10-31 00:38:38,947 Finished 14 from 16 processes 2026-10-31 00:38:43,952 Finished 14 from 16 processes 2026-10-31 00:38:48,957 Finished 14 from 16 processes 2026-10-31 00:38:53,961 Finished 14 from 16 processes 2026-10-31 00:38:58,967 Finished 14 from 16 processes 2026-10-31 00:39:03,969 Finished 14 from 16 processes 2026-10-31 00:39:08,975 Finished 14 from 16 processes 2026-10-31 00:39:13,980 Finished 14 from 16 processes 2026-10-31 00:39:18,985 Finished 14 from 16 processes 2026-10-31 00:39:23,991 Finished 14 from 16 processes 2026-10-31 00:39:28,993 Finished 14 from 16 processes 2026-10-31 00:39:33,997 Finished 14 from 16 processes 2026-10-31 00:39:39,002 Finished 14 from 16 processes 2026-10-31 00:39:44,004 Finished 14 from 16 processes 2026-10-31 00:39:49,009 Finished 14 from 16 processes 2026-10-31 00:39:54,015 Finished 14 from 16 processes 2026-10-31 00:39:59,020 Finished 14 from 16 processes 2026-10-31 00:40:04,025 Finished 14 from 16 processes 2026-10-31 00:40:09,031 Finished 14 from 16 processes 2026-10-31 00:40:14,036 Finished 14 from 16 processes 2026-10-31 00:40:19,041 Finished 14 from 16 processes 2026-10-31 00:40:24,047 Finished 14 from 16 processes 2026-10-31 00:40:29,052 Finished 14 from 16 processes 2026-10-31 00:40:34,053 Finished 14 from 16 processes 2026-10-31 00:40:39,059 Finished 14 from 16 processes 2026-10-31 00:40:44,064 Finished 14 from 16 processes 2026-10-31 00:40:49,070 Finished 14 from 16 processes 2026-10-31 00:40:54,075 Finished 14 from 16 processes 2026-10-31 00:40:59,077 Finished 14 from 16 processes 2026-10-31 00:41:04,081 Finished 14 from 16 processes 2026-10-31 00:41:09,087 Finished 14 from 16 processes 2026-10-31 00:41:14,089 Finished 14 from 16 processes 2026-10-31 00:41:19,095 Finished 14 from 16 processes 2026-10-31 00:41:24,100 Finished 14 from 16 processes 2026-10-31 00:41:29,105 Finished 14 from 16 processes 2026-10-31 00:41:34,109 Finished 14 from 16 processes 2026-10-31 00:41:39,115 Finished 14 from 16 processes 2026-10-31 00:41:44,120 Finished 14 from 16 processes 2026-10-31 00:41:49,125 Finished 14 from 16 processes 2026-10-31 00:41:54,131 Finished 14 from 16 processes 2026-10-31 00:41:59,135 Finished 14 from 16 processes 2026-10-31 00:42:04,140 Finished 15 from 16 processes 2026-10-31 00:42:09,146 Finished 15 from 16 processes 2026-10-31 00:42:14,151 Finished 15 from 16 processes 2026-10-31 00:42:19,157 Finished 15 from 16 processes 2026-10-31 00:42:24,162 Finished 15 from 16 processes 2026-10-31 00:42:29,167 Finished 15 from 16 processes 2026-10-31 00:42:34,173 Finished 15 from 16 processes 2026-10-31 00:42:39,178 Finished 15 from 16 processes 2026-10-31 00:42:44,183 Finished 15 from 16 processes 2026-10-31 00:42:49,189 Finished 15 from 16 processes 2026-10-31 00:42:54,194 Finished 15 from 16 processes 2026-10-31 00:42:59,199 Finished 15 from 16 processes 2026-10-31 00:43:04,205 Finished 15 from 16 processes 2026-10-31 00:43:09,210 Finished 15 from 16 processes 2026-10-31 00:43:14,215 Finished 15 from 16 processes 2026-10-31 00:43:19,221 Finished 15 from 16 processes 2026-10-31 00:43:24,226 Finished 15 from 16 processes 2026-10-31 00:43:29,232 All processes finished 2026-10-31 00:43:29,232 Compressing stress logs 2026-10-31 00:43:29,268 Logs compressed 2026-10-31 00:43:29,269 Will terminate gdb (if any) /bin/sh: 1: kill: Usage: kill [-s sigspec | -signum | -sigspec] [pid | job]... or kill -l [exitstatus] /bin/sh: 1: kill: Usage: kill [-s sigspec | -signum | -sigspec] [pid | job]... or kill -l [exitstatus] /bin/sh: 1: kill: Usage: kill [-s sigspec | -signum | -sigspec] [pid | job]... or kill -l [exitstatus] /bin/sh: 1: kill: Usage: kill [-s sigspec | -signum | -sigspec] [pid | job]... or kill -l [exitstatus] /bin/sh: 1: kill: Usage: kill [-s sigspec | -signum | -sigspec] [pid | job]... or kill -l [exitstatus] /bin/sh: 1: kill: Usage: kill [-s sigspec | -signum | -sigspec] [pid | job]... or kill -l [exitstatus] /bin/sh: 1: kill: Usage: kill [-s sigspec | -signum | -sigspec] [pid | job]... or kill -l [exitstatus] /bin/sh: 1: kill: Usage: kill [-s sigspec | -signum | -sigspec] [pid | job]... or kill -l [exitstatus] /bin/sh: 1: kill: Usage: kill [-s sigspec | -signum | -sigspec] [pid | job]... or kill -l [exitstatus] /bin/sh: 1: kill: Usage: kill [-s sigspec | -signum | -sigspec] [pid | job]... or kill -l [exitstatus] Code: 210. DB::NetException: Connection refused (localhost:9000). (NETWORK_ERROR) Code: 210. DB::NetException: Connection refused (localhost:9000). (NETWORK_ERROR) Code: 210. DB::NetException: Connection refused (localhost:9000). (NETWORK_ERROR) Code: 210. DB::NetException: Connection refused (localhost:9000). (NETWORK_ERROR) Code: 210. DB::NetException: Connection refused (localhost:9000). (NETWORK_ERROR) Code: 210. DB::NetException: Connection refused (localhost:9000). (NETWORK_ERROR) Code: 210. DB::NetException: Connection refused (localhost:9000). (NETWORK_ERROR) Code: 210. DB::NetException: Connection refused (localhost:9000). (NETWORK_ERROR) Code: 210. DB::NetException: Connection refused (localhost:9000). (NETWORK_ERROR) Code: 210. DB::NetException: Connection refused (localhost:9000). (NETWORK_ERROR) Code: 210. DB::NetException: Connection refused (localhost:9000). (NETWORK_ERROR) Code: 210. DB::NetException: Connection refused (localhost:9000). (NETWORK_ERROR) Code: 210. DB::NetException: Connection refused (localhost:9000). (NETWORK_ERROR) Code: 210. DB::NetException: Connection refused (localhost:9000). (NETWORK_ERROR) Code: 210. DB::NetException: Connection refused (localhost:9000). (NETWORK_ERROR) Code: 210. DB::NetException: Connection refused (localhost:9000). (NETWORK_ERROR) Code: 210. DB::NetException: Connection refused (localhost:9000). (NETWORK_ERROR) Code: 210. DB::NetException: Connection refused (localhost:9000). (NETWORK_ERROR) Code: 210. DB::NetException: Connection refused (localhost:9000). (NETWORK_ERROR) Code: 210. DB::NetException: Connection refused (localhost:9000). (NETWORK_ERROR) Code: 210. DB::NetException: Connection refused (localhost:9000). (NETWORK_ERROR) Code: 210. DB::NetException: Connection refused (localhost:9000). (NETWORK_ERROR) Code: 210. DB::NetException: Connection refused (localhost:9000). (NETWORK_ERROR) Code: 210. DB::NetException: Connection refused (localhost:9000). (NETWORK_ERROR) Code: 210. DB::NetException: Connection refused (localhost:9000). (NETWORK_ERROR) Code: 210. DB::NetException: Connection refused (localhost:9000). (NETWORK_ERROR) Code: 210. DB::NetException: Connection refused (localhost:9000). (NETWORK_ERROR) Code: 210. DB::NetException: Connection refused (localhost:9000). (NETWORK_ERROR) Code: 210. DB::NetException: Connection refused (localhost:9000). (NETWORK_ERROR) Code: 210. DB::NetException: Connection refused (localhost:9000). (NETWORK_ERROR) Code: 210. DB::NetException: Connection refused (localhost:9000). (NETWORK_ERROR) Code: 210. DB::NetException: Connection refused (localhost:9000). (NETWORK_ERROR) Code: 210. DB::NetException: Connection refused (localhost:9000). (NETWORK_ERROR) Code: 210. DB::NetException: Connection refused (localhost:9000). (NETWORK_ERROR) Code: 210. DB::NetException: Connection refused (localhost:9000). (NETWORK_ERROR) Code: 210. DB::NetException: Connection refused (localhost:9000). (NETWORK_ERROR) Code: 210. DB::NetException: Connection refused (localhost:9000). (NETWORK_ERROR) Code: 210. DB::NetException: Connection refused (localhost:9000). (NETWORK_ERROR) Code: 210. DB::NetException: Connection refused (localhost:9000). (NETWORK_ERROR) Code: 210. DB::NetException: Connection refused (localhost:9000). (NETWORK_ERROR) Code: 210. DB::NetException: Connection refused (localhost:9000). (NETWORK_ERROR) Code: 210. DB::NetException: Connection refused (localhost:9000). (NETWORK_ERROR) Code: 210. DB::NetException: Connection refused (localhost:9000). (NETWORK_ERROR) Code: 210. DB::NetException: Connection refused (localhost:9000). (NETWORK_ERROR) Code: 210. DB::NetException: Connection refused (localhost:9000). (NETWORK_ERROR) Code: 210. DB::NetException: Connection refused (localhost:9000). (NETWORK_ERROR) Code: 210. DB::NetException: Connection refused (localhost:9000). (NETWORK_ERROR) Code: 210. DB::NetException: Connection refused (localhost:9000). (NETWORK_ERROR) Code: 210. DB::NetException: Connection refused (localhost:9000). (NETWORK_ERROR) Code: 210. DB::NetException: Connection refused (localhost:9000). (NETWORK_ERROR) Code: 210. DB::NetException: Connection refused (localhost:9000). (NETWORK_ERROR) Code: 210. DB::NetException: Connection refused (localhost:9000). (NETWORK_ERROR) Code: 210. DB::NetException: Connection refused (localhost:9000). (NETWORK_ERROR) Code: 210. DB::NetException: Connection refused (localhost:9000). (NETWORK_ERROR) Code: 210. DB::NetException: Connection refused (localhost:9000). (NETWORK_ERROR) Code: 210. DB::NetException: Connection refused (localhost:9000). (NETWORK_ERROR) Code: 210. DB::NetException: Connection refused (localhost:9000). (NETWORK_ERROR) Code: 210. DB::NetException: Connection refused (localhost:9000). (NETWORK_ERROR) Code: 210. DB::NetException: Connection refused (localhost:9000). (NETWORK_ERROR) Code: 210. DB::NetException: Connection refused (localhost:9000). (NETWORK_ERROR) Code: 210. DB::NetException: Connection refused (localhost:9000). (NETWORK_ERROR) Code: 210. DB::NetException: Connection refused (localhost:9000). (NETWORK_ERROR) Code: 210. DB::NetException: Connection refused (localhost:9000). (NETWORK_ERROR) Code: 210. DB::NetException: Connection refused (localhost:9000). (NETWORK_ERROR) Code: 210. DB::NetException: Connection refused (localhost:9000). (NETWORK_ERROR) Code: 210. DB::NetException: Connection refused (localhost:9000). (NETWORK_ERROR) Code: 210. DB::NetException: Connection refused (localhost:9000). (NETWORK_ERROR) Code: 210. DB::NetException: Connection refused (localhost:9000). (NETWORK_ERROR) Code: 210. DB::NetException: Connection refused (localhost:9000). (NETWORK_ERROR) Code: 210. DB::NetException: Connection refused (localhost:9000). (NETWORK_ERROR) Code: 210. DB::NetException: Connection refused (localhost:9000). (NETWORK_ERROR) 2026-10-31 00:46:27,047 Failed to SHOW or DROP databasese, will retry Command 'clickhouse client -q "SHOW DATABASES" --max_untracked_memory=1Gi --memory_profiler_step=1Gi --max_memory_usage_for_user=0' returned non-zero exit status 210. Code: 210. DB::NetException: Connection refused (localhost:9000). (NETWORK_ERROR) 2026-10-31 00:46:27,263 Failed to SHOW or DROP databasese, will retry Command 'clickhouse client -q "SHOW DATABASES" --max_untracked_memory=1Gi --memory_profiler_step=1Gi --max_memory_usage_for_user=0' returned non-zero exit status 210. Code: 210. DB::NetException: Connection refused (localhost:9000). (NETWORK_ERROR) 2026-10-31 00:46:28,480 Failed to SHOW or DROP databasese, will retry Command 'clickhouse client -q "SHOW DATABASES" --max_untracked_memory=1Gi --memory_profiler_step=1Gi --max_memory_usage_for_user=0' returned non-zero exit status 210. Code: 210. DB::NetException: Connection refused (localhost:9000). (NETWORK_ERROR) 2026-10-31 00:46:30,670 Failed to SHOW or DROP databasese, will retry Command 'clickhouse client -q "SHOW DATABASES" --max_untracked_memory=1Gi --memory_profiler_step=1Gi --max_memory_usage_for_user=0' returned non-zero exit status 210. Code: 210. DB::NetException: Connection refused (localhost:9000). (NETWORK_ERROR) 2026-10-31 00:46:33,887 Failed to SHOW or DROP databasese, will retry Command 'clickhouse client -q "SHOW DATABASES" --max_untracked_memory=1Gi --memory_profiler_step=1Gi --max_memory_usage_for_user=0' returned non-zero exit status 210. 2026-10-31 00:46:37,891 Failed to prepare for hung check: Cannot drop databases after stress tests. Probably server consumed too much memory and cannot execute simple queries 2026-10-31 00:46:37,892 Checking if some queries hung Using queries from '/usr/share/clickhouse-test/queries' directory Connecting to ClickHouse server...Connection error, will retry: [Errno 111] Connection refused Connection error, will retry: [Errno 111] Connection refused Connection error, will retry: [Errno 111] Connection refused Connection error, will retry: [Errno 111] Connection refused Connection error, will retry: [Errno 111] Connection refused Connection error, will retry: [Errno 111] Connection refused Connection error, will retry: [Errno 111] Connection refused Connection error, will retry: [Errno 111] Connection refused Connection error, will retry: [Errno 111] Connection refused Connection error, will retry: [Errno 111] Connection refused Connection error, will retry: [Errno 111] Connection refused Connection error, will retry: [Errno 111] Connection refused Connection error, will retry: [Errno 111] Connection refused Connection error, will retry: [Errno 111] Connection refused Connection error, will retry: [Errno 111] Connection refused Connection error, will retry: [Errno 111] Connection refused Connection error, will retry: [Errno 111] Connection refused Connection error, will retry: [Errno 111] Connection refused Connection error, will retry: [Errno 111] Connection refused Connection error, will retry: [Errno 111] Connection refused Connection error, will retry: [Errno 111] Connection refused Connection error, will retry: [Errno 111] Connection refused Connection error, will retry: [Errno 111] Connection refused Connection error, will retry: [Errno 111] Connection refused Connection error, will retry: [Errno 111] Connection refused Connection error, will retry: [Errno 111] Connection refused Connection error, will retry: [Errno 111] Connection refused Connection error, will retry: [Errno 111] Connection refused Connection error, will retry: [Errno 111] Connection refused Connection error, will retry: [Errno 111] Connection refused Connection error, will retry: [Errno 111] Connection refused Connection error, will retry: [Errno 111] Connection refused Connection error, will retry: [Errno 111] Connection refused Connection error, will retry: [Errno 111] Connection refused Connection error, will retry: [Errno 111] Connection refused Connection error, will retry: [Errno 111] Connection refused Connection error, will retry: [Errno 111] Connection refused Connection error, will retry: [Errno 111] Connection refused Connection error, will retry: [Errno 111] Connection refused Connection error, will retry: [Errno 111] Connection refused Connection error, will retry: [Errno 111] Connection refused Connection error, will retry: [Errno 111] Connection refused Connection error, will retry: [Errno 111] Connection refused Connection error, will retry: [Errno 111] Connection refused Connection error, will retry: [Errno 111] Connection refused Connection error, will retry: [Errno 111] Connection refused Connection error, will retry: [Errno 111] Connection refused Connection error, will retry: [Errno 111] Connection refused Connection error, will retry: [Errno 111] Connection refused Connection error, will retry: [Errno 111] Connection refused Connection error, will retry: [Errno 111] Connection refused Connection error, will retry: [Errno 111] Connection refused Connection error, will retry: [Errno 111] Connection refused Connection error, will retry: [Errno 111] Connection refused Connection error, will retry: [Errno 111] Connection refused Connection error, will retry: [Errno 111] Connection refused Connection error, will retry: [Errno 111] Connection refused Connection error, will retry: [Errno 111] Connection refused Connection error, will retry: [Errno 111] Connection refused Connection error, will retry: [Errno 111] Connection refused Connection error, will retry: [Errno 111] Connection refused Connection error, will retry: [Errno 111] Connection refused Connection error, will retry: [Errno 111] Connection refused Connection error, will retry: [Errno 111] Connection refused Connection error, will retry: [Errno 111] Connection refused Connection error, will retry: [Errno 111] Connection refused Connection error, will retry: [Errno 111] Connection refused Connection error, will retry: [Errno 111] Connection refused Connection error, will retry: [Errno 111] Connection refused Connection error, will retry: [Errno 111] Connection refused Connection error, will retry: [Errno 111] Connection refused Connection error, will retry: [Errno 111] Connection refused Connection error, will retry: [Errno 111] Connection refused Connection error, will retry: [Errno 111] Connection refused Connection error, will retry: [Errno 111] Connection refused Connection error, will retry: [Errno 111] Connection refused Connection error, will retry: [Errno 111] Connection refused Connection error, will retry: [Errno 111] Connection refused Connection error, will retry: [Errno 111] Connection refused Connection error, will retry: [Errno 111] Connection refused Connection error, will retry: [Errno 111] Connection refused Connection error, will retry: [Errno 111] Connection refused Connection error, will retry: [Errno 111] Connection refused Connection error, will retry: [Errno 111] Connection refused Connection error, will retry: [Errno 111] Connection refused Connection error, will retry: [Errno 111] Connection refused Connection error, will retry: [Errno 111] Connection refused Connection error, will retry: [Errno 111] Connection refused Connection error, will retry: [Errno 111] Connection refused Connection error, will retry: [Errno 111] Connection refused Connection error, will retry: [Errno 111] Connection refused Connection error, will retry: [Errno 111] Connection refused Connection error, will retry: [Errno 111] Connection refused Connection error, will retry: [Errno 111] Connection refused Connection error, will retry: [Errno 111] Connection refused Connection error, will retry: [Errno 111] Connection refused Connection error, will retry: [Errno 111] Connection refused Connection error, will retry: [Errno 111] Connection refused Connection error, will retry: [Errno 111] Connection refused Connection error, will retry: [Errno 111] Connection refused Connection error, will retry: [Errno 111] Connection refused Connection error, will retry: [Errno 111] Connection refused Connection error, will retry: [Errno 111] Connection refused Connection error, will retry: [Errno 111] Connection refused Connection error, will retry: [Errno 111] Connection refused Connection error, will retry: [Errno 111] Connection refused Connection error, will retry: [Errno 111] Connection refused Connection error, will retry: [Errno 111] Connection refused Connection error, will retry: [Errno 111] Connection refused Connection error, will retry: [Errno 111] Connection refused Connection error, will retry: [Errno 111] Connection refused Connection error, will retry: [Errno 111] Connection refused Connection error, will retry: [Errno 111] Connection refused Connection error, will retry: [Errno 111] Connection refused Connection error, will retry: [Errno 111] Connection refused Connection error, will retry: [Errno 111] Connection refused Connection error, will retry: [Errno 111] Connection refused Connection error, will retry: [Errno 111] Connection refused Connection error, will retry: [Errno 111] Connection refused Connection error, will retry: [Errno 111] Connection refused Connection error, will retry: [Errno 111] Connection refused Connection error, will retry: [Errno 111] Connection refused Connection error, will retry: [Errno 111] Connection refused Connection error, will retry: [Errno 111] Connection refused Connection error, will retry: [Errno 111] Connection refused Connection error, will retry: [Errno 111] Connection refused Connection error, will retry: [Errno 111] Connection refused Connection error, will retry: [Errno 111] Connection refused Connection error, will retry: [Errno 111] Connection refused Connection error, will retry: [Errno 111] Connection refused Connection error, will retry: [Errno 111] Connection refused Connection error, will retry: [Errno 111] Connection refused Connection error, will retry: [Errno 111] Connection refused Connection error, will retry: [Errno 111] Connection refused Connection error, will retry: [Errno 111] Connection refused Connection error, will retry: [Errno 111] Connection refused Connection error, will retry: [Errno 111] Connection refused Connection error, will retry: [Errno 111] Connection refused Connection error, will retry: [Errno 111] Connection refused Connection error, will retry: [Errno 111] Connection refused Connection error, will retry: [Errno 111] Connection refused Connection error, will retry: [Errno 111] Connection refused Connection error, will retry: [Errno 111] Connection refused Connection error, will retry: [Errno 111] Connection refused Connection error, will retry: [Errno 111] Connection refused Connection error, will retry: [Errno 111] Connection refused Connection error, will retry: [Errno 111] Connection refused Connection error, will retry: [Errno 111] Connection refused Connection error, will retry: [Errno 111] Connection refused Connection error, will retry: [Errno 111] Connection refused Connection error, will retry: [Errno 111] Connection refused Connection error, will retry: [Errno 111] Connection refused Connection error, will retry: [Errno 111] Connection refused Connection error, will retry: [Errno 111] Connection refused Connection error, will retry: [Errno 111] Connection refused Connection error, will retry: [Errno 111] Connection refused Connection error, will retry: [Errno 111] Connection refused Connection error, will retry: [Errno 111] Connection refused Connection error, will retry: [Errno 111] Connection refused Connection error, will retry: [Errno 111] Connection refused Connection error, will retry: [Errno 111] Connection refused Connection error, will retry: [Errno 111] Connection refused Connection error, will retry: [Errno 111] Connection refused Connection error, will retry: [Errno 111] Connection refused Connection error, will retry: [Errno 111] Connection refused Connection error, will retry: [Errno 111] Connection refused Connection error, will retry: [Errno 111] Connection refused Connection error, will retry: [Errno 111] Connection refused Connection error, will retry: [Errno 111] Connection refused Connection error, will retry: [Errno 111] Connection refused Connection error, will retry: [Errno 111] Connection refused Connection error, will retry: [Errno 111] Connection refused Connection error, will retry: [Errno 111] Connection refused Connection error, will retry: [Errno 111] Connection refused Connection error, will retry: [Errno 111] Connection refused Connection error, will retry: [Errno 111] Connection refused Connection error, will retry: [Errno 111] Connection refused Connection error, will retry: [Errno 111] Connection refused Connection error, will retry: [Errno 111] Connection refused Connection error, will retry: [Errno 111] Connection refused All connection tries failed Server is not responding. Cannot execute 'SELECT 1' query. Cannot get server pid with pidof -s clickhouse-server, got : Command 'pidof -s clickhouse-server' returned non-zero exit status 1. Got server pid None Cannot get server pid with pidof -s clickhouse-server, got : Command 'pidof -s clickhouse-server' returned non-zero exit status 1. Collecting stacktraces from system.stacktraces table: Error occurred while receiving stack traces from client: Command '/usr/bin/clickhouse-client --max_untracked_memory=1Gi --max_memory_usage_for_user=0 --memory_profiler_step=1Gi --allow_introspection_functions=1 --skip_unavailable_shards=1 --query "SELECT thread_name, thread_id, query_id, trace, arrayStringConcat(arrayMap(x, y -> concat(x, ': ', y), arrayMap(x -> addressToLine(x), trace), arrayMap(x -> demangle(addressToSymbol(x)), trace)), ' ') as trace_str FROM system.stack_trace FORMAT Vertical"' returned non-zero exit status 210. Unable to locate ClickHouse server process listening at TCP port 9000. It must have crashed or exited prematurely! Traceback (most recent call last): File "/usr/bin/clickhouse-test", line 2848, in main(args) File "/usr/bin/clickhouse-test", line 2274, in main raise Exception(msg) Exception: Server is not responding. Cannot execute 'SELECT 1' query. 2026-10-31 00:48:09,153 Hung check failed with exit code 1 2026-10-31 00:48:09,153 Stress test finished + echo -e 'Test script exit code\tOK\t\N\t' + rg -Fa 'No queries hung' /test_output/test_results.tsv + grep -Fa OK ++ head_escaped /test_output/hung_check.log ++ head -n 100 /test_output/hung_check.log ++ escaped ++ clickhouse local -S 's String' --input-format=LineAsString -q 'select substr(s, 1, 300) from table format CustomSeparated settings format_custom_row_after_delimiter='\''\\\\n'\''' + echo -e 'Hung check failed, possible deadlock found (see hung_check.log)\tFAIL\t\N\tUsing queries from \'\''/usr/share/clickhouse-test/queries\'\'' directory\\nConnecting to ClickHouse server...Connection error, will retry: [Errno 111] Connection refused\\nConnection error, will retry: [Errno 111] Connection refused\\nConnection error, will retry: [Errno 111] Connection refused\\nConnection error, will retry: [Errno 111] Connection refused\\nConnection error, will retry: [Errno 111] Connection refused\\nConnection error, will retry: [Errno 111] Connection refused\\nConnection error, will retry: [Errno 111] Connection refused\\nConnection error, will retry: [Errno 111] Connection refused\\nConnection error, will retry: [Errno 111] Connection refused\\nConnection error, will retry: [Errno 111] Connection refused\\nConnection error, will retry: [Errno 111] Connection refused\\nConnection error, will retry: [Errno 111] Connection refused\\nConnection error, will retry: [Errno 111] Connection refused\\nConnection error, will retry: [Errno 111] Connection refused\\nConnection error, will retry: [Errno 111] Connection refused\\nConnection error, will retry: [Errno 111] Connection refused\\nConnection error, will retry: [Errno 111] Connection refused\\nConnection error, will retry: [Errno 111] Connection refused\\nConnection error, will retry: [Errno 111] Connection refused\\nConnection error, will retry: [Errno 111] Connection refused\\nConnection error, will retry: [Errno 111] Connection refused\\nConnection error, will retry: [Errno 111] Connection refused\\nConnection error, will retry: [Errno 111] Connection refused\\nConnection error, will retry: [Errno 111] Connection refused\\nConnection error, will retry: [Errno 111] Connection refused\\nConnection error, will retry: [Errno 111] Connection refused\\nConnection error, will retry: [Errno 111] Connection refused\\nConnection error, will retry: [Errno 111] Connection refused\\nConnection error, will retry: [Errno 111] Connection refused\\nConnection error, will retry: [Errno 111] Connection refused\\nConnection error, will retry: [Errno 111] Connection refused\\nConnection error, will retry: [Errno 111] Connection refused\\nConnection error, will retry: [Errno 111] Connection refused\\nConnection error, will retry: [Errno 111] Connection refused\\nConnection error, will retry: [Errno 111] Connection refused\\nConnection error, will retry: [Errno 111] Connection refused\\nConnection error, will retry: [Errno 111] Connection refused\\nConnection error, will retry: [Errno 111] Connection refused\\nConnection error, will retry: [Errno 111] Connection refused\\nConnection error, will retry: [Errno 111] Connection refused\\nConnection error, will retry: [Errno 111] Connection refused\\nConnection error, will retry: [Errno 111] Connection refused\\nConnection error, will retry: [Errno 111] Connection refused\\nConnection error, will retry: [Errno 111] Connection refused\\nConnection error, will retry: [Errno 111] Connection refused\\nConnection error, will retry: [Errno 111] Connection refused\\nConnection error, will retry: [Errno 111] Connection refused\\nConnection error, will retry: [Errno 111] Connection refused\\nConnection error, will retry: [Errno 111] Connection refused\\nConnection error, will retry: [Errno 111] Connection refused\\nConnection error, will retry: [Errno 111] Connection refused\\nConnection error, will retry: [Errno 111] Connection refused\\nConnection error, will retry: [Errno 111] Connection refused\\nConnection error, will retry: [Errno 111] Connection refused\\nConnection error, will retry: [Errno 111] Connection refused\\nConnection error, will retry: [Errno 111] Connection refused\\nConnection error, will retry: [Errno 111] Connection refused\\nConnection error, will retry: [Errno 111] Connection refused\\nConnection error, will retry: [Errno 111] Connection refused\\nConnection error, will retry: [Errno 111] Connection refused\\nConnection error, will retry: [Errno 111] Connection refused\\nConnection error, will retry: [Errno 111] Connection refused\\nConnection error, will retry: [Errno 111] Connection refused\\nConnection error, will retry: [Errno 111] Connection refused\\nConnection error, will retry: [Errno 111] Connection refused\\nConnection error, will retry: [Errno 111] Connection refused\\nConnection error, will retry: [Errno 111] Connection refused\\nConnection error, will retry: [Errno 111] Connection refused\\nConnection error, will retry: [Errno 111] Connection refused\\nConnection error, will retry: [Errno 111] Connection refused\\nConnection error, will retry: [Errno 111] Connection refused\\nConnection error, will retry: [Errno 111] Connection refused\\nConnection error, will retry: [Errno 111] Connection refused\\nConnection error, will retry: [Errno 111] Connection refused\\nConnection error, will retry: [Errno 111] Connection refused\\nConnection error, will retry: [Errno 111] Connection refused\\nConnection error, will retry: [Errno 111] Connection refused\\nConnection error, will retry: [Errno 111] Connection refused\\nConnection error, will retry: [Errno 111] Connection refused\\nConnection error, will retry: [Errno 111] Connection refused\\nConnection error, will retry: [Errno 111] Connection refused\\nConnection error, will retry: [Errno 111] Connection refused\\nConnection error, will retry: [Errno 111] Connection refused\\nConnection error, will retry: [Errno 111] Connection refused\\nConnection error, will retry: [Errno 111] Connection refused\\nConnection error, will retry: [Errno 111] Connection refused\\nConnection error, will retry: [Errno 111] Connection refused\\nConnection error, will retry: [Errno 111] Connection refused\\nConnection error, will retry: [Errno 111] Connection refused\\nConnection error, will retry: [Errno 111] Connection refused\\nConnection error, will retry: [Errno 111] Connection refused\\nConnection error, will retry: [Errno 111] Connection refused\\nConnection error, will retry: [Errno 111] Connection refused\\nConnection error, will retry: [Errno 111] Connection refused\\nConnection error, will retry: [Errno 111] Connection refused\\nConnection error, will retry: [Errno 111] Connection refused\\nConnection error, will retry: [Errno 111] Connection refused\\nConnection error, will retry: [Errno 111] Connection refused\\nConnection error, will retry: [Errno 111] Connection refused\\n' + stop + local max_tries=90 + local check_hang=true + local pid ++ cat /var/run/clickhouse-server/clickhouse-server.pid + pid=1887 + clickhouse stop --max-tries 90 --do-not-kill /var/run/clickhouse-server/clickhouse-server.pid file exists and contains pid = 1887. The process with pid = 1887 does not exist. + return + mv /var/log/clickhouse-server/clickhouse-server.log /var/log/clickhouse-server/clickhouse-server.stress.log + unset THREAD_FUZZER_CPU_TIME_PERIOD_US THREAD_FUZZER_EXPLICIT_MEMORY_EXCEPTION_PROBABILITY THREAD_FUZZER_EXPLICIT_SLEEP_PROBABILITY THREAD_FUZZER_SLEEP_PROBABILITY THREAD_FUZZER_SLEEP_TIME_US THREAD_FUZZER_pthread_mutex_lock_AFTER_MIGRATE_PROBABILITY THREAD_FUZZER_pthread_mutex_lock_AFTER_SLEEP_PROBABILITY THREAD_FUZZER_pthread_mutex_lock_AFTER_SLEEP_TIME_US THREAD_FUZZER_pthread_mutex_lock_BEFORE_MIGRATE_PROBABILITY THREAD_FUZZER_pthread_mutex_lock_BEFORE_SLEEP_PROBABILITY THREAD_FUZZER_pthread_mutex_lock_BEFORE_SLEEP_TIME_US THREAD_FUZZER_pthread_mutex_unlock_AFTER_MIGRATE_PROBABILITY THREAD_FUZZER_pthread_mutex_unlock_AFTER_SLEEP_PROBABILITY THREAD_FUZZER_pthread_mutex_unlock_AFTER_SLEEP_TIME_US THREAD_FUZZER_pthread_mutex_unlock_BEFORE_MIGRATE_PROBABILITY THREAD_FUZZER_pthread_mutex_unlock_BEFORE_SLEEP_PROBABILITY THREAD_FUZZER_pthread_mutex_unlock_BEFORE_SLEEP_TIME_US + start + counter=0 + clickhouse-client --query 'SELECT 1' Code: 210. DB::NetException: Connection refused (localhost:9000). (NETWORK_ERROR) + '[' 0 -gt 120 ']' + clickhouse start --user root + sleep 0.5 + counter=1 + clickhouse-client --query 'SELECT 1' Code: 210. DB::NetException: Connection refused (localhost:9000). (NETWORK_ERROR) + '[' 1 -gt 120 ']' + clickhouse start --user root + sleep 0.5 + counter=2 + clickhouse-client --query 'SELECT 1' Code: 210. DB::NetException: Connection refused (localhost:9000). (NETWORK_ERROR) + '[' 2 -gt 120 ']' + clickhouse start --user root 127.0.0.1 - - [30/Oct/2026:23:48:12 +0000] "PUT /devstoreaccount1/cont?restype=container HTTP/1.1" 409 - 127.0.0.1 - - [30/Oct/2026:23:48:12 +0000] "PUT /devstoreaccount1/cont/jdewnvaxxjjysbzueioezhzsdeuenhmd?blockid=rlswqtjnexbotjnjqujzdfxhtftbcluvkoqakxjonuzvbfjzlchnwosdqibobzsa&comp=block HTTP/1.1" 201 - 127.0.0.1 - - [30/Oct/2026:23:48:12 +0000] "PUT /devstoreaccount1/cont/jdewnvaxxjjysbzueioezhzsdeuenhmd?comp=blocklist HTTP/1.1" 201 - + sleep 0.5 127.0.0.1 - - [30/Oct/2026:23:48:12 +0000] "GET /devstoreaccount1/cont/jdewnvaxxjjysbzueioezhzsdeuenhmd HTTP/1.1" 206 4 127.0.0.1 - - [30/Oct/2026:23:48:12 +0000] "GET /devstoreaccount1/cont/jdewnvaxxjjysbzueioezhzsdeuenhmd HTTP/1.1" 206 2 127.0.0.1 - - [30/Oct/2026:23:48:12 +0000] "DELETE /devstoreaccount1/cont/jdewnvaxxjjysbzueioezhzsdeuenhmd HTTP/1.1" 202 - + counter=3 + clickhouse-client --query 'SELECT 1' Code: 210. DB::NetException: Connection refused (localhost:9000). (NETWORK_ERROR) + '[' 3 -gt 120 ']' + clickhouse start --user root + sleep 0.5 + counter=4 + clickhouse-client --query 'SELECT 1' Code: 210. DB::NetException: Connection refused (localhost:9000). (NETWORK_ERROR) + '[' 4 -gt 120 ']' + clickhouse start --user root + sleep 0.5 + counter=5 + clickhouse-client --query 'SELECT 1' Code: 210. DB::NetException: Connection refused (localhost:9000). (NETWORK_ERROR) + '[' 5 -gt 120 ']' + clickhouse start --user root + sleep 0.5 + counter=6 + clickhouse-client --query 'SELECT 1' Code: 210. DB::NetException: Connection refused (localhost:9000). (NETWORK_ERROR) + '[' 6 -gt 120 ']' + clickhouse start --user root + sleep 0.5 + counter=7 + clickhouse-client --query 'SELECT 1' Code: 210. DB::NetException: Connection refused (localhost:9000). (NETWORK_ERROR) + '[' 7 -gt 120 ']' + clickhouse start --user root + sleep 0.5 + counter=8 + clickhouse-client --query 'SELECT 1' 1 + attach_gdb_to_clickhouse ++ kill -l SIGRTMIN + RTMIN=34 + echo ' set follow-fork-mode parent handle SIGHUP nostop noprint pass handle SIGINT nostop noprint pass handle SIGQUIT nostop noprint pass handle SIGPIPE nostop noprint pass handle SIGTERM nostop noprint pass handle SIGUSR1 nostop noprint pass handle SIGUSR2 nostop noprint pass handle SIG34 nostop noprint pass info signals continue backtrace full thread apply all backtrace full info registers disassemble /s up disassemble /s up disassemble /s p "done" detach quit ' + sleep 5 + ts '%Y-%m-%d %H:%M:%S' ++ cat /var/run/clickhouse-server/clickhouse-server.pid + gdb -batch -command script.gdb -p 40483 + run_with_retry 60 clickhouse-client --query 'SELECT '\''Connected to clickhouse-server after attaching gdb'\''' + [[ hxB =~ e ]] + set_e=false + set +e + local total_retries=60 + shift + local retry=0 + '[' 0 -ge 60 ']' + clickhouse-client --query 'SELECT '\''Connected to clickhouse-server after attaching gdb'\''' Connected to clickhouse-server after attaching gdb + false + return + check_server_start + clickhouse-client --query 'SELECT '\''Server successfully started'\'', '\''OK'\'', NULL, '\'''\''' + '[' -s /test_output/application_errors.txt ']' + rm /test_output/application_errors.txt rm: cannot remove '/test_output/application_errors.txt': No such file or directory + stop + local max_tries=90 + local check_hang=true + local pid ++ cat /var/run/clickhouse-server/clickhouse-server.pid + pid=40483 + clickhouse stop --max-tries 90 --do-not-kill script.gdb:13: Error in sourced command file: No stack. /var/run/clickhouse-server/clickhouse-server.pid file exists and contains pid = 40483. The process with pid = 40483 is running. Sent terminate signal to process with pid 40483. Waiting for server to stop /var/run/clickhouse-server/clickhouse-server.pid file exists and contains pid = 40483. The process with pid = 40483 is running. Waiting for server to stop /var/run/clickhouse-server/clickhouse-server.pid file exists and contains pid = 40483. The process with pid = 40483 is running. Waiting for server to stop /var/run/clickhouse-server/clickhouse-server.pid file exists and contains pid = 40483. The process with pid = 40483 is running. Waiting for server to stop /var/run/clickhouse-server/clickhouse-server.pid file exists and contains pid = 40483. The process with pid = 40483 is running. Waiting for server to stop /var/run/clickhouse-server/clickhouse-server.pid file exists and contains pid = 40483. The process with pid = 40483 is running. Waiting for server to stop /var/run/clickhouse-server/clickhouse-server.pid file exists and contains pid = 40483. The process with pid = 40483 is running. Waiting for server to stop Found pid = 40483 in the list of running processes. The process with pid = 40483 is running. Waiting for server to stop Found pid = 40483 in the list of running processes. The process with pid = 40483 is running. Waiting for server to stop Found pid = 40483 in the list of running processes. The process with pid = 40483 is running. Waiting for server to stop Found pid = 40483 in the list of running processes. The process with pid = 40483 is running. Waiting for server to stop Found pid = 40483 in the list of running processes. The process with pid = 40483 is running. Waiting for server to stop Found pid = 40483 in the list of running processes. The process with pid = 40483 is running. Waiting for server to stop Found pid = 40483 in the list of running processes. The process with pid = 40483 is running. Waiting for server to stop Found pid = 40483 in the list of running processes. The process with pid = 40483 is running. Waiting for server to stop Found pid = 40483 in the list of running processes. The process with pid = 40483 is running. Waiting for server to stop Found pid = 40483 in the list of running processes. The process with pid = 40483 is running. Waiting for server to stop Found pid = 40483 in the list of running processes. The process with pid = 40483 is running. Waiting for server to stop Found pid = 40483 in the list of running processes. The process with pid = 40483 is running. Waiting for server to stop Found pid = 40483 in the list of running processes. The process with pid = 40483 is running. Waiting for server to stop Found pid = 40483 in the list of running processes. The process with pid = 40483 is running. Waiting for server to stop Found pid = 40483 in the list of running processes. The process with pid = 40483 is running. Waiting for server to stop Found pid = 40483 in the list of running processes. The process with pid = 40483 is running. Waiting for server to stop Found pid = 40483 in the list of running processes. The process with pid = 40483 is running. Waiting for server to stop Found pid = 40483 in the list of running processes. The process with pid = 40483 is running. Waiting for server to stop Found pid = 40483 in the list of running processes. The process with pid = 40483 is running. Waiting for server to stop Found pid = 40483 in the list of running processes. The process with pid = 40483 is running. Waiting for server to stop Now there is no clickhouse-server process. Server stopped + return + '[' -f /var/log/clickhouse-server/clickhouse-server.log ']' + '[' -f /var/log/clickhouse-server/stderr.log ']' + mv /var/log/clickhouse-server/clickhouse-server.log /var/log/clickhouse-server/clickhouse-server.final.log + check_logs_for_critical_errors + rg -Fa ================== /var/log/clickhouse-server/stderr.log + rg -v 'in query:' + rg -Fa WARNING /var/log/clickhouse-server/stderr.log + rg -Fav -e 'ASan doesn'\''t fully support makecontext/swapcontext functions' -e DB::Exception /test_output/tmp + echo -e 'No sanitizer asserts\tOK\t\N\t' + rm -f /test_output/tmp + rg -Fa ' Application: Child process was terminated by signal 9' /var/log/clickhouse-server/clickhouse-server.err.log /var/log/clickhouse-server/clickhouse-server.final.log /var/log/clickhouse-server/clickhouse-server.initial.log /var/log/clickhouse-server/clickhouse-server.stress.log + echo -e 'No OOM messages in clickhouse-server.log\tOK\t\N\t' + rg -Fa 'Code: 49. DB::Exception: ' /var/log/clickhouse-server/clickhouse-server.err.log /var/log/clickhouse-server/clickhouse-server.final.log /var/log/clickhouse-server/clickhouse-server.initial.log /var/log/clickhouse-server/clickhouse-server.stress.log + echo -e 'No logical errors\tOK\t\N\t' + '[' -s /test_output/logical_errors.txt ']' + rm /test_output/logical_errors.txt + rg --text 'Code: 499.*The specified key does not exist' /var/log/clickhouse-server/clickhouse-server.err.log /var/log/clickhouse-server/clickhouse-server.final.log /var/log/clickhouse-server/clickhouse-server.initial.log /var/log/clickhouse-server/clickhouse-server.stress.log + echo -e 'No lost s3 keys\tOK\t\N\t' + '[' -s /test_output/no_such_key_errors.txt ']' + rm /test_output/no_such_key_errors.txt + rg -Fa '########################################' /var/log/clickhouse-server/clickhouse-server.err.log /var/log/clickhouse-server/clickhouse-server.final.log /var/log/clickhouse-server/clickhouse-server.initial.log /var/log/clickhouse-server/clickhouse-server.stress.log + echo -e 'Not crashed\tOK\t\N\t' + rg -Fa ' ' /var/log/clickhouse-server/clickhouse-server.err.log /var/log/clickhouse-server/clickhouse-server.final.log /var/log/clickhouse-server/clickhouse-server.initial.log /var/log/clickhouse-server/clickhouse-server.stress.log ++ trim_server_logs fatal_messages.txt ++ head -n 100 /test_output/fatal_messages.txt ++ grep -Eo ' \[ [0-9]+ \] \{.*' ++ escaped ++ clickhouse local -S 's String' --input-format=LineAsString -q 'select substr(s, 1, 300) from table format CustomSeparated settings format_custom_row_after_delimiter='\''\\\\n'\''' + echo -e 'Fatal message in clickhouse-server.log (see fatal_messages.txt)\tFAIL\t\N\t [ 2382 ] {50f6de09-fbf4-4150-bf61-4225469135b6} : Logical error: \'\''inserted\'\''.\\n [ 1885 ] {} Application: Child process was terminated by signal 6.\\n [ 2382 ] {50f6de09-fbf4-4150-bf61-4225469135b6} : Logical error: \'\''inserted\'\''.\\n [ 1885 ] {} Application: Child process was terminated by signal 6.\\n' + '[' -s /test_output/fatal_messages.txt ']' + rg -Faz '########################################' /test_output/fatal_messages.txt /test_output/gdb.log /test_output/hung_check.log /test_output/stress_run_logs.tar.zst /test_output/test_results.tsv + rg -Fa ' received signal ' /test_output/gdb.log ++ get_gdb_log_context ++ rg -A50 -Fa ' received signal ' /test_output/gdb.log ++ head_escaped ++ head -n 100 ++ escaped ++ clickhouse local -S 's String' --input-format=LineAsString -q 'select substr(s, 1, 300) from table format CustomSeparated settings format_custom_row_after_delimiter='\''\\\\n'\''' + echo -e 'Found signal in gdb.log\tFAIL\t\N\t2026-10-31 00:32:28 Thread 364 "LoadMarksThread" received signal SIGABRT, Aborted.\\n2026-10-31 00:32:28 [Switching to Thread 0x7f6f4f31e640 (LWP 2382)]\\n2026-10-31 00:32:28 0x00007f7210a029bc in pthread_kill () from /lib/x86_64-linux-gnu/libc.so.6\\n2026-10-31 00:32:28 #0 0x00007f7210a029bc in pthread_kill () from /lib/x86_64-linux-gnu/libc.so.6\\n2026-10-31 00:32:28 No symbol table info available.\\n2026-10-31 00:32:28 #1 0x00007f72109ae476 in raise () from /lib/x86_64-linux-gnu/libc.so.6\\n2026-10-31 00:32:29 No symbol table info available.\\n2026-10-31 00:32:29 #2 0x00007f72109947f3 in abort () from /lib/x86_64-linux-gnu/libc.so.6\\n2026-10-31 00:32:29 No symbol table info available.\\n2026-10-31 00:32:29 #3 0x000055ab1d3a1808 in DB::abortOnFailedAssertion (description=...) at ./src/Common/Exception.cpp:50\\n2026-10-31 00:32:29 always_false = false\\n2026-10-31 00:32:29 #4 0x000055ab31fdb05e in DB::CleanupQueue::add (this=, key=...) at ./src/Interpreters/Cache/Metadata.cpp:376\\n2026-10-31 00:32:29 inserted = \\n2026-10-31 00:32:29 #5 0x000055ab31fd02f6 in DB::LockedKey::~LockedKey (this=0x60300013bbe0) at ./src/Interpreters/Cache/Metadata.cpp:677\\n2026-10-31 00:32:29 No locals.\\n2026-10-31 00:32:29 #6 0x000055ab31fdfa0d in std::__1::default_delete::operator()[abi:v15000](DB::LockedKey*) const (this=, __ptr=0x60300013bbe0) at ./contrib/llvm-project/libcxx/include/__memory/unique_ptr.h:48\\n2026-10-31 00:32:29 No locals.\\n2026-10-31 00:32:29 #7 std::__1::__shared_ptr_pointer, std::__1::allocator >::__on_zero_shared (this=) at ./contrib/llvm-project/libcxx/include/__memory/shared_ptr.h:263\\n2026-10-31 00:32:29 No locals.\\n2026-10-31 00:32:29 #8 0x000055ab31fa59f9 in std::__1::__shared_count::__release_shared[abi:v15000]() (this=0x603001aeff30) at ./contrib/llvm-project/libcxx/include/__memory/shared_ptr.h:174\\n2026-10-31 00:32:29 No locals.\\n2026-10-31 00:32:29 #9 std::__1::__shared_weak_count::__release_shared[abi:v15000]() (this=0x603001aeff30) at ./contrib/llvm-project/libcxx/include/__memory/shared_ptr.h:215\\n2026-10-31 00:32:29 No locals.\\n2026-10-31 00:32:29 #10 std::__1::shared_ptr::~shared_ptr[abi:v15000]() (this=0x7f6ef55ef1e0) at ./contrib/llvm-project/libcxx/include/__memory/shared_ptr.h:702\\n2026-10-31 00:32:29 No locals.\\n2026-10-31 00:32:29 #11 DB::FileSegment::complete (this=) at ./src/Interpreters/Cache/FileSegment.cpp:718\\n2026-10-31 00:32:29 watch = {event = {t = 348}, watch = {start_ns = 3590435581885, stop_ns = 0, clock_type = 1, is_running = true}}\\n2026-10-31 00:32:29 locked_key = {__ptr_ = 0x60300013bbe0, __cntrl_ = 0x603001aeff30}\\n2026-10-31 00:32:29 segment_lock = {> = {__m_ = 0x6120028806c8, __owns_ = true}, }\\n2026-10-31 00:32:29 is_downloader = \\n2026-10-31 00:32:29 is_last_holder = \\n2026-10-31 00:32:29 current_downloaded_size = \\n2026-10-31 00:32:29 scope_exit616 = \\n2026-10-31 00:32:29 #12 0x000055ab31fac0ef in DB::FileSegmentsHolder::completeAndPopFrontImpl (this=0x60300007b8b0) at ./src/Interpreters/Cache/FileSegment.cpp:921\\n2026-10-31 00:32:29 No locals.\\n2026-10-31 00:32:29 #13 DB::FileSegmentsHolder::~FileSegmentsHolder (this=) at ./src/Interpreters/Cache/FileSegment.cpp:933\\n2026-10-31 00:32:29 file_segment_it = \\n2026-10-31 00:32:29 watch = {event = {t = 353}, watch = {start_ns = 3590435580864, stop_ns = 0, clock_type = 1, is_running = true}}\\n2026-10-31 00:32:29 #14 0x000055ab2db12992 in std::__1::default_delete::operator()[abi:v15000](DB::FileSegmentsHolder*) const (this=, __ptr=0x60300007b8b0) at ./contrib/llvm-project/libcxx/include/__memory/unique_ptr.h:48\\n2026-10-31 00:32:29 No locals.\\n2026-10-31 00:32:29 #15 std::__1::unique_ptr >::reset[abi:v15000](DB::FileSegmentsHolder*) (this=, __p=0x0) at ./contrib/llvm-project/libcxx/include/__memory/unique_ptr.h:305\\n2026-10-31 00:32:29 __tmp = 0x60300007b8b0\\n2026-10-31 00:32:29 #16 std::__1::unique_ptr >::~unique_ptr[abi:v15000]() (this=) at ./contrib/llvm-project/libcxx/include/__memory/unique_ptr.h:259\\n2026-10-31 00:32:29 No locals.\\n2026-10-31 00:32:29 #17 DB::CachedOnDiskReadBufferFromFile::~CachedOnDiskReadBufferFromFile (this=0x6180047ba098) at ./src/Disks/IO/CachedOnDiskReadBufferFromFile.cpp:535\\n2026-10-31 00:32:29 No locals.\\n2026-10-31 00:32:29 #18 0x000055ab2daffbf9 in std::__1::__shared_count::__release_shared[abi:v15000]() (this=0x6180047ba080) at ./contrib/llvm-project/libcxx/include/__memory/shared_ptr.h:174\\n2026-10-31 00:32:29 No locals.\\n2026-10-31 00:32:29 #19 std::__1::__shared_weak_count::__release_shared[abi:v15000]() (this=0x6180047ba080) at ./contrib/llvm-project/libcxx/include/__memory/shared_ptr.h:215\\n2026-10-31 00:32:29 No locals.\\n2026-10-31 00:32:29 #20 std::__1::shared_ptr::~shared_ptr[abi:v15000]() (this=0x61600103c1c8) at ./contrib/llvm-project/libcxx/include/__memory/shared_ptr.h:702\\n' + dmesg -T + grep -q -F -e 'Out of memory: Killed process' -e 'oom_reaper: reaped process' -e oom-kill:constraint=CONSTRAINT_NONE /test_output/dmesg.log + echo -e 'No OOM in dmesg\tOK\t\N\t' + tar -chf /test_output/coordination.tar /var/lib/clickhouse/coordination tar: Removing leading `/' from member names tar: Removing leading `/' from hard link targets + collect_query_and_trace_logs + for table in query_log trace_log + clickhouse-local --path /var/lib/clickhouse/ --only-system-tables -q 'select * from system.query_log format TSVWithNamesAndTypes' + zstd --threads=0 + for table in query_log trace_log + zstd --threads=0 + clickhouse-local --path /var/lib/clickhouse/ --only-system-tables -q 'select * from system.trace_log format TSVWithNamesAndTypes' + mv /var/log/clickhouse-server/stderr.log /test_output/ + clickhouse-local --structure 'test String, res String, time Nullable(Float32), desc String' -q 'SELECT '\''failure'\'', test FROM table WHERE res != '\''OK'\'' order by (test like '\''%Sanitizer%'\'') DESC, (test like '\''%Killed by signal%'\'') DESC, (test like '\''%gdb.log%'\'') DESC, (test ilike '\''%possible deadlock%'\'') DESC, (test like '\''%start%'\'') DESC, (test like '\''%dmesg%'\'') DESC, (test like '\''%OOM%'\'') DESC, (test like '\''%Signal 9%'\'') DESC, (test like '\''%Fatal message%'\'') DESC, rowNumberInAllBlocks() LIMIT 1' + '[' -s /test_output/check_status.tsv ']' + rg 'OOM in dmesg|Signal 9' /test_output/check_status.tsv + collect_core_dumps + find . -type f -maxdepth 1 -name 'core.*' + read core