+ ln -s /usr/share/clickhouse-test/ci/stress.py /usr/bin/stress
+ ln -s /usr/share/clickhouse-test/clickhouse-test /usr/bin/clickhouse-test
+ source /attach_gdb.lib
++ source /utils.lib
+++ sysctl kernel.core_pattern=core.%e.%p-%P
kernel.core_pattern = core.%e.%p-%P
+++ sysctl fs.suid_dumpable=1
fs.suid_dumpable = 1
+ source /stress_tests.lib
++ OK='\tOK\t\N\t'
++ FAIL='\tFAIL\t\N\t'
++ FAILURE_CONTEXT_LINES=100
++ FAILURE_CONTEXT_MAX_LINE_WIDTH=300
+ source /utils.lib
++ sysctl kernel.core_pattern=core.%e.%p-%P
kernel.core_pattern = core.%e.%p-%P
++ sysctl fs.suid_dumpable=1
fs.suid_dumpable = 1
+ install_packages package_folder
+ dpkg -i package_folder/clickhouse-common-static_24.8.14.10548.altinitytest+asan_amd64.deb
Selecting previously unselected package clickhouse-common-static.
(Reading database ... 48695 files and directories currently installed.)
Preparing to unpack .../clickhouse-common-static_24.8.14.10548.altinitytest+asan_amd64.deb ...
Unpacking clickhouse-common-static (24.8.14.10548.altinitytest+asan) ...
Setting up clickhouse-common-static (24.8.14.10548.altinitytest+asan) ...
+ dpkg -i package_folder/clickhouse-common-static-dbg_24.8.14.10548.altinitytest+asan_amd64.deb
Selecting previously unselected package clickhouse-common-static-dbg.
(Reading database ... 48722 files and directories currently installed.)
Preparing to unpack .../clickhouse-common-static-dbg_24.8.14.10548.altinitytest+asan_amd64.deb ...
Unpacking clickhouse-common-static-dbg (24.8.14.10548.altinitytest+asan) ...
Setting up clickhouse-common-static-dbg (24.8.14.10548.altinitytest+asan) ...
+ dpkg -i package_folder/clickhouse-server_24.8.14.10548.altinitytest+asan_amd64.deb
Selecting previously unselected package clickhouse-server.
(Reading database ... 48729 files and directories currently installed.)
Preparing to unpack .../clickhouse-server_24.8.14.10548.altinitytest+asan_amd64.deb ...
Unpacking clickhouse-server (24.8.14.10548.altinitytest+asan) ...
Setting up clickhouse-server (24.8.14.10548.altinitytest+asan) ...
ClickHouse binary is already located at /usr/bin/clickhouse
Symlink /usr/bin/clickhouse-server already exists but it points to /clickhouse. Will replace the old symlink to /usr/bin/clickhouse.
Creating symlink /usr/bin/clickhouse-server to /usr/bin/clickhouse.
Creating symlink /usr/bin/clickhouse-client to /usr/bin/clickhouse.
Creating symlink /usr/bin/clickhouse-local to /usr/bin/clickhouse.
Creating symlink /usr/bin/clickhouse-benchmark to /usr/bin/clickhouse.
Creating symlink /usr/bin/clickhouse-obfuscator to /usr/bin/clickhouse.
Creating symlink /usr/bin/clickhouse-git-import to /usr/bin/clickhouse.
Creating symlink /usr/bin/clickhouse-compressor to /usr/bin/clickhouse.
Creating symlink /usr/bin/clickhouse-format to /usr/bin/clickhouse.
Symlink /usr/bin/clickhouse-extract-from-config already exists but it points to /clickhouse. Will replace the old symlink to /usr/bin/clickhouse.
Creating symlink /usr/bin/clickhouse-extract-from-config to /usr/bin/clickhouse.
Symlink /usr/bin/clickhouse-keeper already exists but it points to /clickhouse. Will replace the old symlink to /usr/bin/clickhouse.
Creating symlink /usr/bin/clickhouse-keeper to /usr/bin/clickhouse.
Symlink /usr/bin/clickhouse-keeper-converter already exists but it points to /clickhouse. Will replace the old symlink to /usr/bin/clickhouse.
Creating symlink /usr/bin/clickhouse-keeper-converter to /usr/bin/clickhouse.
Creating symlink /usr/bin/clickhouse-disks to /usr/bin/clickhouse.
Creating symlink /usr/bin/ch to /usr/bin/clickhouse.
Creating symlink /usr/bin/chl to /usr/bin/clickhouse.
Creating symlink /usr/bin/chc to /usr/bin/clickhouse.
Creating clickhouse group if it does not exist.
groupadd -r clickhouse
Creating clickhouse user if it does not exist.
useradd -r --shell /bin/false --home-dir /nonexistent -g clickhouse clickhouse
Will set ulimits for clickhouse user in /etc/security/limits.d/clickhouse.conf.
Creating config directory /etc/clickhouse-server/config.d that is used for tweaks of main server configuration.
Creating config directory /etc/clickhouse-server/users.d that is used for tweaks of users configuration.
Config file /etc/clickhouse-server/config.xml already exists, will keep it and extract path info from it.
/etc/clickhouse-server/config.xml has /var/lib/clickhouse/ as data path.
/etc/clickhouse-server/config.xml has /var/log/clickhouse-server/ as log path.
Users config file /etc/clickhouse-server/users.xml already exists, will keep it and extract users info from it.
Log directory /var/log/clickhouse-server/ already exists.
Creating data directory /var/lib/clickhouse/.
Creating pid directory /var/run/clickhouse-server.
chown -R clickhouse:clickhouse '/var/log/clickhouse-server/'
chown -R clickhouse:clickhouse '/var/run/clickhouse-server'
chown clickhouse:clickhouse '/var/lib/clickhouse/'
Password for the default user is an empty string. See /etc/clickhouse-server/users.xml and /etc/clickhouse-server/users.d to change it.
Setting capabilities for clickhouse binary. This is optional.
chown -R clickhouse:clickhouse '/etc/clickhouse-server'
ClickHouse has been successfully installed.
Start clickhouse-server with:
sudo clickhouse start
Start clickhouse-client with:
clickhouse-client
+ dpkg -i package_folder/clickhouse-client_24.8.14.10548.altinitytest+asan_amd64.deb
Selecting previously unselected package clickhouse-client.
(Reading database ... 48746 files and directories currently installed.)
Preparing to unpack .../clickhouse-client_24.8.14.10548.altinitytest+asan_amd64.deb ...
Unpacking clickhouse-client (24.8.14.10548.altinitytest+asan) ...
Setting up clickhouse-client (24.8.14.10548.altinitytest+asan) ...
+ export THREAD_FUZZER_CPU_TIME_PERIOD_US=1000
+ THREAD_FUZZER_CPU_TIME_PERIOD_US=1000
+ export THREAD_FUZZER_SLEEP_PROBABILITY=0.1
+ THREAD_FUZZER_SLEEP_PROBABILITY=0.1
+ export THREAD_FUZZER_SLEEP_TIME_US_MAX=100000
+ THREAD_FUZZER_SLEEP_TIME_US_MAX=100000
+ export THREAD_FUZZER_pthread_mutex_lock_BEFORE_MIGRATE_PROBABILITY=1
+ THREAD_FUZZER_pthread_mutex_lock_BEFORE_MIGRATE_PROBABILITY=1
+ export THREAD_FUZZER_pthread_mutex_lock_AFTER_MIGRATE_PROBABILITY=1
+ THREAD_FUZZER_pthread_mutex_lock_AFTER_MIGRATE_PROBABILITY=1
+ export THREAD_FUZZER_pthread_mutex_unlock_BEFORE_MIGRATE_PROBABILITY=1
+ THREAD_FUZZER_pthread_mutex_unlock_BEFORE_MIGRATE_PROBABILITY=1
+ export THREAD_FUZZER_pthread_mutex_unlock_AFTER_MIGRATE_PROBABILITY=1
+ THREAD_FUZZER_pthread_mutex_unlock_AFTER_MIGRATE_PROBABILITY=1
+ export THREAD_FUZZER_pthread_mutex_lock_BEFORE_SLEEP_PROBABILITY=0.001
+ THREAD_FUZZER_pthread_mutex_lock_BEFORE_SLEEP_PROBABILITY=0.001
+ export THREAD_FUZZER_pthread_mutex_lock_AFTER_SLEEP_PROBABILITY=0.001
+ THREAD_FUZZER_pthread_mutex_lock_AFTER_SLEEP_PROBABILITY=0.001
+ export THREAD_FUZZER_pthread_mutex_unlock_BEFORE_SLEEP_PROBABILITY=0.001
+ THREAD_FUZZER_pthread_mutex_unlock_BEFORE_SLEEP_PROBABILITY=0.001
+ export THREAD_FUZZER_pthread_mutex_unlock_AFTER_SLEEP_PROBABILITY=0.001
+ THREAD_FUZZER_pthread_mutex_unlock_AFTER_SLEEP_PROBABILITY=0.001
+ export THREAD_FUZZER_pthread_mutex_lock_BEFORE_SLEEP_TIME_US_MAX=10000
+ THREAD_FUZZER_pthread_mutex_lock_BEFORE_SLEEP_TIME_US_MAX=10000
+ export THREAD_FUZZER_pthread_mutex_lock_AFTER_SLEEP_TIME_US_MAX=10000
+ THREAD_FUZZER_pthread_mutex_lock_AFTER_SLEEP_TIME_US_MAX=10000
+ export THREAD_FUZZER_pthread_mutex_unlock_BEFORE_SLEEP_TIME_US_MAX=10000
+ THREAD_FUZZER_pthread_mutex_unlock_BEFORE_SLEEP_TIME_US_MAX=10000
+ export THREAD_FUZZER_pthread_mutex_unlock_AFTER_SLEEP_TIME_US_MAX=10000
+ THREAD_FUZZER_pthread_mutex_unlock_AFTER_SLEEP_TIME_US_MAX=10000
+ export THREAD_FUZZER_EXPLICIT_SLEEP_PROBABILITY=0.01
+ THREAD_FUZZER_EXPLICIT_SLEEP_PROBABILITY=0.01
+ export THREAD_FUZZER_EXPLICIT_MEMORY_EXCEPTION_PROBABILITY=0.01
+ THREAD_FUZZER_EXPLICIT_MEMORY_EXCEPTION_PROBABILITY=0.01
+ export ZOOKEEPER_FAULT_INJECTION=1
+ ZOOKEEPER_FAULT_INJECTION=1
+ configure
+ export USE_DATABASE_ORDINARY=1
+ USE_DATABASE_ORDINARY=1
+ export EXPORT_S3_STORAGE_POLICIES=1
+ EXPORT_S3_STORAGE_POLICIES=1
+ /usr/share/clickhouse-test/config/install.sh
+ DEST_SERVER_PATH=/etc/clickhouse-server
+ DEST_CLIENT_PATH=/etc/clickhouse-client
+++ dirname /usr/share/clickhouse-test/config/install.sh
++ cd /usr/share/clickhouse-test/config
++ pwd -P
Going to install test configs from /usr/share/clickhouse-test/config into /etc/clickhouse-server
+ SRC_PATH=/usr/share/clickhouse-test/config
+ echo 'Going to install test configs from /usr/share/clickhouse-test/config into /etc/clickhouse-server'
+ mkdir -p /etc/clickhouse-server/config.d/
+ mkdir -p /etc/clickhouse-server/users.d/
+ mkdir -p /etc/clickhouse-client
+ ln -sf /usr/share/clickhouse-test/config/config.d/zookeeper_write.xml /etc/clickhouse-server/config.d/
+ ln -sf /usr/share/clickhouse-test/config/config.d/max_num_to_warn.xml /etc/clickhouse-server/config.d/
+ ln -sf /usr/share/clickhouse-test/config/config.d/listen.xml /etc/clickhouse-server/config.d/
+ ln -sf /usr/share/clickhouse-test/config/config.d/text_log.xml /etc/clickhouse-server/config.d/
+ ln -sf /usr/share/clickhouse-test/config/config.d/blob_storage_log.xml /etc/clickhouse-server/config.d/
+ ln -sf /usr/share/clickhouse-test/config/config.d/custom_settings_prefixes.xml /etc/clickhouse-server/config.d/
+ ln -sf /usr/share/clickhouse-test/config/config.d/database_catalog_drop_table_concurrency.xml /etc/clickhouse-server/config.d/
+ ln -sf /usr/share/clickhouse-test/config/config.d/enable_access_control_improvements.xml /etc/clickhouse-server/config.d/
+ ln -sf /usr/share/clickhouse-test/config/config.d/macros.xml /etc/clickhouse-server/config.d/
+ ln -sf /usr/share/clickhouse-test/config/config.d/secure_ports.xml /etc/clickhouse-server/config.d/
+ ln -sf /usr/share/clickhouse-test/config/config.d/clusters.xml /etc/clickhouse-server/config.d/
+ ln -sf /usr/share/clickhouse-test/config/config.d/graphite.xml /etc/clickhouse-server/config.d/
+ ln -sf /usr/share/clickhouse-test/config/config.d/graphite_alternative.xml /etc/clickhouse-server/config.d/
+ ln -sf /usr/share/clickhouse-test/config/config.d/grpc_protocol.xml /etc/clickhouse-server/config.d/
+ ln -sf /usr/share/clickhouse-test/config/config.d/database_atomic.xml /etc/clickhouse-server/config.d/
+ ln -sf /usr/share/clickhouse-test/config/config.d/max_concurrent_queries.xml /etc/clickhouse-server/config.d/
+ ln -sf /usr/share/clickhouse-test/config/config.d/merge_tree_settings.xml /etc/clickhouse-server/config.d/
+ ln -sf /usr/share/clickhouse-test/config/config.d/backoff_failed_mutation.xml /etc/clickhouse-server/config.d/
+ ln -sf /usr/share/clickhouse-test/config/config.d/merge_tree_old_dirs_cleanup.xml /etc/clickhouse-server/config.d/
+ ln -sf /usr/share/clickhouse-test/config/config.d/test_cluster_with_incorrect_pw.xml /etc/clickhouse-server/config.d/
+ ln -sf /usr/share/clickhouse-test/config/config.d/keeper_port.xml /etc/clickhouse-server/config.d/
+ ln -sf /usr/share/clickhouse-test/config/config.d/logging_no_rotate.xml /etc/clickhouse-server/config.d/
+ ln -sf /usr/share/clickhouse-test/config/config.d/merge_tree.xml /etc/clickhouse-server/config.d/
+ ln -sf /usr/share/clickhouse-test/config/config.d/lost_forever_check.xml /etc/clickhouse-server/config.d/
+ ln -sf /usr/share/clickhouse-test/config/config.d/tcp_with_proxy.xml /etc/clickhouse-server/config.d/
+ ln -sf /usr/share/clickhouse-test/config/config.d/prometheus.xml /etc/clickhouse-server/config.d/
+ ln -sf /usr/share/clickhouse-test/config/config.d/top_level_domains_lists.xml /etc/clickhouse-server/config.d/
+ ln -sf /usr/share/clickhouse-test/config/config.d/top_level_domains_path.xml /etc/clickhouse-server/config.d/
+ ln -sf /usr/share/clickhouse-test/config/config.d/transactions.xml /etc/clickhouse-server/config.d/
+ ln -sf /usr/share/clickhouse-test/config/config.d/encryption.xml /etc/clickhouse-server/config.d/
+ ln -sf /usr/share/clickhouse-test/config/config.d/CORS.xml /etc/clickhouse-server/config.d/
+ ln -sf /usr/share/clickhouse-test/config/config.d/zookeeper_log.xml /etc/clickhouse-server/config.d/
+ ln -sf /usr/share/clickhouse-test/config/config.d/logger_trace.xml /etc/clickhouse-server/config.d/
+ ln -sf /usr/share/clickhouse-test/config/config.d/named_collection.xml /etc/clickhouse-server/config.d/
+ ln -sf /usr/share/clickhouse-test/config/config.d/ssl_certs.xml /etc/clickhouse-server/config.d/
+ ln -sf /usr/share/clickhouse-test/config/config.d/filesystem_cache_log.xml /etc/clickhouse-server/config.d/
+ ln -sf /usr/share/clickhouse-test/config/config.d/session_log.xml /etc/clickhouse-server/config.d/
+ ln -sf /usr/share/clickhouse-test/config/config.d/system_unfreeze.xml /etc/clickhouse-server/config.d/
+ ln -sf /usr/share/clickhouse-test/config/config.d/enable_zero_copy_replication.xml /etc/clickhouse-server/config.d/
+ ln -sf /usr/share/clickhouse-test/config/config.d/nlp.xml /etc/clickhouse-server/config.d/
+ ln -sf /usr/share/clickhouse-test/config/config.d/forbidden_headers.xml /etc/clickhouse-server/config.d/
+ ln -sf /usr/share/clickhouse-test/config/config.d/enable_keeper_map.xml /etc/clickhouse-server/config.d/
+ ln -sf /usr/share/clickhouse-test/config/config.d/custom_disks_base_path.xml /etc/clickhouse-server/config.d/
+ ln -sf /usr/share/clickhouse-test/config/config.d/display_name.xml /etc/clickhouse-server/config.d/
+ ln -sf /usr/share/clickhouse-test/config/config.d/compressed_marks_and_index.xml /etc/clickhouse-server/config.d/
+ ln -sf /usr/share/clickhouse-test/config/config.d/disable_s3_env_credentials.xml /etc/clickhouse-server/config.d/
+ ln -sf /usr/share/clickhouse-test/config/config.d/enable_wait_for_shutdown_replicated_tables.xml /etc/clickhouse-server/config.d/
+ ln -sf /usr/share/clickhouse-test/config/config.d/backups.xml /etc/clickhouse-server/config.d/
+ ln -sf /usr/share/clickhouse-test/config/config.d/filesystem_caches_path.xml /etc/clickhouse-server/config.d/
+ ln -sf /usr/share/clickhouse-test/config/config.d/validate_tcp_client_information.xml /etc/clickhouse-server/config.d/
+ ln -sf /usr/share/clickhouse-test/config/config.d/zero_copy_destructive_operations.xml /etc/clickhouse-server/config.d/
+ ln -sf /usr/share/clickhouse-test/config/config.d/block_number.xml /etc/clickhouse-server/config.d/
+ ln -sf /usr/share/clickhouse-test/config/config.d/handlers.yaml /etc/clickhouse-server/config.d/
+ ln -sf /usr/share/clickhouse-test/config/config.d/serverwide_trace_collector.xml /etc/clickhouse-server/config.d/
+ ln -sf /usr/share/clickhouse-test/config/config.d/rocksdb.xml /etc/clickhouse-server/config.d/
+ '[' /etc/clickhouse-server = /etc/clickhouse-server ']'
+ ln -sf /usr/share/clickhouse-test/config/config.d/legacy_geobase.xml /etc/clickhouse-server/config.d/
+ ln -sf /usr/share/clickhouse-test/config/users.d/log_queries.xml /etc/clickhouse-server/users.d/
+ ln -sf /usr/share/clickhouse-test/config/users.d/readonly.xml /etc/clickhouse-server/users.d/
+ ln -sf /usr/share/clickhouse-test/config/users.d/access_management.xml /etc/clickhouse-server/users.d/
+ ln -sf /usr/share/clickhouse-test/config/users.d/database_atomic_drop_detach_sync.xml /etc/clickhouse-server/users.d/
+ ln -sf /usr/share/clickhouse-test/config/users.d/opentelemetry.xml /etc/clickhouse-server/users.d/
+ ln -sf /usr/share/clickhouse-test/config/users.d/remote_queries.xml /etc/clickhouse-server/users.d/
+ ln -sf /usr/share/clickhouse-test/config/users.d/session_log_test.xml /etc/clickhouse-server/users.d/
+ ln -sf /usr/share/clickhouse-test/config/users.d/memory_profiler.xml /etc/clickhouse-server/users.d/
+ ln -sf /usr/share/clickhouse-test/config/users.d/no_fsync_metadata.xml /etc/clickhouse-server/users.d/
+ ln -sf /usr/share/clickhouse-test/config/users.d/filelog.xml /etc/clickhouse-server/users.d/
+ ln -sf /usr/share/clickhouse-test/config/users.d/enable_blobs_check.xml /etc/clickhouse-server/users.d/
+ ln -sf /usr/share/clickhouse-test/config/users.d/marks.xml /etc/clickhouse-server/users.d/
+ ln -sf /usr/share/clickhouse-test/config/users.d/insert_keeper_retries.xml /etc/clickhouse-server/users.d/
+ ln -sf /usr/share/clickhouse-test/config/users.d/prefetch_settings.xml /etc/clickhouse-server/users.d/
+ ln -sf /usr/share/clickhouse-test/config/users.d/nonconst_timezone.xml /etc/clickhouse-server/users.d/
+ ln -sf /usr/share/clickhouse-test/config/users.d/allow_introspection_functions.yaml /etc/clickhouse-server/users.d/
+ ln -sf /usr/share/clickhouse-test/config/users.d/replicated_ddl_entry.xml /etc/clickhouse-server/users.d/
+ [[ -n '' ]]
+ ln -sf /usr/share/clickhouse-test/config/users.d/timeouts.xml /etc/clickhouse-server/users.d/
+ ln -sf /usr/share/clickhouse-test/config/ints_dictionary.xml /etc/clickhouse-server/
+ ln -sf /usr/share/clickhouse-test/config/strings_dictionary.xml /etc/clickhouse-server/
+ ln -sf /usr/share/clickhouse-test/config/decimals_dictionary.xml /etc/clickhouse-server/
+ ln -sf /usr/share/clickhouse-test/config/executable_dictionary.xml /etc/clickhouse-server/
+ ln -sf /usr/share/clickhouse-test/config/executable_pool_dictionary.xml /etc/clickhouse-server/
+ ln -sf /usr/share/clickhouse-test/config/test_function.xml /etc/clickhouse-server/
+ ln -sf /usr/share/clickhouse-test/config/top_level_domains /etc/clickhouse-server/
+ ln -sf /usr/share/clickhouse-test/config/regions_hierarchy.txt /etc/clickhouse-server/config.d/
+ ln -sf /usr/share/clickhouse-test/config/regions_names_en.txt /etc/clickhouse-server/config.d/
+ ln -sf /usr/share/clickhouse-test/config/ext-en.txt /etc/clickhouse-server/config.d/
+ ln -sf /usr/share/clickhouse-test/config/ext-ru.txt /etc/clickhouse-server/config.d/
+ ln -sf /usr/share/clickhouse-test/config/lem-en.bin /etc/clickhouse-server/config.d/
+ ln -sf /usr/share/clickhouse-test/config/server.key /etc/clickhouse-server/
+ ln -sf /usr/share/clickhouse-test/config/server.crt /etc/clickhouse-server/
+ ln -sf /usr/share/clickhouse-test/config/dhparam.pem /etc/clickhouse-server/
+ ln -sf --backup=simple --suffix=_original.xml /usr/share/clickhouse-test/config/config.d/query_masking_rules.xml /etc/clickhouse-server/config.d/
+ [[ -n 1 ]]
+ [[ 1 -eq 1 ]]
+ rm -f /etc/clickhouse-server/config.d/zookeeper.xml
+ ln -sf /usr/share/clickhouse-test/config/config.d/zookeeper_fault_injection.xml /etc/clickhouse-server/config.d/
+ [[ -n '' ]]
+ rm -f /etc/clickhouse-server/config.d/cannot_allocate_thread_injection.xml
+ value=1
+ sed --follow-symlinks -i 's|[01]|1|' /etc/clickhouse-server/config.d/keeper_port.xml
+ value=45348864
+ sed --follow-symlinks -i 's|[[:digit:]]\+|45348864|' /etc/clickhouse-server/config.d/keeper_port.xml
+ value=63295488
+ sed --follow-symlinks -i 's|[[:digit:]]\+|63295488|' /etc/clickhouse-server/config.d/keeper_port.xml
+ [[ -n '' ]]
+ [[ -n 1 ]]
+ [[ 1 -eq 1 ]]
+ ln -sf /usr/share/clickhouse-test/config/users.d/database_ordinary.xml /etc/clickhouse-server/users.d/
+ [[ '' == \1 ]]
+ [[ '' == \1 ]]
+ [[ -n 1 ]]
+ ln -sf /usr/share/clickhouse-test/config/config.d/azure_storage_conf.xml /etc/clickhouse-server/config.d/
+ ln -sf /usr/share/clickhouse-test/config/config.d/storage_conf.xml /etc/clickhouse-server/config.d/
+ ln -sf /usr/share/clickhouse-test/config/config.d/storage_conf_02944.xml /etc/clickhouse-server/config.d/
+ ln -sf /usr/share/clickhouse-test/config/config.d/storage_conf_02963.xml /etc/clickhouse-server/config.d/
+ ln -sf /usr/share/clickhouse-test/config/config.d/storage_conf_02961.xml /etc/clickhouse-server/config.d/
+ ln -sf /usr/share/clickhouse-test/config/users.d/s3_cache.xml /etc/clickhouse-server/users.d/
+ ln -sf /usr/share/clickhouse-test/config/users.d/s3_cache_new.xml /etc/clickhouse-server/users.d/
+ [[ -n '' ]]
+ ln -sf /usr/share/clickhouse-test/config/client_config.xml /etc/clickhouse-client/config.xml
+ sudo cat /etc/clickhouse-server/config.d/keeper_port.xml
+ sed 's|100000|10000|'
+ sudo mv /etc/clickhouse-server/config.d/keeper_port.xml.tmp /etc/clickhouse-server/config.d/keeper_port.xml
+ [[ -n 1 ]]
+ [[ 1 -eq 1 ]]
+ randomize_config_boolean_value filtered_list keeper_port
+ value=1
+ sudo cat /etc/clickhouse-server/config.d/keeper_port.xml
+ sed 's|[01]|1|'
+ sudo mv /etc/clickhouse-server/config.d/keeper_port.xml.tmp /etc/clickhouse-server/config.d/keeper_port.xml
+ randomize_config_boolean_value multi_read keeper_port
+ value=1
+ sudo cat /etc/clickhouse-server/config.d/keeper_port.xml
+ sed 's|[01]|1|'
+ sudo mv /etc/clickhouse-server/config.d/keeper_port.xml.tmp /etc/clickhouse-server/config.d/keeper_port.xml
+ randomize_config_boolean_value check_not_exists keeper_port
+ value=1
+ sudo cat /etc/clickhouse-server/config.d/keeper_port.xml
+ sed 's|[01]|1|'
+ sudo mv /etc/clickhouse-server/config.d/keeper_port.xml.tmp /etc/clickhouse-server/config.d/keeper_port.xml
+ randomize_config_boolean_value create_if_not_exists keeper_port
+ value=0
+ sudo cat /etc/clickhouse-server/config.d/keeper_port.xml
+ sed 's|[01]|0|'
+ sudo mv /etc/clickhouse-server/config.d/keeper_port.xml.tmp /etc/clickhouse-server/config.d/keeper_port.xml
+ sudo chown clickhouse /etc/clickhouse-server/config.d/keeper_port.xml
+ sudo chgrp clickhouse /etc/clickhouse-server/config.d/keeper_port.xml
+ [[ -n 1 ]]
+ [[ 1 -eq 1 ]]
+ randomize_config_boolean_value use_compression zookeeper_fault_injection
+ value=0
+ sudo cat /etc/clickhouse-server/config.d/zookeeper_fault_injection.xml
+ sed 's|[01]|0|'
+ sudo mv /etc/clickhouse-server/config.d/zookeeper_fault_injection.xml.tmp /etc/clickhouse-server/config.d/zookeeper_fault_injection.xml
+ randomize_config_boolean_value enable_block_number_column block_number
+ value=0
+ sudo cat /etc/clickhouse-server/config.d/block_number.xml
+ sed 's|[01]|0|'
+ sudo mv /etc/clickhouse-server/config.d/block_number.xml.tmp /etc/clickhouse-server/config.d/block_number.xml
+ randomize_config_boolean_value enable_block_offset_column block_number
+ value=1
+ sudo cat /etc/clickhouse-server/config.d/block_number.xml
+ sed 's|[01]|1|'
+ sudo mv /etc/clickhouse-server/config.d/block_number.xml.tmp /etc/clickhouse-server/config.d/block_number.xml
+ echo 'ASAN_OPTIONS='\''malloc_context_size=10 verbosity=1 allocator_release_to_os_interval_ms=10000'\'''
+ export 'ASAN_OPTIONS=malloc_context_size=10 allocator_release_to_os_interval_ms=10000'
+ ASAN_OPTIONS='malloc_context_size=10 allocator_release_to_os_interval_ms=10000'
+ sudo chown root: /var/lib/clickhouse
+ local total_mem
++ awk '/MemTotal/ { print $(NF-1) }' /proc/meminfo
+ total_mem=32080792
+ total_mem=32850731008
+ max_server_memory_usage_to_ram_ratio=0.5
Setting max_server_memory_usage_to_ram_ratio to 0.5
+ echo 'Setting max_server_memory_usage_to_ram_ratio to 0.5'
+ cat
+ local max_users_mem
+ max_users_mem=9855219302
+ echo 'Setting max_memory_usage_for_user=9855219302 and max_memory_usage for queries to 10G'
+ cat
Setting max_memory_usage_for_user=9855219302 and max_memory_usage for queries to 10G
+ cat
+ ./setup_minio.sh stateless
+ azurite-blob --blobHost 0.0.0.0 --blobPort 10000 --debug /azurite_log
+ export MINIO_ROOT_USER=clickhouse
+ MINIO_ROOT_USER=clickhouse
+ export MINIO_ROOT_PASSWORD=clickhouse
+ MINIO_ROOT_PASSWORD=clickhouse
+ main stateless
+ local query_dir
++ check_arg stateless
++ local query_dir
++ '[' '!' 1 -eq 1 ']'
++ case "$1" in
++ query_dir=0_stateless
++ echo 0_stateless
+ query_dir=0_stateless
+ '[' '!' -f ./minio ']'
+ start_minio
+ mkdir -p ./minio_data
+ ./minio --version
minio version RELEASE.2024-08-03T04-33-23Z (commit-id=6efb56851c40da88d1ca15112e2d686a4ecec6b3)
Runtime: go1.22.5 linux/amd64
License: GNU AGPLv3 - https://www.gnu.org/licenses/agpl-3.0.html
Copyright: 2015-2024 MinIO, Inc.
+ wait_for_it
+ local counter=0
+ local max_counter=60
+ local url=http://localhost:11111
+ params=('--silent' '--verbose')
+ local params
+ ./minio server --address :11111 ./minio_data
+ curl --silent --verbose http://localhost:11111
+ grep AccessDenied
trying to connect to minio
+ [[ 0 == \6\0 ]]
+ echo 'trying to connect to minio'
+ sleep 1
Azurite Blob service is starting on 0.0.0.0:10000
Azurite Blob service successfully listens on http://0.0.0.0:10000
INFO: Formatting 1st pool, 1 set(s), 1 drives per set.
INFO: WARNING: Host local has more than 0 drives of set. A host failure will result in data becoming unavailable.
MinIO Object Storage Server
Copyright: 2015-2026 MinIO, Inc.
License: GNU AGPLv3 - https://www.gnu.org/licenses/agpl-3.0.html
Version: RELEASE.2024-08-03T04-33-23Z (go1.22.5 linux/amd64)
API: http://172.17.0.2:11111 http://127.0.0.1:11111
WebUI: http://172.17.0.2:44553 http://127.0.0.1:44553
Docs: https://min.io/docs/minio/linux/index.html
+ counter=1
+ curl --silent --verbose http://localhost:11111
+ grep AccessDenied
AccessDeniedAccess Denied./18DCC4633FD5ED887dc7eb22d3288ec80374614e9088e31d3668a6922ead55932dd2a8e56373820f
+ lsof -i :11111
COMMAND PID USER FD TYPE DEVICE SIZE/OFF NODE NAME
minio 276 root 8u IPv6 31347 0t0 TCP *:11111 (LISTEN)
minio 276 root 9u IPv4 31346 0t0 TCP localhost:11111 (LISTEN)
minio 276 root 10u IPv6 31348 0t0 TCP localhost:11111 (LISTEN)
+ sleep 5
+ setup_minio stateless
+ local test_type=stateless
+ ./mc alias set clickminio http://localhost:11111 clickhouse clickhouse
Added `clickminio` successfully.
+ ./mc admin user add clickminio test testtest
Added user `test` successfully.
+ ./mc admin policy attach clickminio readwrite --user=test
Attached Policies: [readwrite]
To User: test
+ ./mc mb --ignore-existing clickminio/test
Bucket created successfully `clickminio/test`.
+ '[' stateless = stateless ']'
+ ./mc anonymous set public clickminio/test
Access permission for `clickminio/test` is set to `public`
+ upload_data 0_stateless /usr/share/clickhouse-test
+ local query_dir=0_stateless
+ local test_path=/usr/share/clickhouse-test
+ local data_path=/usr/share/clickhouse-test/queries/0_stateless/data_minio
+ '[' -d /usr/share/clickhouse-test/queries/0_stateless/data_minio ']'
+ ./mc cp --recursive /usr/share/clickhouse-test/queries/0_stateless/data_minio/ clickminio/test/
`/usr/share/clickhouse-test/queries/0_stateless/data_minio/02731.arrow` -> `clickminio/test/02731.arrow`
`/usr/share/clickhouse-test/queries/0_stateless/data_minio/03036_archive1.tar` -> `clickminio/test/03036_archive1.tar`
`/usr/share/clickhouse-test/queries/0_stateless/data_minio/02366_data.jsonl` -> `clickminio/test/02366_data.jsonl`
`/usr/share/clickhouse-test/queries/0_stateless/data_minio/02731.parquet` -> `clickminio/test/02731.parquet`
`/usr/share/clickhouse-test/queries/0_stateless/data_minio/02876.parquet` -> `clickminio/test/02876.parquet`
`/usr/share/clickhouse-test/queries/0_stateless/data_minio/03036_archive1.zip` -> `clickminio/test/03036_archive1.zip`
`/usr/share/clickhouse-test/queries/0_stateless/data_minio/03036_archive2.tar` -> `clickminio/test/03036_archive2.tar`
`/usr/share/clickhouse-test/queries/0_stateless/data_minio/03036_archive2.zip` -> `clickminio/test/03036_archive2.zip`
`/usr/share/clickhouse-test/queries/0_stateless/data_minio/03036_archive3.tar.gz` -> `clickminio/test/03036_archive3.tar.gz`
`/usr/share/clickhouse-test/queries/0_stateless/data_minio/03036_compressed_file_archive.zip` -> `clickminio/test/03036_compressed_file_archive.zip`
`/usr/share/clickhouse-test/queries/0_stateless/data_minio/03036_json_archive.zip` -> `clickminio/test/03036_json_archive.zip`
`/usr/share/clickhouse-test/queries/0_stateless/data_minio/a.tsv` -> `clickminio/test/a.tsv`
`/usr/share/clickhouse-test/queries/0_stateless/data_minio/b.tsv` -> `clickminio/test/b.tsv`
`/usr/share/clickhouse-test/queries/0_stateless/data_minio/c.tsv` -> `clickminio/test/c.tsv`
`/usr/share/clickhouse-test/queries/0_stateless/data_minio/hive_partitioning/column0=Elizabeth/column1=Gordon/sample.parquet` -> `clickminio/test/hive_partitioning/column0=Elizabeth/column1=Gordon/sample.parquet`
`/usr/share/clickhouse-test/queries/0_stateless/data_minio/hive_partitioning/column0=Elizabeth/column1=Schmidt/sample.parquet` -> `clickminio/test/hive_partitioning/column0=Elizabeth/column1=Schmidt/sample.parquet`
`/usr/share/clickhouse-test/queries/0_stateless/data_minio/hive_partitioning/column0=Elizabeth/sample.parquet` -> `clickminio/test/hive_partitioning/column0=Elizabeth/sample.parquet`
`/usr/share/clickhouse-test/queries/0_stateless/data_minio/hive_partitioning/non_existing_column=Elizabeth/sample.parquet` -> `clickminio/test/hive_partitioning/non_existing_column=Elizabeth/sample.parquet`
`/usr/share/clickhouse-test/queries/0_stateless/data_minio/json_data` -> `clickminio/test/json_data`
`/usr/share/clickhouse-test/queries/0_stateless/data_minio/tsv_with_header.tsv` -> `clickminio/test/tsv_with_header.tsv`
Total: 5.42 MiB, Transferred: 5.42 MiB, Speed: 108.15 MiB/s
+ setup_aws_credentials
+ local minio_root_user=clickhouse
+ local minio_root_password=clickhouse
+ mkdir -p /root/.aws
+ cat
+ config_logs_export_cluster /etc/clickhouse-server/config.d/system_logs_export.yaml
+ set +x
File /tmp/export-logs-config.sh does not exist, do not setup
+ export CLICKHOUSE_MAX_THREADS=8
+ CLICKHOUSE_MAX_THREADS=8
+ export CLICKHOUSE_MAX_CONCURRENT_QUERIES=4
+ CLICKHOUSE_MAX_CONCURRENT_QUERIES=4
+ start_server
+ counter=0
+ max_attempt=120
+ clickhouse-client --query 'SELECT 1'
Code: 210. DB::NetException: Connection refused (localhost:9000). (NETWORK_ERROR)
+ '[' 0 -gt 120 ']'
+ clickhouse start --user root
+ sleep 0.5
+ counter=1
+ clickhouse-client --query 'SELECT 1'
Code: 210. DB::NetException: Connection refused (localhost:9000). (NETWORK_ERROR)
+ '[' 1 -gt 120 ']'
+ clickhouse start --user root
+ sleep 0.5
+ counter=2
+ clickhouse-client --query 'SELECT 1'
Code: 210. DB::NetException: Connection refused (localhost:9000). (NETWORK_ERROR)
+ '[' 2 -gt 120 ']'
+ clickhouse start --user root
+ sleep 0.5
+ counter=3
+ clickhouse-client --query 'SELECT 1'
Code: 210. DB::NetException: Connection refused (localhost:9000). (NETWORK_ERROR)
+ '[' 3 -gt 120 ']'
+ clickhouse start --user root
+ sleep 0.5
+ counter=4
+ clickhouse-client --query 'SELECT 1'
Code: 210. DB::NetException: Connection refused (localhost:9000). (NETWORK_ERROR)
+ '[' 4 -gt 120 ']'
+ clickhouse start --user root
+ sleep 0.5
+ counter=5
+ clickhouse-client --query 'SELECT 1'
Code: 210. DB::NetException: Connection refused (localhost:9000). (NETWORK_ERROR)
+ '[' 5 -gt 120 ']'
+ clickhouse start --user root
+ sleep 0.5
+ counter=6
+ clickhouse-client --query 'SELECT 1'
Code: 210. DB::NetException: Connection refused (localhost:9000). (NETWORK_ERROR)
+ '[' 6 -gt 120 ']'
+ clickhouse start --user root
+ sleep 0.5
+ counter=7
+ clickhouse-client --query 'SELECT 1'
Code: 210. DB::NetException: Connection refused (localhost:9000). (NETWORK_ERROR)
+ '[' 7 -gt 120 ']'
+ clickhouse start --user root
+ sleep 0.5
+ counter=8
+ clickhouse-client --query 'SELECT 1'
Code: 210. DB::NetException: Connection refused (localhost:9000). (NETWORK_ERROR)
+ '[' 8 -gt 120 ']'
+ clickhouse start --user root
+ sleep 0.5
+ counter=9
+ clickhouse-client --query 'SELECT 1'
Code: 210. DB::NetException: Connection refused (localhost:9000). (NETWORK_ERROR)
+ '[' 9 -gt 120 ']'
+ clickhouse start --user root
+ sleep 0.5
+ counter=10
+ clickhouse-client --query 'SELECT 1'
Code: 210. DB::NetException: Connection refused (localhost:9000). (NETWORK_ERROR)
+ '[' 10 -gt 120 ']'
+ clickhouse start --user root
+ sleep 0.5
+ counter=11
+ clickhouse-client --query 'SELECT 1'
Code: 210. DB::NetException: Connection refused (localhost:9000). (NETWORK_ERROR)
+ '[' 11 -gt 120 ']'
+ clickhouse start --user root
127.0.0.1 - - [09/Oct/2026:05:11:39 +0000] "GET /devstoreaccount1/cont?restype=container HTTP/1.1" 404 -
127.0.0.1 - - [09/Oct/2026:05:11:39 +0000] "PUT /devstoreaccount1/cont?restype=container HTTP/1.1" 201 -
127.0.0.1 - - [09/Oct/2026:05:11:39 +0000] "PUT /devstoreaccount1/cont/eowqvbewagmoguwadgfrmcaffcnuhyrd HTTP/1.1" 201 -
+ sleep 0.5
127.0.0.1 - - [09/Oct/2026:05:11:39 +0000] "GET /devstoreaccount1/cont/eowqvbewagmoguwadgfrmcaffcnuhyrd HTTP/1.1" 206 4
127.0.0.1 - - [09/Oct/2026:05:11:39 +0000] "GET /devstoreaccount1/cont/eowqvbewagmoguwadgfrmcaffcnuhyrd HTTP/1.1" 206 2
127.0.0.1 - - [09/Oct/2026:05:11:39 +0000] "DELETE /devstoreaccount1/cont/eowqvbewagmoguwadgfrmcaffcnuhyrd HTTP/1.1" 202 -
+ counter=12
+ clickhouse-client --query 'SELECT 1'
1
+ attach_gdb_to_clickhouse
++ run_with_retry 5 clickhouse-client --query 'SELECT count() FROM system.build_options WHERE name = '\''CXX_FLAGS'\'' AND position('\''sanitize=address'\'' IN value)'
++ [[ hxB =~ e ]]
++ set_e=false
++ set +e
++ local total_retries=5
++ shift
++ local retry=0
++ '[' 0 -ge 5 ']'
++ clickhouse-client --query 'SELECT count() FROM system.build_options WHERE name = '\''CXX_FLAGS'\'' AND position('\''sanitize=address'\'' IN value)'
++ false
++ return
+ IS_ASAN=1
+ [[ 1 = \1 ]]
+ echo 'ASAN build detected. Not using gdb since it disables LeakSanitizer detections'
ASAN build detected. Not using gdb since it disables LeakSanitizer detections
+ setup_logs_replication
+ set +x
File /tmp/export-logs-config.sh does not exist, do not setup
+ clickhouse-client --query 'CREATE DATABASE datasets'
+ clickhouse-client --multiquery
+ clickhouse-client --query 'SHOW TABLES FROM datasets'
hits_v1
visits_v1
+ clickhouse-client --query 'CREATE DATABASE IF NOT EXISTS test'
+ stop_server
+ local max_tries=90
+ local check_hang=true
+ local pid
++ cat /var/run/clickhouse-server/clickhouse-server.pid
+ pid=410
+ clickhouse stop --max-tries 90 --do-not-kill
/var/run/clickhouse-server/clickhouse-server.pid file exists and contains pid = 410.
The process with pid = 410 is running.
Sent terminate signal to process with pid 410.
Waiting for server to stop
/var/run/clickhouse-server/clickhouse-server.pid file exists and contains pid = 410.
The process with pid = 410 is running.
Waiting for server to stop
/var/run/clickhouse-server/clickhouse-server.pid file exists and contains pid = 410.
The process with pid = 410 is running.
Waiting for server to stop
/var/run/clickhouse-server/clickhouse-server.pid file exists and contains pid = 410.
The process with pid = 410 is running.
Waiting for server to stop
/var/run/clickhouse-server/clickhouse-server.pid file exists and contains pid = 410.
The process with pid = 410 is running.
Waiting for server to stop
/var/run/clickhouse-server/clickhouse-server.pid file exists and contains pid = 410.
The process with pid = 410 is running.
Waiting for server to stop
/var/run/clickhouse-server/clickhouse-server.pid file exists and contains pid = 410.
The process with pid = 410 is running.
Waiting for server to stop
/var/run/clickhouse-server/clickhouse-server.pid file exists and contains pid = 410.
The process with pid = 410 is running.
Waiting for server to stop
/var/run/clickhouse-server/clickhouse-server.pid file exists and contains pid = 410.
The process with pid = 410 is running.
Waiting for server to stop
/var/run/clickhouse-server/clickhouse-server.pid file exists and contains pid = 410.
The process with pid = 410 is running.
Waiting for server to stop
Now there is no clickhouse-server process.
Server stopped
+ return
+ mv /var/log/clickhouse-server/clickhouse-server.log /var/log/clickhouse-server/clickhouse-server.initial.log
+ cache_policy=
+ '[' 0 -eq 1 ']'
+ cache_policy=LRU
+ echo 'Using cache policy: LRU'
+ '[' LRU = SLRU ']'
+ sudo cat /etc/clickhouse-server/users.d/stress_tests_overrides.xml
Using cache policy: LRU
cat: /etc/clickhouse-server/users.d/stress_tests_overrides.xml: No such file or directory
+ start_server
+ counter=0
+ max_attempt=120
+ clickhouse-client --query 'SELECT 1'
Code: 210. DB::NetException: Connection refused (localhost:9000). (NETWORK_ERROR)
+ '[' 0 -gt 120 ']'
+ clickhouse start --user root
+ sleep 0.5
+ counter=1
+ clickhouse-client --query 'SELECT 1'
Code: 210. DB::NetException: Connection refused (localhost:9000). (NETWORK_ERROR)
+ '[' 1 -gt 120 ']'
+ clickhouse start --user root
+ sleep 0.5
+ counter=2
+ clickhouse-client --query 'SELECT 1'
Code: 210. DB::NetException: Connection refused (localhost:9000). (NETWORK_ERROR)
+ '[' 2 -gt 120 ']'
+ clickhouse start --user root
+ sleep 0.5
+ counter=3
+ clickhouse-client --query 'SELECT 1'
Code: 210. DB::NetException: Connection refused (localhost:9000). (NETWORK_ERROR)
+ '[' 3 -gt 120 ']'
+ clickhouse start --user root
+ sleep 0.5
+ counter=4
+ clickhouse-client --query 'SELECT 1'
Code: 210. DB::NetException: Connection refused (localhost:9000). (NETWORK_ERROR)
+ '[' 4 -gt 120 ']'
+ clickhouse start --user root
+ sleep 0.5
+ counter=5
+ clickhouse-client --query 'SELECT 1'
Code: 210. DB::NetException: Connection refused (localhost:9000). (NETWORK_ERROR)
+ '[' 5 -gt 120 ']'
+ clickhouse start --user root
+ sleep 0.5
+ counter=6
+ clickhouse-client --query 'SELECT 1'
Code: 210. DB::NetException: Connection refused (localhost:9000). (NETWORK_ERROR)
+ '[' 6 -gt 120 ']'
+ clickhouse start --user root
+ sleep 0.5
+ counter=7
+ clickhouse-client --query 'SELECT 1'
Code: 210. DB::NetException: Connection refused (localhost:9000). (NETWORK_ERROR)
+ '[' 7 -gt 120 ']'
+ clickhouse start --user root
+ sleep 0.5
+ counter=8
+ clickhouse-client --query 'SELECT 1'
Code: 210. DB::NetException: Connection refused (localhost:9000). (NETWORK_ERROR)
+ '[' 8 -gt 120 ']'
+ clickhouse start --user root
+ sleep 0.5
127.0.0.1 - - [09/Oct/2026:05:12:20 +0000] "GET /devstoreaccount1/cont?restype=container HTTP/1.1" 200 -
127.0.0.1 - - [09/Oct/2026:05:12:20 +0000] "PUT /devstoreaccount1/cont/ywsaqjhkprdaalrqqkljyggyxervihbs HTTP/1.1" 201 -
127.0.0.1 - - [09/Oct/2026:05:12:20 +0000] "GET /devstoreaccount1/cont/ywsaqjhkprdaalrqqkljyggyxervihbs HTTP/1.1" 206 4
127.0.0.1 - - [09/Oct/2026:05:12:20 +0000] "GET /devstoreaccount1/cont/ywsaqjhkprdaalrqqkljyggyxervihbs HTTP/1.1" 206 2
127.0.0.1 - - [09/Oct/2026:05:12:20 +0000] "DELETE /devstoreaccount1/cont/ywsaqjhkprdaalrqqkljyggyxervihbs HTTP/1.1" 202 -
+ counter=9
+ clickhouse-client --query 'SELECT 1'
Code: 210. DB::NetException: Connection refused (localhost:9000). (NETWORK_ERROR)
+ '[' 9 -gt 120 ']'
+ clickhouse start --user root
+ sleep 0.5
+ counter=10
+ clickhouse-client --query 'SELECT 1'
Code: 210. DB::NetException: Connection refused (localhost:9000). (NETWORK_ERROR)
+ '[' 10 -gt 120 ']'
+ clickhouse start --user root
+ sleep 0.5
+ counter=11
+ clickhouse-client --query 'SELECT 1'
Code: 210. DB::NetException: Connection refused (localhost:9000). (NETWORK_ERROR)
+ '[' 11 -gt 120 ']'
+ clickhouse start --user root
+ sleep 0.5
+ counter=12
+ clickhouse-client --query 'SELECT 1'
Code: 210. DB::NetException: Connection refused (localhost:9000). (NETWORK_ERROR)
+ '[' 12 -gt 120 ']'
+ clickhouse start --user root
+ sleep 0.5
+ counter=13
+ clickhouse-client --query 'SELECT 1'
Code: 210. DB::NetException: Connection refused (localhost:9000). (NETWORK_ERROR)
+ '[' 13 -gt 120 ']'
+ clickhouse start --user root
+ sleep 0.5
+ counter=14
+ clickhouse-client --query 'SELECT 1'
Code: 210. DB::NetException: Connection refused (localhost:9000). (NETWORK_ERROR)
+ '[' 14 -gt 120 ']'
+ clickhouse start --user root
+ sleep 0.5
+ counter=15
+ clickhouse-client --query 'SELECT 1'
Code: 210. DB::NetException: Connection refused (localhost:9000). (NETWORK_ERROR)
+ '[' 15 -gt 120 ']'
+ clickhouse start --user root
+ sleep 0.5
+ counter=16
+ clickhouse-client --query 'SELECT 1'
Code: 210. DB::NetException: Connection refused (localhost:9000). (NETWORK_ERROR)
+ '[' 16 -gt 120 ']'
+ clickhouse start --user root
+ sleep 0.5
+ counter=17
+ clickhouse-client --query 'SELECT 1'
Code: 210. DB::NetException: Connection refused (localhost:9000). (NETWORK_ERROR)
+ '[' 17 -gt 120 ']'
+ clickhouse start --user root
+ sleep 0.5
+ counter=18
+ clickhouse-client --query 'SELECT 1'
Code: 210. DB::NetException: Connection refused (localhost:9000). (NETWORK_ERROR)
+ '[' 18 -gt 120 ']'
+ clickhouse start --user root
+ sleep 0.5
+ counter=19
+ clickhouse-client --query 'SELECT 1'
1
+ attach_gdb_to_clickhouse
++ run_with_retry 5 clickhouse-client --query 'SELECT count() FROM system.build_options WHERE name = '\''CXX_FLAGS'\'' AND position('\''sanitize=address'\'' IN value)'
++ [[ hxB =~ e ]]
++ set_e=false
++ set +e
++ local total_retries=5
++ shift
++ local retry=0
++ '[' 0 -ge 5 ']'
++ clickhouse-client --query 'SELECT count() FROM system.build_options WHERE name = '\''CXX_FLAGS'\'' AND position('\''sanitize=address'\'' IN value)'
++ false
++ return
+ IS_ASAN=1
+ [[ 1 = \1 ]]
+ echo 'ASAN build detected. Not using gdb since it disables LeakSanitizer detections'
ASAN build detected. Not using gdb since it disables LeakSanitizer detections
+ clickhouse-client --query 'SHOW TABLES FROM datasets'
hits_v1
visits_v1
+ clickhouse-client --query 'SHOW TABLES FROM test'
+ [[ '' == \1 ]]
+ [[ '' == \1 ]]
+ TEMP_POLICY=default
+ clickhouse-client --query 'CREATE TABLE test.hits_s3 (WatchID UInt64, JavaEnable UInt8, Title String, GoodEvent Int16,
EventTime DateTime, EventDate Date, CounterID UInt32, ClientIP UInt32, ClientIP6 FixedString(16), RegionID UInt32,
UserID UInt64, CounterClass Int8, OS UInt8, UserAgent UInt8, URL String, Referer String, URLDomain String, RefererDomain String,
Refresh UInt8, IsRobot UInt8, RefererCategories Array(UInt16), URLCategories Array(UInt16), URLRegions Array(UInt32),
RefererRegions Array(UInt32), ResolutionWidth UInt16, ResolutionHeight UInt16, ResolutionDepth UInt8, FlashMajor UInt8,
FlashMinor UInt8, FlashMinor2 String, NetMajor UInt8, NetMinor UInt8, UserAgentMajor UInt16, UserAgentMinor FixedString(2),
CookieEnable UInt8, JavascriptEnable UInt8, IsMobile UInt8, MobilePhone UInt8, MobilePhoneModel String, Params String,
IPNetworkID UInt32, TraficSourceID Int8, SearchEngineID UInt16, SearchPhrase String, AdvEngineID UInt8, IsArtifical UInt8,
WindowClientWidth UInt16, WindowClientHeight UInt16, ClientTimeZone Int16, ClientEventTime DateTime, SilverlightVersion1 UInt8,
SilverlightVersion2 UInt8, SilverlightVersion3 UInt32, SilverlightVersion4 UInt16, PageCharset String, CodeVersion UInt32,
IsLink UInt8, IsDownload UInt8, IsNotBounce UInt8, FUniqID UInt64, HID UInt32, IsOldCounter UInt8, IsEvent UInt8,
IsParameter UInt8, DontCountHits UInt8, WithHash UInt8, HitColor FixedString(1), UTCEventTime DateTime, Age UInt8,
Sex UInt8, Income UInt8, Interests UInt16, Robotness UInt8, GeneralInterests Array(UInt16), RemoteIP UInt32,
RemoteIP6 FixedString(16), WindowName Int32, OpenerName Int32, HistoryLength Int16, BrowserLanguage FixedString(2),
BrowserCountry FixedString(2), SocialNetwork String, SocialAction String, HTTPError UInt16, SendTiming Int32,
DNSTiming Int32, ConnectTiming Int32, ResponseStartTiming Int32, ResponseEndTiming Int32, FetchTiming Int32,
RedirectTiming Int32, DOMInteractiveTiming Int32, DOMContentLoadedTiming Int32, DOMCompleteTiming Int32,
LoadEventStartTiming Int32, LoadEventEndTiming Int32, NSToDOMContentLoadedTiming Int32, FirstPaintTiming Int32,
RedirectCount Int8, SocialSourceNetworkID UInt8, SocialSourcePage String, ParamPrice Int64, ParamOrderID String,
ParamCurrency FixedString(3), ParamCurrencyID UInt16, GoalsReached Array(UInt32), OpenstatServiceName String,
OpenstatCampaignID String, OpenstatAdID String, OpenstatSourceID String, UTMSource String, UTMMedium String,
UTMCampaign String, UTMContent String, UTMTerm String, FromTag String, HasGCLID UInt8, RefererHash UInt64,
URLHash UInt64, CLID UInt32, YCLID UInt64, ShareService String, ShareURL String, ShareTitle String,
ParsedParams Nested(Key1 String, Key2 String, Key3 String, Key4 String, Key5 String, ValueDouble Float64),
IslandID FixedString(16), RequestNum UInt32, RequestTry UInt8) ENGINE = MergeTree() PARTITION BY toYYYYMM(EventDate)
ORDER BY (CounterID, EventDate, intHash32(UserID)) SAMPLE BY intHash32(UserID) SETTINGS index_granularity = 8192, storage_policy='\''default'\'''
+ clickhouse-client --query 'CREATE TABLE test.hits (WatchID UInt64, JavaEnable UInt8, Title String, GoodEvent Int16,
EventTime DateTime, EventDate Date, CounterID UInt32, ClientIP UInt32, ClientIP6 FixedString(16), RegionID UInt32,
UserID UInt64, CounterClass Int8, OS UInt8, UserAgent UInt8, URL String, Referer String, URLDomain String,
RefererDomain String, Refresh UInt8, IsRobot UInt8, RefererCategories Array(UInt16), URLCategories Array(UInt16),
URLRegions Array(UInt32), RefererRegions Array(UInt32), ResolutionWidth UInt16, ResolutionHeight UInt16, ResolutionDepth UInt8,
FlashMajor UInt8, FlashMinor UInt8, FlashMinor2 String, NetMajor UInt8, NetMinor UInt8, UserAgentMajor UInt16,
UserAgentMinor FixedString(2), CookieEnable UInt8, JavascriptEnable UInt8, IsMobile UInt8, MobilePhone UInt8,
MobilePhoneModel String, Params String, IPNetworkID UInt32, TraficSourceID Int8, SearchEngineID UInt16,
SearchPhrase String, AdvEngineID UInt8, IsArtifical UInt8, WindowClientWidth UInt16, WindowClientHeight UInt16,
ClientTimeZone Int16, ClientEventTime DateTime, SilverlightVersion1 UInt8, SilverlightVersion2 UInt8, SilverlightVersion3 UInt32,
SilverlightVersion4 UInt16, PageCharset String, CodeVersion UInt32, IsLink UInt8, IsDownload UInt8, IsNotBounce UInt8,
FUniqID UInt64, HID UInt32, IsOldCounter UInt8, IsEvent UInt8, IsParameter UInt8, DontCountHits UInt8, WithHash UInt8,
HitColor FixedString(1), UTCEventTime DateTime, Age UInt8, Sex UInt8, Income UInt8, Interests UInt16, Robotness UInt8,
GeneralInterests Array(UInt16), RemoteIP UInt32, RemoteIP6 FixedString(16), WindowName Int32, OpenerName Int32,
HistoryLength Int16, BrowserLanguage FixedString(2), BrowserCountry FixedString(2), SocialNetwork String, SocialAction String,
HTTPError UInt16, SendTiming Int32, DNSTiming Int32, ConnectTiming Int32, ResponseStartTiming Int32, ResponseEndTiming Int32,
FetchTiming Int32, RedirectTiming Int32, DOMInteractiveTiming Int32, DOMContentLoadedTiming Int32, DOMCompleteTiming Int32,
LoadEventStartTiming Int32, LoadEventEndTiming Int32, NSToDOMContentLoadedTiming Int32, FirstPaintTiming Int32,
RedirectCount Int8, SocialSourceNetworkID UInt8, SocialSourcePage String, ParamPrice Int64, ParamOrderID String,
ParamCurrency FixedString(3), ParamCurrencyID UInt16, GoalsReached Array(UInt32), OpenstatServiceName String,
OpenstatCampaignID String, OpenstatAdID String, OpenstatSourceID String, UTMSource String, UTMMedium String,
UTMCampaign String, UTMContent String, UTMTerm String, FromTag String, HasGCLID UInt8, RefererHash UInt64,
URLHash UInt64, CLID UInt32, YCLID UInt64, ShareService String, ShareURL String, ShareTitle String,
ParsedParams Nested(Key1 String, Key2 String, Key3 String, Key4 String, Key5 String, ValueDouble Float64),
IslandID FixedString(16), RequestNum UInt32, RequestTry UInt8) ENGINE = MergeTree() PARTITION BY toYYYYMM(EventDate)
ORDER BY (CounterID, EventDate, intHash32(UserID)) SAMPLE BY intHash32(UserID) SETTINGS index_granularity = 8192, storage_policy='\''default'\'''
+ clickhouse-client --query 'CREATE TABLE test.visits (CounterID UInt32, StartDate Date, Sign Int8, IsNew UInt8,
VisitID UInt64, UserID UInt64, StartTime DateTime, Duration UInt32, UTCStartTime DateTime, PageViews Int32,
Hits Int32, IsBounce UInt8, Referer String, StartURL String, RefererDomain String, StartURLDomain String,
EndURL String, LinkURL String, IsDownload UInt8, TraficSourceID Int8, SearchEngineID UInt16, SearchPhrase String,
AdvEngineID UInt8, PlaceID Int32, RefererCategories Array(UInt16), URLCategories Array(UInt16), URLRegions Array(UInt32),
RefererRegions Array(UInt32), IsYandex UInt8, GoalReachesDepth Int32, GoalReachesURL Int32, GoalReachesAny Int32,
SocialSourceNetworkID UInt8, SocialSourcePage String, MobilePhoneModel String, ClientEventTime DateTime, RegionID UInt32,
ClientIP UInt32, ClientIP6 FixedString(16), RemoteIP UInt32, RemoteIP6 FixedString(16), IPNetworkID UInt32,
SilverlightVersion3 UInt32, CodeVersion UInt32, ResolutionWidth UInt16, ResolutionHeight UInt16, UserAgentMajor UInt16,
UserAgentMinor UInt16, WindowClientWidth UInt16, WindowClientHeight UInt16, SilverlightVersion2 UInt8, SilverlightVersion4 UInt16,
FlashVersion3 UInt16, FlashVersion4 UInt16, ClientTimeZone Int16, OS UInt8, UserAgent UInt8, ResolutionDepth UInt8,
FlashMajor UInt8, FlashMinor UInt8, NetMajor UInt8, NetMinor UInt8, MobilePhone UInt8, SilverlightVersion1 UInt8,
Age UInt8, Sex UInt8, Income UInt8, JavaEnable UInt8, CookieEnable UInt8, JavascriptEnable UInt8, IsMobile UInt8,
BrowserLanguage UInt16, BrowserCountry UInt16, Interests UInt16, Robotness UInt8, GeneralInterests Array(UInt16),
Params Array(String), Goals Nested(ID UInt32, Serial UInt32, EventTime DateTime, Price Int64, OrderID String, CurrencyID UInt32),
WatchIDs Array(UInt64), ParamSumPrice Int64, ParamCurrency FixedString(3), ParamCurrencyID UInt16, ClickLogID UInt64,
ClickEventID Int32, ClickGoodEvent Int32, ClickEventTime DateTime, ClickPriorityID Int32, ClickPhraseID Int32, ClickPageID Int32,
ClickPlaceID Int32, ClickTypeID Int32, ClickResourceID Int32, ClickCost UInt32, ClickClientIP UInt32, ClickDomainID UInt32,
ClickURL String, ClickAttempt UInt8, ClickOrderID UInt32, ClickBannerID UInt32, ClickMarketCategoryID UInt32, ClickMarketPP UInt32,
ClickMarketCategoryName String, ClickMarketPPName String, ClickAWAPSCampaignName String, ClickPageName String, ClickTargetType UInt16,
ClickTargetPhraseID UInt64, ClickContextType UInt8, ClickSelectType Int8, ClickOptions String, ClickGroupBannerID Int32,
OpenstatServiceName String, OpenstatCampaignID String, OpenstatAdID String, OpenstatSourceID String, UTMSource String,
UTMMedium String, UTMCampaign String, UTMContent String, UTMTerm String, FromTag String, HasGCLID UInt8, FirstVisit DateTime,
PredLastVisit Date, LastVisit Date, TotalVisits UInt32, TraficSource Nested(ID Int8, SearchEngineID UInt16, AdvEngineID UInt8,
PlaceID UInt16, SocialSourceNetworkID UInt8, Domain String, SearchPhrase String, SocialSourcePage String), Attendance FixedString(16),
CLID UInt32, YCLID UInt64, NormalizedRefererHash UInt64, SearchPhraseHash UInt64, RefererDomainHash UInt64, NormalizedStartURLHash UInt64,
StartURLDomainHash UInt64, NormalizedEndURLHash UInt64, TopLevelDomain UInt64, URLScheme UInt64, OpenstatServiceNameHash UInt64,
OpenstatCampaignIDHash UInt64, OpenstatAdIDHash UInt64, OpenstatSourceIDHash UInt64, UTMSourceHash UInt64, UTMMediumHash UInt64,
UTMCampaignHash UInt64, UTMContentHash UInt64, UTMTermHash UInt64, FromHash UInt64, WebVisorEnabled UInt8, WebVisorActivity UInt32,
ParsedParams Nested(Key1 String, Key2 String, Key3 String, Key4 String, Key5 String, ValueDouble Float64),
Market Nested(Type UInt8, GoalID UInt32, OrderID String, OrderPrice Int64, PP UInt32, DirectPlaceID UInt32, DirectOrderID UInt32,
DirectBannerID UInt32, GoodID String, GoodName String, GoodQuantity Int32, GoodPrice Int64), IslandID FixedString(16))
ENGINE = CollapsingMergeTree(Sign) PARTITION BY toYYYYMM(StartDate) ORDER BY (CounterID, StartDate, intHash32(UserID), VisitID)
SAMPLE BY intHash32(UserID) SETTINGS index_granularity = 8192, storage_policy='\''default'\'''
+ clickhouse-client --query 'INSERT INTO test.hits_s3 SELECT * FROM datasets.hits_v1 SETTINGS enable_filesystem_cache_on_write_operations=0, max_insert_threads=16'
Received exception from server (version 24.8.14):
Code: 241. DB::Exception: Received from localhost:9000. DB::Exception: Memory limit (for user) exceeded: would use 9.18 GiB (attempt to allocate chunk of 3061760 bytes), maximum: 9.18 GiB. OvercommitTracker decision: Query was selected to stop by OvercommitTracker.: (avg_value_size_hint = 118.920166015625, avg_chars_size = 133.10419921874998, limit = 8192): (while reading column URL): (while reading from part store/78e/78ebf6a1-d987-4579-b3ec-00c1a087b1f3/201403_1_1_2/ in table datasets.hits_v1 (78ebf6a1-d987-4579-b3ec-00c1a087b1f3) located on disk __tmp_internal_262634248876485800814430204900764312493 of type web, from mark 20 with max_rows_to_read = 8192): While executing MergeTreeSelect(pool: ReadPool, algorithm: Thread). (MEMORY_LIMIT_EXCEEDED)
(query: INSERT INTO test.hits_s3 SELECT * FROM datasets.hits_v1 SETTINGS enable_filesystem_cache_on_write_operations=0, max_insert_threads=16)
+ clickhouse-client --query 'INSERT INTO test.hits SELECT * FROM datasets.hits_v1 SETTINGS enable_filesystem_cache_on_write_operations=0, max_insert_threads=16'
Received exception from server (version 24.8.14):
Code: 241. DB::Exception: Received from localhost:9000. DB::Exception: Memory limit (for user) exceeded: would use 9.18 GiB (attempt to allocate chunk of 1050750 bytes), maximum: 9.18 GiB. OvercommitTracker decision: Query was selected to stop by OvercommitTracker.. (MEMORY_LIMIT_EXCEEDED)
(query: INSERT INTO test.hits SELECT * FROM datasets.hits_v1 SETTINGS enable_filesystem_cache_on_write_operations=0, max_insert_threads=16)
+ clickhouse-client --query 'INSERT INTO test.visits SELECT * FROM datasets.visits_v1 SETTINGS enable_filesystem_cache_on_write_operations=0, max_insert_threads=16'
+ clickhouse-client --query 'DROP TABLE datasets.visits_v1 SYNC'
+ clickhouse-client --query 'DROP TABLE datasets.hits_v1 SYNC'
+ clickhouse-client --query 'SHOW TABLES FROM test'
hits
hits_s3
visits
+ clickhouse-client --query 'SYSTEM STOP THREAD FUZZER'
+ stop_server
+ local max_tries=90
+ local check_hang=true
+ local pid
++ cat /var/run/clickhouse-server/clickhouse-server.pid
+ pid=1289
+ clickhouse stop --max-tries 90 --do-not-kill
/var/run/clickhouse-server/clickhouse-server.pid file exists and contains pid = 1289.
The process with pid = 1289 is running.
Sent terminate signal to process with pid 1289.
Waiting for server to stop
/var/run/clickhouse-server/clickhouse-server.pid file exists and contains pid = 1289.
The process with pid = 1289 is running.
Waiting for server to stop
/var/run/clickhouse-server/clickhouse-server.pid file exists and contains pid = 1289.
The process with pid = 1289 is running.
Waiting for server to stop
/var/run/clickhouse-server/clickhouse-server.pid file exists and contains pid = 1289.
The process with pid = 1289 is running.
Waiting for server to stop
/var/run/clickhouse-server/clickhouse-server.pid file exists and contains pid = 1289.
The process with pid = 1289 is running.
Waiting for server to stop
/var/run/clickhouse-server/clickhouse-server.pid file exists and contains pid = 1289.
The process with pid = 1289 is running.
Waiting for server to stop
/var/run/clickhouse-server/clickhouse-server.pid file exists and contains pid = 1289.
The process with pid = 1289 is running.
Waiting for server to stop
/var/run/clickhouse-server/clickhouse-server.pid file exists and contains pid = 1289.
The process with pid = 1289 is running.
Waiting for server to stop
/var/run/clickhouse-server/clickhouse-server.pid file exists and contains pid = 1289.
The process with pid = 1289 is running.
Waiting for server to stop
/var/run/clickhouse-server/clickhouse-server.pid file exists and contains pid = 1289.
The process with pid = 1289 is running.
Waiting for server to stop
/var/run/clickhouse-server/clickhouse-server.pid file exists and contains pid = 1289.
The process with pid = 1289 is running.
Waiting for server to stop
/var/run/clickhouse-server/clickhouse-server.pid file exists and contains pid = 1289.
The process with pid = 1289 is running.
Waiting for server to stop
/var/run/clickhouse-server/clickhouse-server.pid file exists and contains pid = 1289.
The process with pid = 1289 is running.
Waiting for server to stop
Found pid = 2525 in the list of running processes.
The process with pid = 2525 is running.
Waiting for server to stop
Now there is no clickhouse-server process.
Server stopped
+ return
+ export RANDOMIZE_OBJECT_KEY_TYPE=1
+ RANDOMIZE_OBJECT_KEY_TYPE=1
+ export ZOOKEEPER_FAULT_INJECTION=1
+ ZOOKEEPER_FAULT_INJECTION=1
+ export THREAD_POOL_FAULT_INJECTION=1
+ THREAD_POOL_FAULT_INJECTION=1
+ configure
+ export USE_DATABASE_ORDINARY=1
+ USE_DATABASE_ORDINARY=1
+ export EXPORT_S3_STORAGE_POLICIES=1
+ EXPORT_S3_STORAGE_POLICIES=1
+ /usr/share/clickhouse-test/config/install.sh
+ DEST_SERVER_PATH=/etc/clickhouse-server
+ DEST_CLIENT_PATH=/etc/clickhouse-client
+++ dirname /usr/share/clickhouse-test/config/install.sh
++ cd /usr/share/clickhouse-test/config
++ pwd -P
+ SRC_PATH=/usr/share/clickhouse-test/config
+ echo 'Going to install test configs from /usr/share/clickhouse-test/config into /etc/clickhouse-server'
+ mkdir -p /etc/clickhouse-server/config.d/
Going to install test configs from /usr/share/clickhouse-test/config into /etc/clickhouse-server
+ mkdir -p /etc/clickhouse-server/users.d/
+ mkdir -p /etc/clickhouse-client
+ ln -sf /usr/share/clickhouse-test/config/config.d/zookeeper_write.xml /etc/clickhouse-server/config.d/
+ ln -sf /usr/share/clickhouse-test/config/config.d/max_num_to_warn.xml /etc/clickhouse-server/config.d/
+ ln -sf /usr/share/clickhouse-test/config/config.d/listen.xml /etc/clickhouse-server/config.d/
+ ln -sf /usr/share/clickhouse-test/config/config.d/text_log.xml /etc/clickhouse-server/config.d/
+ ln -sf /usr/share/clickhouse-test/config/config.d/blob_storage_log.xml /etc/clickhouse-server/config.d/
+ ln -sf /usr/share/clickhouse-test/config/config.d/custom_settings_prefixes.xml /etc/clickhouse-server/config.d/
+ ln -sf /usr/share/clickhouse-test/config/config.d/database_catalog_drop_table_concurrency.xml /etc/clickhouse-server/config.d/
+ ln -sf /usr/share/clickhouse-test/config/config.d/enable_access_control_improvements.xml /etc/clickhouse-server/config.d/
+ ln -sf /usr/share/clickhouse-test/config/config.d/macros.xml /etc/clickhouse-server/config.d/
+ ln -sf /usr/share/clickhouse-test/config/config.d/secure_ports.xml /etc/clickhouse-server/config.d/
+ ln -sf /usr/share/clickhouse-test/config/config.d/clusters.xml /etc/clickhouse-server/config.d/
+ ln -sf /usr/share/clickhouse-test/config/config.d/graphite.xml /etc/clickhouse-server/config.d/
+ ln -sf /usr/share/clickhouse-test/config/config.d/graphite_alternative.xml /etc/clickhouse-server/config.d/
+ ln -sf /usr/share/clickhouse-test/config/config.d/grpc_protocol.xml /etc/clickhouse-server/config.d/
+ ln -sf /usr/share/clickhouse-test/config/config.d/database_atomic.xml /etc/clickhouse-server/config.d/
+ ln -sf /usr/share/clickhouse-test/config/config.d/max_concurrent_queries.xml /etc/clickhouse-server/config.d/
+ ln -sf /usr/share/clickhouse-test/config/config.d/merge_tree_settings.xml /etc/clickhouse-server/config.d/
+ ln -sf /usr/share/clickhouse-test/config/config.d/backoff_failed_mutation.xml /etc/clickhouse-server/config.d/
+ ln -sf /usr/share/clickhouse-test/config/config.d/merge_tree_old_dirs_cleanup.xml /etc/clickhouse-server/config.d/
+ ln -sf /usr/share/clickhouse-test/config/config.d/test_cluster_with_incorrect_pw.xml /etc/clickhouse-server/config.d/
+ ln -sf /usr/share/clickhouse-test/config/config.d/keeper_port.xml /etc/clickhouse-server/config.d/
+ ln -sf /usr/share/clickhouse-test/config/config.d/logging_no_rotate.xml /etc/clickhouse-server/config.d/
+ ln -sf /usr/share/clickhouse-test/config/config.d/merge_tree.xml /etc/clickhouse-server/config.d/
+ ln -sf /usr/share/clickhouse-test/config/config.d/lost_forever_check.xml /etc/clickhouse-server/config.d/
+ ln -sf /usr/share/clickhouse-test/config/config.d/tcp_with_proxy.xml /etc/clickhouse-server/config.d/
+ ln -sf /usr/share/clickhouse-test/config/config.d/prometheus.xml /etc/clickhouse-server/config.d/
+ ln -sf /usr/share/clickhouse-test/config/config.d/top_level_domains_lists.xml /etc/clickhouse-server/config.d/
+ ln -sf /usr/share/clickhouse-test/config/config.d/top_level_domains_path.xml /etc/clickhouse-server/config.d/
+ ln -sf /usr/share/clickhouse-test/config/config.d/transactions.xml /etc/clickhouse-server/config.d/
+ ln -sf /usr/share/clickhouse-test/config/config.d/encryption.xml /etc/clickhouse-server/config.d/
+ ln -sf /usr/share/clickhouse-test/config/config.d/CORS.xml /etc/clickhouse-server/config.d/
+ ln -sf /usr/share/clickhouse-test/config/config.d/zookeeper_log.xml /etc/clickhouse-server/config.d/
+ ln -sf /usr/share/clickhouse-test/config/config.d/logger_trace.xml /etc/clickhouse-server/config.d/
+ ln -sf /usr/share/clickhouse-test/config/config.d/named_collection.xml /etc/clickhouse-server/config.d/
+ ln -sf /usr/share/clickhouse-test/config/config.d/ssl_certs.xml /etc/clickhouse-server/config.d/
+ ln -sf /usr/share/clickhouse-test/config/config.d/filesystem_cache_log.xml /etc/clickhouse-server/config.d/
+ ln -sf /usr/share/clickhouse-test/config/config.d/session_log.xml /etc/clickhouse-server/config.d/
+ ln -sf /usr/share/clickhouse-test/config/config.d/system_unfreeze.xml /etc/clickhouse-server/config.d/
+ ln -sf /usr/share/clickhouse-test/config/config.d/enable_zero_copy_replication.xml /etc/clickhouse-server/config.d/
+ ln -sf /usr/share/clickhouse-test/config/config.d/nlp.xml /etc/clickhouse-server/config.d/
+ ln -sf /usr/share/clickhouse-test/config/config.d/forbidden_headers.xml /etc/clickhouse-server/config.d/
+ ln -sf /usr/share/clickhouse-test/config/config.d/enable_keeper_map.xml /etc/clickhouse-server/config.d/
+ ln -sf /usr/share/clickhouse-test/config/config.d/custom_disks_base_path.xml /etc/clickhouse-server/config.d/
+ ln -sf /usr/share/clickhouse-test/config/config.d/display_name.xml /etc/clickhouse-server/config.d/
+ ln -sf /usr/share/clickhouse-test/config/config.d/compressed_marks_and_index.xml /etc/clickhouse-server/config.d/
+ ln -sf /usr/share/clickhouse-test/config/config.d/disable_s3_env_credentials.xml /etc/clickhouse-server/config.d/
+ ln -sf /usr/share/clickhouse-test/config/config.d/enable_wait_for_shutdown_replicated_tables.xml /etc/clickhouse-server/config.d/
+ ln -sf /usr/share/clickhouse-test/config/config.d/backups.xml /etc/clickhouse-server/config.d/
+ ln -sf /usr/share/clickhouse-test/config/config.d/filesystem_caches_path.xml /etc/clickhouse-server/config.d/
+ ln -sf /usr/share/clickhouse-test/config/config.d/validate_tcp_client_information.xml /etc/clickhouse-server/config.d/
+ ln -sf /usr/share/clickhouse-test/config/config.d/zero_copy_destructive_operations.xml /etc/clickhouse-server/config.d/
+ ln -sf /usr/share/clickhouse-test/config/config.d/block_number.xml /etc/clickhouse-server/config.d/
+ ln -sf /usr/share/clickhouse-test/config/config.d/handlers.yaml /etc/clickhouse-server/config.d/
+ ln -sf /usr/share/clickhouse-test/config/config.d/serverwide_trace_collector.xml /etc/clickhouse-server/config.d/
+ ln -sf /usr/share/clickhouse-test/config/config.d/rocksdb.xml /etc/clickhouse-server/config.d/
+ '[' /etc/clickhouse-server = /etc/clickhouse-server ']'
+ ln -sf /usr/share/clickhouse-test/config/config.d/legacy_geobase.xml /etc/clickhouse-server/config.d/
+ ln -sf /usr/share/clickhouse-test/config/users.d/log_queries.xml /etc/clickhouse-server/users.d/
+ ln -sf /usr/share/clickhouse-test/config/users.d/readonly.xml /etc/clickhouse-server/users.d/
+ ln -sf /usr/share/clickhouse-test/config/users.d/access_management.xml /etc/clickhouse-server/users.d/
+ ln -sf /usr/share/clickhouse-test/config/users.d/database_atomic_drop_detach_sync.xml /etc/clickhouse-server/users.d/
+ ln -sf /usr/share/clickhouse-test/config/users.d/opentelemetry.xml /etc/clickhouse-server/users.d/
+ ln -sf /usr/share/clickhouse-test/config/users.d/remote_queries.xml /etc/clickhouse-server/users.d/
+ ln -sf /usr/share/clickhouse-test/config/users.d/session_log_test.xml /etc/clickhouse-server/users.d/
+ ln -sf /usr/share/clickhouse-test/config/users.d/memory_profiler.xml /etc/clickhouse-server/users.d/
+ ln -sf /usr/share/clickhouse-test/config/users.d/no_fsync_metadata.xml /etc/clickhouse-server/users.d/
+ ln -sf /usr/share/clickhouse-test/config/users.d/filelog.xml /etc/clickhouse-server/users.d/
+ ln -sf /usr/share/clickhouse-test/config/users.d/enable_blobs_check.xml /etc/clickhouse-server/users.d/
+ ln -sf /usr/share/clickhouse-test/config/users.d/marks.xml /etc/clickhouse-server/users.d/
+ ln -sf /usr/share/clickhouse-test/config/users.d/insert_keeper_retries.xml /etc/clickhouse-server/users.d/
+ ln -sf /usr/share/clickhouse-test/config/users.d/prefetch_settings.xml /etc/clickhouse-server/users.d/
+ ln -sf /usr/share/clickhouse-test/config/users.d/nonconst_timezone.xml /etc/clickhouse-server/users.d/
+ ln -sf /usr/share/clickhouse-test/config/users.d/allow_introspection_functions.yaml /etc/clickhouse-server/users.d/
+ ln -sf /usr/share/clickhouse-test/config/users.d/replicated_ddl_entry.xml /etc/clickhouse-server/users.d/
+ [[ -n '' ]]
+ ln -sf /usr/share/clickhouse-test/config/users.d/timeouts.xml /etc/clickhouse-server/users.d/
+ ln -sf /usr/share/clickhouse-test/config/ints_dictionary.xml /etc/clickhouse-server/
+ ln -sf /usr/share/clickhouse-test/config/strings_dictionary.xml /etc/clickhouse-server/
+ ln -sf /usr/share/clickhouse-test/config/decimals_dictionary.xml /etc/clickhouse-server/
+ ln -sf /usr/share/clickhouse-test/config/executable_dictionary.xml /etc/clickhouse-server/
+ ln -sf /usr/share/clickhouse-test/config/executable_pool_dictionary.xml /etc/clickhouse-server/
+ ln -sf /usr/share/clickhouse-test/config/test_function.xml /etc/clickhouse-server/
+ ln -sf /usr/share/clickhouse-test/config/top_level_domains /etc/clickhouse-server/
+ ln -sf /usr/share/clickhouse-test/config/regions_hierarchy.txt /etc/clickhouse-server/config.d/
+ ln -sf /usr/share/clickhouse-test/config/regions_names_en.txt /etc/clickhouse-server/config.d/
+ ln -sf /usr/share/clickhouse-test/config/ext-en.txt /etc/clickhouse-server/config.d/
+ ln -sf /usr/share/clickhouse-test/config/ext-ru.txt /etc/clickhouse-server/config.d/
+ ln -sf /usr/share/clickhouse-test/config/lem-en.bin /etc/clickhouse-server/config.d/
+ ln -sf /usr/share/clickhouse-test/config/server.key /etc/clickhouse-server/
+ ln -sf /usr/share/clickhouse-test/config/server.crt /etc/clickhouse-server/
+ ln -sf /usr/share/clickhouse-test/config/dhparam.pem /etc/clickhouse-server/
+ ln -sf --backup=simple --suffix=_original.xml /usr/share/clickhouse-test/config/config.d/query_masking_rules.xml /etc/clickhouse-server/config.d/
+ [[ -n 1 ]]
+ [[ 1 -eq 1 ]]
+ rm -f /etc/clickhouse-server/config.d/zookeeper.xml
+ ln -sf /usr/share/clickhouse-test/config/config.d/zookeeper_fault_injection.xml /etc/clickhouse-server/config.d/
+ [[ -n 1 ]]
+ [[ 1 -eq 1 ]]
+ ln -sf /usr/share/clickhouse-test/config/config.d/cannot_allocate_thread_injection.xml /etc/clickhouse-server/config.d/
+ value=0
+ sed --follow-symlinks -i 's|[01]|0|' /etc/clickhouse-server/config.d/keeper_port.xml
+ value=10852352
+ sed --follow-symlinks -i 's|[[:digit:]]\+|10852352|' /etc/clickhouse-server/config.d/keeper_port.xml
+ value=59525120
+ sed --follow-symlinks -i 's|[[:digit:]]\+|59525120|' /etc/clickhouse-server/config.d/keeper_port.xml
+ [[ -n '' ]]
+ [[ -n 1 ]]
+ [[ 1 -eq 1 ]]
+ ln -sf /usr/share/clickhouse-test/config/users.d/database_ordinary.xml /etc/clickhouse-server/users.d/
+ [[ '' == \1 ]]
+ [[ '' == \1 ]]
+ [[ -n 1 ]]
+ ln -sf /usr/share/clickhouse-test/config/config.d/azure_storage_conf.xml /etc/clickhouse-server/config.d/
+ ln -sf /usr/share/clickhouse-test/config/config.d/storage_conf.xml /etc/clickhouse-server/config.d/
+ ln -sf /usr/share/clickhouse-test/config/config.d/storage_conf_02944.xml /etc/clickhouse-server/config.d/
+ ln -sf /usr/share/clickhouse-test/config/config.d/storage_conf_02963.xml /etc/clickhouse-server/config.d/
+ ln -sf /usr/share/clickhouse-test/config/config.d/storage_conf_02961.xml /etc/clickhouse-server/config.d/
+ ln -sf /usr/share/clickhouse-test/config/users.d/s3_cache.xml /etc/clickhouse-server/users.d/
+ ln -sf /usr/share/clickhouse-test/config/users.d/s3_cache_new.xml /etc/clickhouse-server/users.d/
+ [[ -n '' ]]
+ ln -sf /usr/share/clickhouse-test/config/client_config.xml /etc/clickhouse-client/config.xml
+ sudo cat /etc/clickhouse-server/config.d/keeper_port.xml
+ sed 's|100000|10000|'
+ sudo mv /etc/clickhouse-server/config.d/keeper_port.xml.tmp /etc/clickhouse-server/config.d/keeper_port.xml
+ [[ -n 1 ]]
+ [[ 1 -eq 1 ]]
+ randomize_config_boolean_value filtered_list keeper_port
+ value=1
+ sudo cat /etc/clickhouse-server/config.d/keeper_port.xml
+ sed 's|[01]|1|'
+ sudo mv /etc/clickhouse-server/config.d/keeper_port.xml.tmp /etc/clickhouse-server/config.d/keeper_port.xml
+ randomize_config_boolean_value multi_read keeper_port
+ value=0
+ sudo cat /etc/clickhouse-server/config.d/keeper_port.xml
+ sed 's|[01]|0|'
+ sudo mv /etc/clickhouse-server/config.d/keeper_port.xml.tmp /etc/clickhouse-server/config.d/keeper_port.xml
+ randomize_config_boolean_value check_not_exists keeper_port
+ value=0
+ sudo cat /etc/clickhouse-server/config.d/keeper_port.xml
+ sed 's|[01]|0|'
+ sudo mv /etc/clickhouse-server/config.d/keeper_port.xml.tmp /etc/clickhouse-server/config.d/keeper_port.xml
+ randomize_config_boolean_value create_if_not_exists keeper_port
+ value=0
+ sudo cat /etc/clickhouse-server/config.d/keeper_port.xml
+ sed 's|[01]|0|'
+ sudo mv /etc/clickhouse-server/config.d/keeper_port.xml.tmp /etc/clickhouse-server/config.d/keeper_port.xml
+ sudo chown clickhouse /etc/clickhouse-server/config.d/keeper_port.xml
+ sudo chgrp clickhouse /etc/clickhouse-server/config.d/keeper_port.xml
+ [[ -n 1 ]]
+ [[ 1 -eq 1 ]]
+ randomize_config_boolean_value use_compression zookeeper_fault_injection
+ value=1
+ sudo cat /etc/clickhouse-server/config.d/zookeeper_fault_injection.xml
+ sed 's|[01]|1|'
+ sudo mv /etc/clickhouse-server/config.d/zookeeper_fault_injection.xml.tmp /etc/clickhouse-server/config.d/zookeeper_fault_injection.xml
+ randomize_config_boolean_value enable_block_number_column block_number
+ value=1
+ sudo cat /etc/clickhouse-server/config.d/block_number.xml
+ sed 's|[01]|1|'
+ sudo mv /etc/clickhouse-server/config.d/block_number.xml.tmp /etc/clickhouse-server/config.d/block_number.xml
+ randomize_config_boolean_value enable_block_offset_column block_number
+ value=1
+ sudo cat /etc/clickhouse-server/config.d/block_number.xml
+ sed 's|[01]|1|'
+ sudo mv /etc/clickhouse-server/config.d/block_number.xml.tmp /etc/clickhouse-server/config.d/block_number.xml
+ echo 'ASAN_OPTIONS='\''malloc_context_size=10 verbosity=1 allocator_release_to_os_interval_ms=10000'\'''
+ export 'ASAN_OPTIONS=malloc_context_size=10 allocator_release_to_os_interval_ms=10000'
+ ASAN_OPTIONS='malloc_context_size=10 allocator_release_to_os_interval_ms=10000'
+ sudo chown root: /var/lib/clickhouse
+ local total_mem
++ awk '/MemTotal/ { print $(NF-1) }' /proc/meminfo
+ total_mem=32080792
+ total_mem=32850731008
+ max_server_memory_usage_to_ram_ratio=0.5
+ echo 'Setting max_server_memory_usage_to_ram_ratio to 0.5'
+ cat
Setting max_server_memory_usage_to_ram_ratio to 0.5
+ local max_users_mem
+ max_users_mem=9855219302
+ echo 'Setting max_memory_usage_for_user=9855219302 and max_memory_usage for queries to 10G'
+ cat
Setting max_memory_usage_for_user=9855219302 and max_memory_usage for queries to 10G
+ cat
+ [[ '' == \1 ]]
+ [[ '' == \1 ]]
+ sudo cat /etc/clickhouse-server/config.d/logger_trace.xml
+ sed 's|trace|test|'
+ mv /etc/clickhouse-server/config.d/logger_trace.xml.tmp /etc/clickhouse-server/config.d/logger_trace.xml
+ '[' LRU = SLRU ']'
++ date +%-d
+ '[' 1 -eq 1 ']'
+ sudo echo 'true'
+ start_server
+ counter=0
+ max_attempt=120
+ clickhouse-client --query 'SELECT 1'
Code: 210. DB::NetException: Connection refused (localhost:9000). (NETWORK_ERROR)
+ '[' 0 -gt 120 ']'
+ clickhouse start --user root
+ sleep 0.5
+ counter=1
+ clickhouse-client --query 'SELECT 1'
Code: 210. DB::NetException: Connection refused (localhost:9000). (NETWORK_ERROR)
+ '[' 1 -gt 120 ']'
+ clickhouse start --user root
+ sleep 0.5
+ counter=2
+ clickhouse-client --query 'SELECT 1'
Code: 210. DB::NetException: Connection refused (localhost:9000). (NETWORK_ERROR)
+ '[' 2 -gt 120 ']'
+ clickhouse start --user root
+ sleep 0.5
+ counter=3
+ clickhouse-client --query 'SELECT 1'
Code: 210. DB::NetException: Connection refused (localhost:9000). (NETWORK_ERROR)
+ '[' 3 -gt 120 ']'
+ clickhouse start --user root
+ sleep 0.5
+ counter=4
+ clickhouse-client --query 'SELECT 1'
Code: 210. DB::NetException: Connection refused (localhost:9000). (NETWORK_ERROR)
+ '[' 4 -gt 120 ']'
+ clickhouse start --user root
+ sleep 0.5
+ counter=5
+ clickhouse-client --query 'SELECT 1'
Code: 210. DB::NetException: Connection refused (localhost:9000). (NETWORK_ERROR)
+ '[' 5 -gt 120 ']'
+ clickhouse start --user root
+ sleep 0.5
+ counter=6
+ clickhouse-client --query 'SELECT 1'
Code: 210. DB::NetException: Connection refused (localhost:9000). (NETWORK_ERROR)
+ '[' 6 -gt 120 ']'
+ clickhouse start --user root
+ sleep 0.5
+ counter=7
+ clickhouse-client --query 'SELECT 1'
Code: 210. DB::NetException: Connection refused (localhost:9000). (NETWORK_ERROR)
+ '[' 7 -gt 120 ']'
+ clickhouse start --user root
+ sleep 0.5
+ counter=8
+ clickhouse-client --query 'SELECT 1'
Code: 210. DB::NetException: Connection refused (localhost:9000). (NETWORK_ERROR)
+ '[' 8 -gt 120 ']'
+ clickhouse start --user root
+ sleep 0.5
+ counter=9
+ clickhouse-client --query 'SELECT 1'
Code: 210. DB::NetException: Connection refused (localhost:9000). (NETWORK_ERROR)
127.0.0.1 - - [09/Oct/2026:05:15:22 +0000] "GET /devstoreaccount1/cont?restype=container HTTP/1.1" 200 -
127.0.0.1 - - [09/Oct/2026:05:15:22 +0000] "PUT /devstoreaccount1/cont/zsvojhfizdcfgdqitvcmlgunjfpzppwq HTTP/1.1" 201 -
+ '[' 9 -gt 120 ']'
+ clickhouse start --user root
127.0.0.1 - - [09/Oct/2026:05:15:22 +0000] "GET /devstoreaccount1/cont/zsvojhfizdcfgdqitvcmlgunjfpzppwq HTTP/1.1" 206 4
127.0.0.1 - - [09/Oct/2026:05:15:22 +0000] "GET /devstoreaccount1/cont/zsvojhfizdcfgdqitvcmlgunjfpzppwq HTTP/1.1" 206 2
127.0.0.1 - - [09/Oct/2026:05:15:22 +0000] "DELETE /devstoreaccount1/cont/zsvojhfizdcfgdqitvcmlgunjfpzppwq HTTP/1.1" 202 -
+ sleep 0.5
+ counter=10
+ clickhouse-client --query 'SELECT 1'
Code: 210. DB::NetException: Connection refused (localhost:9000). (NETWORK_ERROR)
+ '[' 10 -gt 120 ']'
+ clickhouse start --user root
+ sleep 0.5
+ counter=11
+ clickhouse-client --query 'SELECT 1'
Code: 210. DB::NetException: Connection refused (localhost:9000). (NETWORK_ERROR)
+ '[' 11 -gt 120 ']'
+ clickhouse start --user root
+ sleep 0.5
+ counter=12
+ clickhouse-client --query 'SELECT 1'
Code: 210. DB::NetException: Connection refused (localhost:9000). (NETWORK_ERROR)
+ '[' 12 -gt 120 ']'
+ clickhouse start --user root
+ sleep 0.5
+ counter=13
+ clickhouse-client --query 'SELECT 1'
Code: 210. DB::NetException: Connection refused (localhost:9000). (NETWORK_ERROR)
+ '[' 13 -gt 120 ']'
+ clickhouse start --user root
+ sleep 0.5
+ counter=14
+ clickhouse-client --query 'SELECT 1'
Code: 210. DB::NetException: Connection refused (localhost:9000). (NETWORK_ERROR)
+ '[' 14 -gt 120 ']'
+ clickhouse start --user root
+ sleep 0.5
+ counter=15
+ clickhouse-client --query 'SELECT 1'
Code: 210. DB::NetException: Connection refused (localhost:9000). (NETWORK_ERROR)
+ '[' 15 -gt 120 ']'
+ clickhouse start --user root
+ sleep 0.5
+ counter=16
+ clickhouse-client --query 'SELECT 1'
Code: 210. DB::NetException: Connection refused (localhost:9000). (NETWORK_ERROR)
+ '[' 16 -gt 120 ']'
+ clickhouse start --user root
+ sleep 0.5
+ counter=17
+ clickhouse-client --query 'SELECT 1'
Code: 210. DB::NetException: Connection refused (localhost:9000). (NETWORK_ERROR)
+ '[' 17 -gt 120 ']'
+ clickhouse start --user root
+ sleep 0.5
+ counter=18
+ clickhouse-client --query 'SELECT 1'
Code: 210. DB::NetException: Connection refused (localhost:9000). (NETWORK_ERROR)
+ '[' 18 -gt 120 ']'
+ clickhouse start --user root
+ sleep 0.5
+ counter=19
+ clickhouse-client --query 'SELECT 1'
Code: 210. DB::NetException: Connection refused (localhost:9000). (NETWORK_ERROR)
+ '[' 19 -gt 120 ']'
+ clickhouse start --user root
+ sleep 0.5
+ counter=20
+ clickhouse-client --query 'SELECT 1'
1
+ attach_gdb_to_clickhouse
++ run_with_retry 5 clickhouse-client --query 'SELECT count() FROM system.build_options WHERE name = '\''CXX_FLAGS'\'' AND position('\''sanitize=address'\'' IN value)'
++ [[ hxB =~ e ]]
++ set_e=false
++ set +e
++ local total_retries=5
++ shift
++ local retry=0
++ '[' 0 -ge 5 ']'
++ clickhouse-client --query 'SELECT count() FROM system.build_options WHERE name = '\''CXX_FLAGS'\'' AND position('\''sanitize=address'\'' IN value)'
Received exception from server (version 24.8.14):
Code: 439. DB::Exception: Received from localhost:9000. DB::Exception: Cannot schedule a task: fault injected (threads=1, jobs=1). (CANNOT_SCHEDULE_TASK)
(query: SELECT count() FROM system.build_options WHERE name = 'CXX_FLAGS' AND position('sanitize=address' IN value))
++ retry=1
++ sleep 5
++ '[' 1 -ge 5 ']'
++ clickhouse-client --query 'SELECT count() FROM system.build_options WHERE name = '\''CXX_FLAGS'\'' AND position('\''sanitize=address'\'' IN value)'
++ false
++ return
+ IS_ASAN=1
+ [[ 1 = \1 ]]
ASAN build detected. Not using gdb since it disables LeakSanitizer detections
+ echo 'ASAN build detected. Not using gdb since it disables LeakSanitizer detections'
+ stress --hung-check --drop-databases --output-folder test_output --skip-func-tests '' --global-time-limit 1200
2026-10-09 07:15:39,523 Run func tests '/usr/bin/clickhouse-test --client-option ignore_drop_queries_probability=0.5 --global_time_limit=1200 '
2026-10-09 07:15:40,025 Run func tests '/usr/bin/clickhouse-test --order=random --database=test_1 --client-option join_use_nulls=1 join_algorithm='parallel_hash' use_query_cache=1 query_cache_nondeterministic_function_handling='ignore' query_cache_system_table_handling='ignore' memory_tracker_fault_probability=0.001 merge_tree_read_split_ranges_into_intersecting_and_non_intersecting_injection_probability=0.05 group_by_use_nulls=1 ignore_drop_queries_probability=0.5 --global_time_limit=1200 '
2026-10-09 07:15:40,526 Run func tests '/usr/bin/clickhouse-test --order=random --db-engine="Replicated('/test/db/test_2', 's1', 'r1')" --client-option enable_deflate_qpl_codec=1 enable_zstd_qat_codec=1 use_query_cache=1 query_cache_nondeterministic_function_handling='ignore' query_cache_system_table_handling='ignore' ignore_drop_queries_probability=0.5 --global_time_limit=1200 '
2026-10-09 07:15:41,028 Run func tests '/usr/bin/clickhouse-test --order=random --database=test_3 --client-option join_algorithm='partial_merge' group_by_use_nulls=1 ignore_drop_queries_probability=0.5 --global_time_limit=1200 '
2026-10-09 07:15:41,529 Run func tests '/usr/bin/clickhouse-test --order=random --client-option join_use_nulls=1 ignore_drop_queries_probability=0.5 enable_parallel_replicas=1 max_parallel_replicas=3 cluster_for_parallel_replicas='parallel_replicas' parallel_replicas_for_non_replicated_merge_tree=1 --global_time_limit=1200 '
2026-10-09 07:15:42,031 Run func tests '/usr/bin/clickhouse-test --order=random --db-engine="Replicated('/test/db/test_5', 's1', 'r1')" --database=test_5 --client-option enable_deflate_qpl_codec=1 enable_zstd_qat_codec=1 join_algorithm='full_sorting_merge' group_by_use_nulls=1 ignore_drop_queries_probability=0.5 --global_time_limit=1200 '
2026-10-09 07:15:42,532 Run func tests '/usr/bin/clickhouse-test --order=random --client-option use_query_cache=1 query_cache_nondeterministic_function_handling='ignore' query_cache_system_table_handling='ignore' memory_tracker_fault_probability=0.001 merge_tree_read_split_ranges_into_intersecting_and_non_intersecting_injection_probability=0.05 http_make_head_request=0 ignore_drop_queries_probability=0.5 --global_time_limit=1200 '
2026-10-09 07:15:43,034 Run func tests '/usr/bin/clickhouse-test --order=random --database=test_7 --client-option join_use_nulls=1 join_algorithm='grace_hash' group_by_use_nulls=1 ignore_drop_queries_probability=0.5 --global_time_limit=1200 '
2026-10-09 07:15:43,535 Run func tests '/usr/bin/clickhouse-test --order=random --db-engine="Replicated('/test/db/test_8', 's1', 'r1')" --client-option enable_deflate_qpl_codec=1 enable_zstd_qat_codec=1 ignore_drop_queries_probability=0.5 --global_time_limit=1200 '
2026-10-09 07:15:44,037 Run func tests '/usr/bin/clickhouse-test --order=random --database=test_9 --client-option join_algorithm='auto' max_rows_in_join=1000 group_by_use_nulls=1 optimize_trivial_approximate_count_query=1 ignore_drop_queries_probability=0.5 --global_time_limit=1200 '
2026-10-09 07:15:44,538 Run func tests '/usr/bin/clickhouse-test --order=random --client-option join_use_nulls=1 ignore_drop_queries_probability=0.5 --global_time_limit=1200 '
2026-10-09 07:15:45,040 Run func tests '/usr/bin/clickhouse-test --order=random --db-engine="Replicated('/test/db/test_11', 's1', 'r1')" --database=test_11 --client-option enable_deflate_qpl_codec=1 enable_zstd_qat_codec=1 join_algorithm='parallel_hash' memory_tracker_fault_probability=0.001 merge_tree_read_split_ranges_into_intersecting_and_non_intersecting_injection_probability=0.05 group_by_use_nulls=1 ignore_drop_queries_probability=0.5 --global_time_limit=1200 '
2026-10-09 07:15:45,541 Run func tests '/usr/bin/clickhouse-test --order=random --client-option use_query_cache=1 query_cache_nondeterministic_function_handling='ignore' query_cache_system_table_handling='ignore' implicit_transaction=1 throw_on_unsupported_query_inside_transaction=0 http_make_head_request=0 ignore_drop_queries_probability=0.5 --global_time_limit=1200 '
2026-10-09 07:15:46,042 Run func tests '/usr/bin/clickhouse-test --order=random --database=test_13 --client-option join_use_nulls=1 join_algorithm='partial_merge' use_query_cache=1 query_cache_nondeterministic_function_handling='ignore' query_cache_system_table_handling='ignore' group_by_use_nulls=1 ignore_drop_queries_probability=0.5 --global_time_limit=1200 '
2026-10-09 07:15:46,544 Run func tests '/usr/bin/clickhouse-test --order=random --db-engine="Replicated('/test/db/test_14', 's1', 'r1')" --client-option enable_deflate_qpl_codec=1 enable_zstd_qat_codec=1 use_query_cache=1 query_cache_nondeterministic_function_handling='ignore' query_cache_system_table_handling='ignore' ignore_drop_queries_probability=0.5 --global_time_limit=1200 '
2026-10-09 07:15:47,045 Run func tests '/usr/bin/clickhouse-test --order=random --database=test_15 --client-option join_algorithm='full_sorting_merge' group_by_use_nulls=1 http_make_head_request=0 ignore_drop_queries_probability=0.5 --global_time_limit=1200 '
2026-10-09 07:15:47,547 Will wait functests to finish
2026-10-09 07:15:47,547 Finished 9 from 16 processes
2026-10-09 07:15:52,553 Finished 9 from 16 processes
2026-10-09 07:15:57,554 Finished 9 from 16 processes
2026-10-09 07:16:02,558 Finished 9 from 16 processes
2026-10-09 07:16:07,562 Finished 9 from 16 processes
2026-10-09 07:16:12,566 Finished 9 from 16 processes
2026-10-09 07:16:17,572 Finished 9 from 16 processes
2026-10-09 07:16:22,577 Finished 9 from 16 processes
2026-10-09 07:16:27,578 Finished 9 from 16 processes
2026-10-09 07:16:32,584 Finished 9 from 16 processes
2026-10-09 07:16:37,589 Finished 9 from 16 processes
2026-10-09 07:16:42,594 Finished 9 from 16 processes
2026-10-09 07:16:47,598 Finished 9 from 16 processes
2026-10-09 07:16:52,604 Finished 9 from 16 processes
2026-10-09 07:16:57,606 Finished 9 from 16 processes
2026-10-09 07:17:02,611 Finished 9 from 16 processes
2026-10-09 07:17:07,614 Finished 9 from 16 processes
2026-10-09 07:17:12,618 Finished 9 from 16 processes
2026-10-09 07:17:17,622 Finished 9 from 16 processes
2026-10-09 07:17:22,624 Finished 9 from 16 processes
2026-10-09 07:17:27,626 Finished 9 from 16 processes
2026-10-09 07:17:32,630 Finished 9 from 16 processes
2026-10-09 07:17:37,634 Finished 9 from 16 processes
2026-10-09 07:17:42,638 Finished 9 from 16 processes
2026-10-09 07:17:47,642 Finished 9 from 16 processes
2026-10-09 07:17:52,646 Finished 9 from 16 processes
2026-10-09 07:17:57,650 Finished 9 from 16 processes
2026-10-09 07:18:02,654 Finished 9 from 16 processes
2026-10-09 07:18:07,658 Finished 9 from 16 processes
2026-10-09 07:18:12,662 Finished 9 from 16 processes
2026-10-09 07:18:17,668 Finished 9 from 16 processes
2026-10-09 07:18:22,670 Finished 9 from 16 processes
2026-10-09 07:18:27,676 Finished 9 from 16 processes
2026-10-09 07:18:32,681 Finished 9 from 16 processes
2026-10-09 07:18:37,682 Finished 10 from 16 processes
2026-10-09 07:18:42,685 Finished 10 from 16 processes
2026-10-09 07:18:47,690 Finished 10 from 16 processes
2026-10-09 07:18:52,695 Finished 10 from 16 processes
2026-10-09 07:18:57,701 Finished 10 from 16 processes
2026-10-09 07:19:02,702 Finished 10 from 16 processes
2026-10-09 07:19:07,706 Finished 10 from 16 processes
2026-10-09 07:19:12,710 Finished 10 from 16 processes
2026-10-09 07:19:17,714 Finished 10 from 16 processes
2026-10-09 07:19:22,719 Finished 10 from 16 processes
2026-10-09 07:19:27,722 Finished 10 from 16 processes
2026-10-09 07:19:32,724 Finished 10 from 16 processes
2026-10-09 07:19:37,726 Finished 10 from 16 processes
2026-10-09 07:19:42,730 Finished 10 from 16 processes
2026-10-09 07:19:47,734 Finished 10 from 16 processes
2026-10-09 07:19:52,738 Finished 10 from 16 processes
2026-10-09 07:19:57,742 Finished 10 from 16 processes
2026-10-09 07:20:02,746 Finished 10 from 16 processes
2026-10-09 07:20:07,750 Finished 10 from 16 processes
2026-10-09 07:20:12,754 Finished 10 from 16 processes
2026-10-09 07:20:17,758 Finished 10 from 16 processes
2026-10-09 07:20:22,762 Finished 10 from 16 processes
2026-10-09 07:20:27,766 Finished 10 from 16 processes
2026-10-09 07:20:32,770 Finished 10 from 16 processes
2026-10-09 07:20:37,774 Finished 10 from 16 processes
2026-10-09 07:20:42,778 Finished 10 from 16 processes
2026-10-09 07:20:47,782 Finished 10 from 16 processes
2026-10-09 07:20:52,788 Finished 10 from 16 processes
2026-10-09 07:20:57,790 Finished 10 from 16 processes
2026-10-09 07:21:02,796 Finished 10 from 16 processes
2026-10-09 07:21:07,801 Finished 10 from 16 processes
2026-10-09 07:21:12,802 Finished 10 from 16 processes
2026-10-09 07:21:17,806 Finished 10 from 16 processes
2026-10-09 07:21:22,810 Finished 10 from 16 processes
2026-10-09 07:21:27,814 Finished 10 from 16 processes
2026-10-09 07:21:32,818 Finished 10 from 16 processes
2026-10-09 07:21:37,822 Finished 10 from 16 processes
2026-10-09 07:21:42,826 Finished 10 from 16 processes
2026-10-09 07:21:47,830 Finished 10 from 16 processes
2026-10-09 07:21:52,834 Finished 10 from 16 processes
2026-10-09 07:21:57,838 Finished 10 from 16 processes
2026-10-09 07:22:02,842 Finished 10 from 16 processes
2026-10-09 07:22:07,846 Finished 10 from 16 processes
2026-10-09 07:22:12,850 Finished 10 from 16 processes
2026-10-09 07:22:17,854 Finished 10 from 16 processes
2026-10-09 07:22:22,858 Finished 10 from 16 processes
2026-10-09 07:22:27,862 Finished 10 from 16 processes
2026-10-09 07:22:32,866 Finished 10 from 16 processes
2026-10-09 07:22:37,870 Finished 10 from 16 processes
2026-10-09 07:22:42,871 Finished 10 from 16 processes
2026-10-09 07:22:47,874 Finished 10 from 16 processes
2026-10-09 07:22:52,878 Finished 10 from 16 processes
2026-10-09 07:22:57,882 Finished 10 from 16 processes
2026-10-09 07:23:02,886 Finished 10 from 16 processes
2026-10-09 07:23:07,890 Finished 10 from 16 processes
2026-10-09 07:23:12,894 Finished 10 from 16 processes
2026-10-09 07:23:17,898 Finished 10 from 16 processes
2026-10-09 07:23:22,902 Finished 10 from 16 processes
2026-10-09 07:23:27,906 Finished 10 from 16 processes
2026-10-09 07:23:32,910 Finished 10 from 16 processes
2026-10-09 07:23:37,914 Finished 10 from 16 processes
2026-10-09 07:23:42,918 Finished 10 from 16 processes
2026-10-09 07:23:47,922 Finished 10 from 16 processes
2026-10-09 07:23:52,926 Finished 10 from 16 processes
2026-10-09 07:23:57,930 Finished 10 from 16 processes
2026-10-09 07:24:02,934 Finished 10 from 16 processes
2026-10-09 07:24:07,938 Finished 10 from 16 processes
2026-10-09 07:24:12,942 Finished 10 from 16 processes
2026-10-09 07:24:17,944 Finished 10 from 16 processes
2026-10-09 07:24:22,949 Finished 10 from 16 processes
2026-10-09 07:24:27,950 Finished 10 from 16 processes
2026-10-09 07:24:32,954 Finished 10 from 16 processes
2026-10-09 07:24:37,958 Finished 10 from 16 processes
2026-10-09 07:24:42,964 Finished 10 from 16 processes
2026-10-09 07:24:47,966 Finished 10 from 16 processes
2026-10-09 07:24:52,972 Finished 10 from 16 processes
2026-10-09 07:24:57,974 Finished 10 from 16 processes
2026-10-09 07:25:02,978 Finished 10 from 16 processes
2026-10-09 07:25:07,982 Finished 10 from 16 processes
2026-10-09 07:25:12,986 Finished 10 from 16 processes
2026-10-09 07:25:17,990 Finished 10 from 16 processes
2026-10-09 07:25:22,994 Finished 10 from 16 processes
2026-10-09 07:25:27,998 Finished 10 from 16 processes
2026-10-09 07:25:33,002 Finished 10 from 16 processes
2026-10-09 07:25:38,006 Finished 10 from 16 processes
2026-10-09 07:25:43,010 Finished 10 from 16 processes
2026-10-09 07:25:48,014 Finished 10 from 16 processes
2026-10-09 07:25:53,017 Finished 10 from 16 processes
2026-10-09 07:25:58,022 Finished 10 from 16 processes
2026-10-09 07:26:03,026 Finished 10 from 16 processes
2026-10-09 07:26:08,032 Finished 10 from 16 processes
2026-10-09 07:26:13,034 Finished 10 from 16 processes
2026-10-09 07:26:18,038 Finished 10 from 16 processes
2026-10-09 07:26:23,042 Finished 10 from 16 processes
2026-10-09 07:26:28,045 Finished 10 from 16 processes
2026-10-09 07:26:33,050 Finished 10 from 16 processes
2026-10-09 07:26:38,054 Finished 10 from 16 processes
2026-10-09 07:26:43,058 Finished 10 from 16 processes
2026-10-09 07:26:48,062 Finished 10 from 16 processes
2026-10-09 07:26:53,066 Finished 10 from 16 processes
2026-10-09 07:26:58,070 Finished 10 from 16 processes
2026-10-09 07:27:03,074 Finished 10 from 16 processes
2026-10-09 07:27:08,078 Finished 10 from 16 processes
2026-10-09 07:27:13,083 Finished 10 from 16 processes
2026-10-09 07:27:18,089 Finished 10 from 16 processes
2026-10-09 07:27:23,090 Finished 10 from 16 processes
2026-10-09 07:27:28,094 Finished 10 from 16 processes
2026-10-09 07:27:33,098 Finished 10 from 16 processes
2026-10-09 07:27:38,102 Finished 10 from 16 processes
2026-10-09 07:27:43,106 Finished 10 from 16 processes
2026-10-09 07:27:48,112 Finished 10 from 16 processes
2026-10-09 07:27:53,114 Finished 10 from 16 processes
2026-10-09 07:27:58,120 Finished 10 from 16 processes
2026-10-09 07:28:03,122 Finished 10 from 16 processes
2026-10-09 07:28:08,123 Finished 10 from 16 processes
2026-10-09 07:28:13,126 Finished 10 from 16 processes
2026-10-09 07:28:18,130 Finished 10 from 16 processes
2026-10-09 07:28:23,136 Finished 10 from 16 processes
127.0.0.1 - - [09/Oct/2026:05:28:25 +0000] "PUT /devstoreaccount1/cont/pzytgrhezfapxlnvvldaeogrxftzvali HTTP/1.1" 201 -
2026-10-09 07:28:28,139 Finished 10 from 16 processes
2026-10-09 07:28:33,144 Finished 10 from 16 processes
2026-10-09 07:28:38,149 Finished 10 from 16 processes
2026-10-09 07:28:43,154 Finished 10 from 16 processes
2026-10-09 07:28:48,158 Finished 10 from 16 processes
2026-10-09 07:28:53,164 Finished 10 from 16 processes
2026-10-09 07:28:58,169 Finished 10 from 16 processes
2026-10-09 07:29:03,172 Finished 10 from 16 processes
2026-10-09 07:29:08,174 Finished 10 from 16 processes
2026-10-09 07:29:13,178 Finished 10 from 16 processes
2026-10-09 07:29:18,182 Finished 11 from 16 processes
2026-10-09 07:29:23,186 Finished 12 from 16 processes
2026-10-09 07:29:28,191 Finished 12 from 16 processes
2026-10-09 07:29:33,197 Finished 12 from 16 processes
2026-10-09 07:29:38,198 Finished 12 from 16 processes
2026-10-09 07:29:43,202 Finished 12 from 16 processes
2026-10-09 07:29:48,206 Finished 12 from 16 processes
2026-10-09 07:29:53,210 Finished 12 from 16 processes
2026-10-09 07:29:58,214 Finished 12 from 16 processes
2026-10-09 07:30:03,218 Finished 12 from 16 processes
2026-10-09 07:30:08,222 Finished 12 from 16 processes
2026-10-09 07:30:13,226 Finished 12 from 16 processes
2026-10-09 07:30:18,232 Finished 12 from 16 processes
2026-10-09 07:30:23,237 Finished 12 from 16 processes
2026-10-09 07:30:28,242 Finished 12 from 16 processes
2026-10-09 07:30:33,247 Finished 12 from 16 processes
2026-10-09 07:30:38,251 Finished 12 from 16 processes
2026-10-09 07:30:43,254 Finished 12 from 16 processes
2026-10-09 07:30:48,256 Finished 12 from 16 processes
2026-10-09 07:30:53,258 Finished 12 from 16 processes
2026-10-09 07:30:58,264 Finished 12 from 16 processes
2026-10-09 07:31:03,267 Finished 12 from 16 processes
2026-10-09 07:31:08,270 Finished 12 from 16 processes
2026-10-09 07:31:13,274 Finished 12 from 16 processes
2026-10-09 07:31:18,279 Finished 12 from 16 processes
2026-10-09 07:31:23,282 Finished 12 from 16 processes
2026-10-09 07:31:28,285 Finished 12 from 16 processes
2026-10-09 07:31:33,288 Finished 12 from 16 processes
2026-10-09 07:31:38,294 Finished 12 from 16 processes
2026-10-09 07:31:43,298 Finished 12 from 16 processes
2026-10-09 07:31:48,301 Finished 12 from 16 processes
2026-10-09 07:31:53,302 Finished 12 from 16 processes
2026-10-09 07:31:58,306 Finished 12 from 16 processes
2026-10-09 07:32:03,312 Finished 12 from 16 processes
2026-10-09 07:32:08,317 Finished 12 from 16 processes
2026-10-09 07:32:13,318 Finished 12 from 16 processes
2026-10-09 07:32:18,322 Finished 12 from 16 processes
2026-10-09 07:32:23,326 Finished 12 from 16 processes
2026-10-09 07:32:28,332 Finished 12 from 16 processes
2026-10-09 07:32:33,337 Finished 12 from 16 processes
2026-10-09 07:32:38,342 Finished 12 from 16 processes
2026-10-09 07:32:43,346 Finished 12 from 16 processes
2026-10-09 07:32:48,352 Finished 12 from 16 processes
2026-10-09 07:32:53,354 Finished 12 from 16 processes
2026-10-09 07:32:58,358 Finished 12 from 16 processes
2026-10-09 07:33:03,362 Finished 12 from 16 processes
2026-10-09 07:33:08,366 Finished 12 from 16 processes
2026-10-09 07:33:13,370 Finished 12 from 16 processes
2026-10-09 07:33:18,374 Finished 12 from 16 processes
2026-10-09 07:33:23,378 Finished 12 from 16 processes
2026-10-09 07:33:28,384 Finished 12 from 16 processes
2026-10-09 07:33:33,386 Finished 12 from 16 processes
2026-10-09 07:33:38,388 Finished 12 from 16 processes
2026-10-09 07:33:43,393 Finished 12 from 16 processes
2026-10-09 07:33:48,398 Finished 12 from 16 processes
2026-10-09 07:33:53,402 Finished 12 from 16 processes
2026-10-09 07:33:58,408 Finished 12 from 16 processes
2026-10-09 07:34:03,413 Finished 12 from 16 processes
2026-10-09 07:34:08,418 Finished 12 from 16 processes
2026-10-09 07:34:13,422 Finished 12 from 16 processes
2026-10-09 07:34:18,426 Finished 12 from 16 processes
2026-10-09 07:34:23,430 Finished 12 from 16 processes
2026-10-09 07:34:28,434 Finished 12 from 16 processes
2026-10-09 07:34:33,438 Finished 12 from 16 processes
2026-10-09 07:34:38,439 Finished 12 from 16 processes
2026-10-09 07:34:43,442 Finished 12 from 16 processes
2026-10-09 07:34:48,446 Finished 12 from 16 processes
2026-10-09 07:34:53,450 Finished 12 from 16 processes
2026-10-09 07:34:58,454 Finished 12 from 16 processes
2026-10-09 07:35:03,455 Finished 12 from 16 processes
2026-10-09 07:35:08,458 Finished 12 from 16 processes
2026-10-09 07:35:13,462 Finished 12 from 16 processes
2026-10-09 07:35:18,466 Finished 12 from 16 processes
2026-10-09 07:35:23,470 Finished 12 from 16 processes
2026-10-09 07:35:28,473 Finished 12 from 16 processes
2026-10-09 07:35:33,478 Finished 12 from 16 processes
2026-10-09 07:35:38,482 Finished 12 from 16 processes
2026-10-09 07:35:43,486 Finished 12 from 16 processes
2026-10-09 07:35:48,490 Finished 13 from 16 processes
2026-10-09 07:35:53,493 Finished 13 from 16 processes
2026-10-09 07:35:58,494 Finished 14 from 16 processes
2026-10-09 07:36:03,498 Finished 14 from 16 processes
2026-10-09 07:36:08,502 Finished 15 from 16 processes
2026-10-09 07:36:13,508 Finished 15 from 16 processes
2026-10-09 07:36:18,510 Finished 15 from 16 processes
2026-10-09 07:36:23,514 Finished 15 from 16 processes
2026-10-09 07:36:28,517 Finished 15 from 16 processes
2026-10-09 07:36:33,522 Finished 15 from 16 processes
2026-10-09 07:36:38,524 Finished 15 from 16 processes
2026-10-09 07:36:43,526 Finished 15 from 16 processes
2026-10-09 07:36:48,530 Finished 15 from 16 processes
2026-10-09 07:36:53,536 Finished 15 from 16 processes
2026-10-09 07:36:58,541 Finished 15 from 16 processes
2026-10-09 07:37:03,542 Finished 15 from 16 processes
2026-10-09 07:37:08,548 Finished 15 from 16 processes
2026-10-09 07:37:13,550 Finished 15 from 16 processes
2026-10-09 07:37:18,554 Finished 15 from 16 processes
2026-10-09 07:37:23,560 Finished 15 from 16 processes
2026-10-09 07:37:28,562 Finished 15 from 16 processes
2026-10-09 07:37:33,566 Finished 15 from 16 processes
2026-10-09 07:37:38,570 Finished 15 from 16 processes
2026-10-09 07:37:43,576 Finished 15 from 16 processes
2026-10-09 07:37:48,578 Finished 15 from 16 processes
2026-10-09 07:37:53,582 Finished 15 from 16 processes
2026-10-09 07:37:58,586 Finished 15 from 16 processes
2026-10-09 07:38:03,592 Finished 15 from 16 processes
2026-10-09 07:38:08,594 Finished 15 from 16 processes
2026-10-09 07:38:13,598 Finished 15 from 16 processes
2026-10-09 07:38:18,600 Finished 15 from 16 processes
2026-10-09 07:38:23,602 Finished 15 from 16 processes
2026-10-09 07:38:28,605 Finished 15 from 16 processes
2026-10-09 07:38:33,610 Finished 15 from 16 processes
2026-10-09 07:38:38,615 Finished 15 from 16 processes
2026-10-09 07:38:43,618 Finished 15 from 16 processes
2026-10-09 07:38:48,622 Finished 15 from 16 processes
2026-10-09 07:38:53,628 Finished 15 from 16 processes
2026-10-09 07:38:58,633 Finished 15 from 16 processes
2026-10-09 07:39:03,634 Finished 15 from 16 processes
2026-10-09 07:39:08,637 Finished 15 from 16 processes
2026-10-09 07:39:13,638 Finished 15 from 16 processes
2026-10-09 07:39:18,642 Finished 15 from 16 processes
2026-10-09 07:39:23,644 Finished 15 from 16 processes
2026-10-09 07:39:28,646 Finished 15 from 16 processes
2026-10-09 07:39:33,651 Finished 15 from 16 processes
2026-10-09 07:39:38,656 Finished 15 from 16 processes
2026-10-09 07:39:43,661 Finished 15 from 16 processes
2026-10-09 07:39:48,666 Finished 15 from 16 processes
2026-10-09 07:39:53,670 Finished 15 from 16 processes
2026-10-09 07:39:58,674 Finished 15 from 16 processes
2026-10-09 07:40:03,675 Finished 15 from 16 processes
2026-10-09 07:40:08,678 Finished 15 from 16 processes
2026-10-09 07:40:13,684 Finished 15 from 16 processes
2026-10-09 07:40:18,689 Finished 15 from 16 processes
2026-10-09 07:40:23,690 Finished 15 from 16 processes
2026-10-09 07:40:28,696 Finished 15 from 16 processes
2026-10-09 07:40:33,698 Finished 15 from 16 processes
2026-10-09 07:40:38,704 Finished 15 from 16 processes
2026-10-09 07:40:43,706 Finished 15 from 16 processes
2026-10-09 07:40:48,712 Finished 15 from 16 processes
2026-10-09 07:40:53,717 Finished 15 from 16 processes
2026-10-09 07:40:58,718 Finished 15 from 16 processes
2026-10-09 07:41:03,722 Finished 15 from 16 processes
2026-10-09 07:41:08,728 Finished 15 from 16 processes
2026-10-09 07:41:13,730 Finished 15 from 16 processes
2026-10-09 07:41:18,736 Finished 15 from 16 processes
2026-10-09 07:41:23,741 Finished 15 from 16 processes
2026-10-09 07:41:28,743 Finished 15 from 16 processes
2026-10-09 07:41:33,748 Finished 15 from 16 processes
2026-10-09 07:41:38,753 Finished 15 from 16 processes
2026-10-09 07:41:43,754 Finished 15 from 16 processes
2026-10-09 07:41:48,758 Finished 15 from 16 processes
2026-10-09 07:41:53,764 Finished 15 from 16 processes
2026-10-09 07:41:58,766 Finished 15 from 16 processes
2026-10-09 07:42:03,772 Finished 15 from 16 processes
2026-10-09 07:42:08,777 Finished 15 from 16 processes
2026-10-09 07:42:13,782 Finished 15 from 16 processes
2026-10-09 07:42:18,785 All processes finished
2026-10-09 07:42:18,785 Compressing stress logs
2026-10-09 07:42:18,830 Logs compressed
2026-10-09 07:42:18,830 Will terminate gdb (if any)
2026-10-09 07:42:18,830 Running command: kill -TERM $(pidof gdb)
/bin/sh: 1: kill: Usage: kill [-s sigspec | -signum | -sigspec] [pid | job]... or
kill -l [exitstatus]
2026-10-09 07:42:18,838 Command returend 2, retrying
/bin/sh: 1: kill: Usage: kill [-s sigspec | -signum | -sigspec] [pid | job]... or
kill -l [exitstatus]
2026-10-09 07:42:18,846 Command returend 2, retrying
/bin/sh: 1: kill: Usage: kill [-s sigspec | -signum | -sigspec] [pid | job]... or
kill -l [exitstatus]
2026-10-09 07:42:19,855 Command returend 2, retrying
/bin/sh: 1: kill: Usage: kill [-s sigspec | -signum | -sigspec] [pid | job]... or
kill -l [exitstatus]
2026-10-09 07:42:21,866 Command returend 2, retrying
/bin/sh: 1: kill: Usage: kill [-s sigspec | -signum | -sigspec] [pid | job]... or
kill -l [exitstatus]
2026-10-09 07:42:24,877 Command returend 2, retrying
2026-10-09 07:42:28,879 Running command: timeout 50s tail --pid=$(pidof gdb) -f /dev/null || kill -9 $(pidof gdb) ||:
tail: invalid PID: ‘’
/bin/sh: 1: kill: Usage: kill [-s sigspec | -signum | -sigspec] [pid | job]... or
kill -l [exitstatus]
2026-10-09 07:42:28,896 Running command: kill -CONT $(cat /var/run/clickhouse-server/clickhouse-server.pid) && clickhouse client -q 'SELECT 1 FORMAT Null'
2026-10-09 07:42:29,311 Running command: clickhouse client -q "SYSTEM STOP THREAD FUZZER" --max_untracked_memory=1Gi --memory_profiler_step=1Gi --max_memory_usage_for_user=0 --max_memory_usage_in_client=1000000000
2026-10-09 07:42:29,626 Running command: clickhouse client -q "SYSTEM START MERGES" --max_untracked_memory=1Gi --memory_profiler_step=1Gi --max_memory_usage_for_user=0 --max_memory_usage_in_client=1000000000
2026-10-09 07:42:29,891 Running command: clickhouse client -q "SYSTEM START DISTRIBUTED SENDS" --max_untracked_memory=1Gi --memory_profiler_step=1Gi --max_memory_usage_for_user=0 --max_memory_usage_in_client=1000000000
2026-10-09 07:42:30,106 Running command: clickhouse client -q "SYSTEM START TTL MERGES" --max_untracked_memory=1Gi --memory_profiler_step=1Gi --max_memory_usage_for_user=0 --max_memory_usage_in_client=1000000000
2026-10-09 07:42:30,321 Running command: clickhouse client -q "SYSTEM START MOVES" --max_untracked_memory=1Gi --memory_profiler_step=1Gi --max_memory_usage_for_user=0 --max_memory_usage_in_client=1000000000
2026-10-09 07:42:30,587 Running command: clickhouse client -q "SYSTEM START FETCHES" --max_untracked_memory=1Gi --memory_profiler_step=1Gi --max_memory_usage_for_user=0 --max_memory_usage_in_client=1000000000
2026-10-09 07:42:30,852 Running command: clickhouse client -q "SYSTEM START REPLICATED SENDS" --max_untracked_memory=1Gi --memory_profiler_step=1Gi --max_memory_usage_for_user=0 --max_memory_usage_in_client=1000000000
2026-10-09 07:42:31,066 Running command: clickhouse client -q "SYSTEM START REPLICATION QUEUES" --max_untracked_memory=1Gi --memory_profiler_step=1Gi --max_memory_usage_for_user=0 --max_memory_usage_in_client=1000000000
2026-10-09 07:42:31,331 Running command: clickhouse client -q "SYSTEM DROP MARK CACHE" --max_untracked_memory=1Gi --memory_profiler_step=1Gi --max_memory_usage_for_user=0 --max_memory_usage_in_client=1000000000
2026-10-09 07:42:31,596 Running command: clickhouse client -q "KILL QUERY WHERE upper(query) LIKE 'WATCH %'" --max_untracked_memory=1Gi --memory_profiler_step=1Gi --max_memory_usage_for_user=0 --max_memory_usage_in_client=1000000000
2026-10-09 07:42:31,862 Running command: clickhouse client -q "KILL QUERY WHERE query LIKE 'insert into tableB select %'" --max_untracked_memory=1Gi --memory_profiler_step=1Gi --max_memory_usage_for_user=0 --max_memory_usage_in_client=1000000000
2026-10-09 07:42:32,127 Running command: clickhouse client -q "KILL QUERY WHERE query LIKE 'SELECT URL, uniq(SearchPhrase) AS u FROM test.hits GROUP BY URL ORDER BY u %'" --max_untracked_memory=1Gi --memory_profiler_step=1Gi --max_memory_usage_for_user=0 --max_memory_usage_in_client=1000000000
2026-10-09 07:42:32,341 Running command: clickhouse client -q "KILL QUERY WHERE query LIKE 'SELECT (SELECT number FROM system.numbers WHERE number = 1000000000000)%'" --max_untracked_memory=1Gi --memory_profiler_step=1Gi --max_memory_usage_for_user=0 --max_memory_usage_in_client=1000000000
Received exception from server (version 24.8.14):
Code: 159. DB::Exception: Received from localhost:9000. DB::Exception: Timeout exceeded: elapsed 60.158536578 seconds, maximum: 60. (TIMEOUT_EXCEEDED)
(query: SELECT sleepEachRow((
SELECT maxOrDefault(300 - elapsed) + 1
FROM system.processes
WHERE query NOT LIKE '%FROM system.processes%' AND elapsed < 300
) / 300)
FROM numbers(300)
FORMAT Null
SETTINGS function_sleep_max_microseconds_per_block = 0
)
2026-10-09 07:43:33,826 Checking if some queries hung
Using queries from '/usr/share/clickhouse-test/queries' directory
Connecting to ClickHouse server... OK
Connected to server 24.8.14.10548.altinitytest @ 46730ff980959b467755574dbfd0b2d6664947a0 HEAD
Running 1 stateless tests (MainProcess).
00001_select_1: [ OK ]
1 tests passed. 0 tests skipped. 0.48 s elapsed (MainProcess).
Won't run stateful tests because test data wasn't loaded.
Checking the hung queries: done
No queries hung.
All tests have finished.
Top patterns of log messages:
count count_% size size_% uniq_loggers uniq_threads levels background_% message_format_string
1. 12815 0.06 1.30 MiB 0.02 1 78 ['Trace'] 0.19 Checking existence of path: {}
2. 7774 0.037 1.39 MiB 0.021 1 93 ['Debug'] 0 (from {}{}{}){}{} {} (stage: {})
3. 7742 0.036 1.16 MiB 0.018 2739 92 ['Trace'] 1 {} Creating query context from {} context, user_id: {}, parent context user: {}
4. 7644 0.036 537.55 KiB 0.008 1 720 ['Trace'] 0.912 Reserved {} on local disk {}, having unreserved {}.
5. 7231 0.034 204.00 KiB 0.003 1 92 ['Debug'] 0 Processed in {} sec.
6. 6046 0.028 242.08 KiB 0.004 14 497 ['Debug'] 0.468 Will use old analyzer to prepare mutation
7. 5759 0.027 530.85 KiB 0.008 1 39 ['Debug'] 0 Reading {} marks from part {}, total {} rows starting from the beginning of the part
8. 5468 0.026 151.50 KiB 0.002 1 231 ['Trace'] 0.032 Query to stage {}{}
9. 5436 0.026 278.97 KiB 0.004 1 231 ['Trace'] 0.032 Query from stage {} to stage {}{}
10. 4390 0.021 304.46 KiB 0.005 151 643 ['Trace'] 0.849 Trying to reserve {} using storage policy from min volume index {}
11. 4275 0.02 509.80 KiB 0.008 148 193 ['Trace'] 0.64 Renaming temporary part {} to {} with tid {}.
12. 4253 0.02 204.02 KiB 0.003 1 194 ['Trace'] 0.638 filled checksums {}
13. 4026 0.019 255.56 KiB 0.004 1 107 ['Debug'] 0.649 Peak memory usage{}: {}.
14. 3872 0.018 163.88 KiB 0.002 1 122 ['Trace'] 1 is disk {} eligible for search: {}
15. 3504 0.016 27.94 MiB 0.424 5 18 ['Error'] 0.987 Cannot parse string {} as {}: syntax error {}
16. 3196 0.015 140.41 KiB 0.002 1 16 ['Trace'] 0 Mutating part {} to mutation version {}
17. 3066 0.014 137.04 KiB 0.002 1 3 ['Trace'] 1 Processing requests batch, size: {}, bytes: {}
18. 2828 0.013 11.09 MiB 0.168 4 20 ['Error'] 0 Table {}.{} does not exist. Maybe you meant {}.{}?
19. 2822 0.013 331.75 KiB 0.005 1 17 ['Debug'] 0 Reading {} marks from part {}, total {} rows starting from the beginning of the part, column {}
20. 2780 0.013 312.21 KiB 0.005 2780 110 ['Debug'] 0.996 {} Authenticated with global context as user {}
21. 2780 0.013 128.25 KiB 0.002 2780 110 ['Debug'] 0.996 Authenticating user '{}' from {}
22. 2765 0.013 243.02 KiB 0.004 2765 106 ['Debug'] 0.996 {} Logout, user_id: {}
23. 2759 0.013 202.08 KiB 0.003 2759 92 ['Debug'] 1 Creating session context with user_id: {}
24. 2700 0.013 155.19 KiB 0.002 17 39 ['Trace'] 1 Flushing system log, {} entries to flush up to offset {}
25. 2698 0.013 95.93 KiB 0.001 17 39 ['Trace'] 1 Flushed system log up to offset {}
26. 2586 0.012 206.45 KiB 0.003 1 66 ['Debug'] 0 Read {} rows, {} in {} sec., {} rows/sec., {}/sec.
27. 2310 0.011 206.57 KiB 0.003 1 92 ['Debug'] 1 Connected {} version {}.{}.{}, revision: {}{}{}.
28. 2310 0.011 77.33 KiB 0.001 1 92 ['Trace'] 1 TCP Request. Address: {}
29. 2281 0.011 60.14 KiB 0.001 1 88 ['Debug'] 1 Done processing connection.
30. 1995 0.009 154.25 KiB 0.002 16 163 ['Trace'] 0.999 Part {} is not stored on zero-copy replicated disk, blobs can be removed
31. 1813 0.009 188.09 KiB 0.003 53 16 ['Trace'] 1 Mutating part {} with mutation commands from {} mutations ({}): {}
32. 1813 0.009 100.89 KiB 0.001 53 16 ['Trace'] 1 Executing log entry to mutate part {} to {}
33. 1767 0.008 216.94 KiB 0.003 1 6 ['Trace'] 1 MemoryTracking: was {}, peak {}, free memory in arenas {}, will set to {} (RSS), difference: {}
34. 1731 0.008 38.85 KiB 0.001 2 506 ['Information','Debug'] 0.999 Checking part {}
35. 1730 0.008 65.85 KiB 0.001 1 16 ['Trace'] 0 Enqueueing {} for check after {}s
36. 1730 0.008 43.89 KiB 0.001 1 505 ['Information'] 1 Part {} looks good.
37. 1730 0.008 54.03 KiB 0.001 1 505 ['Information'] 1 Checking data of part {}.
38. 1730 0.008 81.06 KiB 0.001 1 505 ['Trace'] 1 Part {} in zookeeper: {}, locally: {}
39. 1725 0.008 102.76 KiB 0.002 182 124 ['Debug'] 0.2 There are {} detached tables. Start searching non used tables.
40. 1725 0.008 72.44 KiB 0.001 182 124 ['Debug'] 0.2 Found {} non used tables in detached tables.
41. 1584 0.007 162.03 KiB 0.002 1 7 ['Trace'] 0.5 Adding file: {}, size: {}
42. 1523 0.007 87.92 KiB 0.001 2 16 ['Trace'] 0.979 Loading config file '{}'.
43. 1302 0.006 110.83 KiB 0.002 30 479 ['Trace'] 1 Scheduling next merge selecting task after {}ms, current attempt status: {}
44. 1206 0.006 3.03 MiB 0.046 2 462 ['Error'] 1 Table is in readonly mode (replica path: {})
45. 1200 0.006 98.36 KiB 0.001 87 65 ['Trace'] 0 Reading {} ranges in{}order from part {}, approx. {} rows starting from {}
46. 1192 0.006 107.07 KiB 0.002 1 378 ['Trace'] 0 Aggregated. {} to {} rows (from {}) in {} sec. ({:.3f} rows/sec., {}/sec.)
47. 1167 0.005 61.54 KiB 0.001 5 3 ['Trace'] 0 Failed to wait for mutation '{}', will recheck
48. 1076 0.005 147.02 KiB 0.002 1 48 ['Trace'] 0 No query result found for query {}
49. 1050 0.005 56.64 KiB 0.001 33 473 ['Debug'] 0.987 Selected {} parts from {} to {}
50. 990 0.005 29.11 KiB 0 1 348 ['Trace'] 0 Aggregation method: {}
51. 946 0.004 296.44 KiB 0.004 2 4 ['Error'] 0 Number of arguments for function {} doesn't match: passed {}, should be {}
52. 945 0.004 21.23 KiB 0 1 362 ['Trace'] 0 Merging aggregated data
53. 904 0.004 186.27 KiB 0.003 1 1 ['Error'] 0 Failed to push block to view {}, {}
54. 881 0.004 30.10 KiB 0 1 39 ['Debug'] 0 Selected MergeAlgorithm: {}
55. 881 0.004 72.94 KiB 0.001 1 39 ['Debug'] 0 Merging {} parts: from {} to {} into {} with storage {}
56. 869 0.004 90.80 KiB 0.001 1 424 ['Debug'] 1 According to exponential backoff policy, do not perform mutations for the part {} yet. Put it aside.
57. 849 0.004 56.06 KiB 0.001 34 40 ['Trace'] 0 Merged {} parts: [{}, {}] -> {}
58. 849 0.004 111.34 KiB 0.002 1 38 ['Debug'] 0 Merge sorted {} rows, containing {} columns ({} merged, {} gathered) in {} sec., {} rows/sec., {}/sec.
59. 830 0.004 23.98 KiB 0 109 213 ['Debug'] 0.202 Key condition: {}
60. 829 0.004 36.43 KiB 0.001 108 213 ['Trace'] 0.203 Filtering marks by primary and secondary keys
61. 810 0.004 62.49 KiB 0.001 1 62 ['Trace'] 0 Query span trace_id for opentelemetry log: {}
62. 809 0.004 93.46 KiB 0.001 105 211 ['Debug'] 0.203 Selected {}/{} parts by partition key, {} parts by primary key, {}/{} marks by primary key, {} marks to read from {} ranges
63. 795 0.004 86.66 KiB 0.001 74 94 ['Debug'] 0.994 Removing {} parts from filesystem (serially): Parts: [{}]
64. 759 0.004 74.36 KiB 0.001 40 57 ['Trace'] 0.993 Found {} old parts to remove. Parts: [{}]
65. 757 0.004 74.52 KiB 0.001 39 57 ['Debug'] 0.993 Removing {} parts from memory: Parts: [{}]
66. 742 0.003 38.40 KiB 0.001 93 208 ['Trace'] 0.221 Spreading mark ranges among streams (default reading)
67. 726 0.003 86.46 KiB 0.001 1 44 ['Trace'] 0 Stored query result of query {}
68. 692 0.003 56.07 KiB 0.001 1 5 ['Debug'] 0.48 Merging configuration file '{}'.
69. 640 0.003 6.88 KiB 0 1 304 ['Trace'] 0 Aggregating
70. 634 0.003 88.09 KiB 0.001 20 372 ['Trace'] 1 Checked {} partitions, found {} partitions with parts that may be merged: [{}] (max_total_size_to_merge={}, merge_with_ttl_allowed={})
71. 608 0.003 2.48 MiB 0.038 24 102 ['Error'] 0.334 Cannot schedule a task: {} (threads={}, jobs={})
72. 524 0.002 42.51 KiB 0.001 1 263 ['Trace'] 0 An entry for key={} found in cache: sum_of_sizes={}, median_size={}
73. 494 0.002 64.12 KiB 0.001 1 2 ['Trace'] 1 Creating part at path {}
74. 484 0.002 38.76 KiB 0.001 5 7 ['Debug'] 1 Starting first stage of renaming process. Will rename tables to intermediate names
75. 484 0.002 14.18 KiB 0 5 7 ['Debug'] 1 Renames completed successfully
76. 484 0.002 28.83 KiB 0 5 7 ['Debug'] 1 Trying to get consistent metadata snapshot for log pointer {}
77. 484 0.002 24.10 KiB 0 5 7 ['Debug'] 1 Got consistent metadata snapshot for log pointer {}
78. 484 0.002 45.38 KiB 0.001 5 7 ['Debug'] 1 Starting second stage of renaming process. Will rename tables from intermediate to desired names
79. 484 0.002 43.48 KiB 0.001 5 7 ['Trace'] 1 Trying to initialize replication: our_log_ptr={}, max_log_ptr={}, local_digest={}, zk_digest={}
80. 484 0.002 20.32 KiB 0 5 7 ['Information'] 1 Will create new replica from log pointer {}
81. 481 0.002 1.33 MiB 0.02 2 4 ['Error'] 1 Directory for {} data {} already exists
82. 481 0.002 496.03 KiB 0.007 2 4 ['Information'] 1 Executing {}
83. 464 0.002 81.53 KiB 0.001 2 48 ['Trace'] 1 HTTP Request for {}. Method: {}, Address: {}, User-Agent: {}{}, Content Type: {}, Transfer Encoding: {}, X-Forwarded-For: {}
84. 464 0.002 288.31 KiB 0.004 2 48 ['Trace'] 1 Request URI: {}
85. 455 0.002 17.80 KiB 0 1 199 ['Debug'] 0.598 Spawn loader worker #{} in {}
86. 455 0.002 12.91 KiB 0 1 291 ['Debug'] 1 Stop worker in {}
87. 454 0.002 30.99 KiB 0 1 192 ['Debug'] 1 Finish load job '{}' with status {}
88. 454 0.002 34.11 KiB 0.001 1 44 ['Debug'] 0.178 Schedule load job '{}' into {}
89. 454 0.002 32.78 KiB 0 1 192 ['Debug'] 1 Execute load job '{}' in {}
90. 443 0.002 40.68 KiB 0.001 1 45 ['Debug'] 0.122 Prioritize load job '{}': {} -> {}
91. 422 0.002 8.65 KiB 0 2 47 ['Debug'] 0.04 Done processing query
92. 421 0.002 33.59 KiB 0 1 234 ['Trace'] 0 Statistics updated for key={}: new sum_of_sizes={}, median_size={}
93. 415 0.002 22.38 KiB 0 14 11 ['Trace'] 0.125 is disk {} eligible for search: {} (mode {})
94. 389 0.002 12.90 KiB 0 1 202 ['Debug'] 0.532 Change current priority: {} -> {}
95. 386 0.002 13.85 KiB 0 36 64 ['Debug'] 0 MinMax index condition: {}
96. 375 0.002 12.19 KiB 0 22 86 ['Trace'] 0 Found {} range {}in {} steps
97. 375 0.002 10.78 KiB 0 22 86 ['Trace'] 0 Found (LEFT) boundary mark: {}
98. 375 0.002 11.17 KiB 0 22 86 ['Trace'] 0 Found (RIGHT) boundary mark: {}
99. 375 0.002 25.52 KiB 0 22 86 ['Trace'] 0 Running binary search on index range for part {} ({} marks)
100. 374 0.002 3.29 KiB 0 2 44 ['Trace'] 0.021 No tables
count count_% size size_% uniq_loggers uniq_threads levels background_% message_format_string
Top messages without format string (fmt::runtime):
count pattern runtime_message line
1. 22 CodeDBExceptionReceivedfromDBExc Code: 439. DB::Exception: Received from 127.0.0.10:9000. DB::Exception: Cannot schedule a task: fault injected (threads=745, jobs=731). Stack trace:
0. ./contrib/llvm-project/libcxx/include/exception:141: Poco::Exception::Exception(String const&, int) @ 0 ('/executeQuery.cpp',221)
2. 4 CodeDBExceptionTimeoutconnecttim Code: 1000. DB::Exception: Timeout: connect timed out: 128.0.0.1:8123. (POCO_EXCEPTION), Stack trace (when copying this message, always include the lines below):
0. ./contrib/llvm-project/libcxx/include/exception:141: Poco::Exception::Exception(String con ('/TCPHandler.cpp',765)
3. 4 PocoExceptionCodeecodeTimeoutcon Poco::Exception. Code: 1000, e.code() = 0, Timeout: connect timed out: 128.0.0.1:8123 (version 24.8.14.10548.altinitytest (altinity build)) (from [::1]:33070) (comment: 02044_url_glob_parallel_connection_refused.sh) (in query: SELECT * FROM url('http://128 ('/executeQuery.cpp',221)
4. 3 invalidelectiontimeoutlowerbound invalid election timeout lower bound detected, adjusted to 0 ('/LoggerWrapper.h',43)
5. 3 bgappendentriesthreadinitiated bg append_entries thread initiated ('/LoggerWrapper.h',43)
6. 3 globalmanagerdoesnotexistwilluse global manager does not exist. will use local thread for commit and append ('/LoggerWrapper.h',43)
7. 3 ELECTIONTIMEOUTcurrentrolefollow [ELECTION TIMEOUT] current role: follower, log last term 0, state term 0, target p 1, my p 1, hb dead, pre-vote NOT done ('/LoggerWrapper.h',43)
8. 3 newconfiglogidxprevlogidxcurconf new config log idx 1, prev log idx 0, cur config log idx 0, prev log idx 0 ('/LoggerWrapper.h',43)
9. 3 PRIORITYdecaytargetmine [PRIORITY] decay, target 1 -> 1, mine 1 ('/LoggerWrapper.h',43)
10. 3 numberofpendingcommitelements number of pending commit elements: 0 ('/LoggerWrapper.h',43)
11. 3 parameterselectiontimeoutrangehe parameters: election timeout range 0 - 0, heartbeat 0, leadership expiry 0, max batch 100, backoff 50, snapshot distance 10000, enable randomized snapshot creation NO, log sync stop gap 99999, reserved logs 2147483647, client timeout 10000, auto forwarding ('/LoggerWrapper.h',43)
12. 3 waitforHBforms wait for HB, for 50 + [0, 0] ms ('/LoggerWrapper.h',43)
13. 3 VOTEINITmyidmyrolecandidateterml [VOTE INIT] my id 1, my role candidate, term 1, log idx 0, log term 0, priority (target 1 / mine 1) ('/LoggerWrapper.h',43)
14. 3 RaftASIOlistenerinitiatedonunsec Raft ASIO listener initiated on :::9234, unsecured ('/LoggerWrapper.h',43)
15. 3 newelectiontimeoutrange new election timeout range: 0 - 0 ('/LoggerWrapper.h',43)
16. 3 peerDCIDlocalhostvotingmembermyi peer 1: DC ID 0, localhost:9234, voting member, 1
my id: 1, voting_member
num peers: 0 ('/LoggerWrapper.h',43)
17. 3 configatindexiscommittedprevconf config at index 1 is committed, prev config log idx 0 ('/LoggerWrapper.h',43)
18. 3 INITRAFTSERVERcommitindextermele === INIT RAFT SERVER ===
commit index 0
term 0
election timer allowed
log store start 1, end 0
config log idx 0, prev log idx 0
-- ASYNC REPLICATION -- ('/LoggerWrapper.h',43)
19. 3 Electiontimeoutinitiateleaderele Election timeout, initiate leader election ('/LoggerWrapper.h',43)
20. 3 Forkedachildprocesstowatch Forked a child process to watch ('',0)
21. 3 statemachinecommitindexprecommit state machine commit index 0, precommit index 0, last log index 0 ('/LoggerWrapper.h',43)
22. 3 startingup starting up ('',0)
23. 3 invalidelectiontimeoutupperbound invalid election timeout upper bound detected, adjusted to 0 ('/LoggerWrapper.h',43)
24. 3 newconfigurationlogidxprevlogidx new configuration: log idx 1, prev log idx 0
peer 1, DC ID 0, localhost:9234, voting member, 1
my id: 1, leader: 1, term: 1 ('/LoggerWrapper.h',43)
25. 3 StartingClickHousealtinitytestre Starting ClickHouse 24.8.14.10548.altinitytest (revision: 4294967295, git hash: 46730ff980959b467755574dbfd0b2d6664947a0, build id: 2181C3456C4D74A6ECDF79BA31FE68C32F489A71), PID 410 ('',0)
26. 3 BECOMELEADERappendednewconfigat [BECOME LEADER] appended new config at 1 ('/LoggerWrapper.h',43)
27. 2 DBExceptionUnknowntableexpressio DB::Exception: Unknown table expression identifier 'postgresql' in scope SELECT * FROM postgresql ('',0)
28. 2 prevotetermisdifferentresetitto pre-vote term (0) is different, reset it to 1 ('/LoggerWrapper.h',43)
Top messages not matching their format strings:
message_format_string count() any_message
1. 75 Forked a child process to watch
2. {} is in use (by merge/mutation/INSERT) (consider increasing temporary_directories_lifetime setting) 49 /var/lib/clickhouse/store/306/3062ce98-d8bf-43d6-8141-eb414edf8ff3/tmp_insert_201403_8_8_0/ is in use (by merge/mutation/INSERT) (consider increasing temporary_directories_lifetime setting) (skipped 7 similar messages)
3. Not executing log entry {} of type {} for part {} because source parts size ({}) is greater than the current maximum ({}). 9 Not executing log entry queue-0000000022 of type MUTATE_PART for part 0_0_0_0_2 because source parts size (335.00 B) is greater than the current maximum (0.00 B). (skipped 5 similar messages)
4. (from {}{}{}){}{} {} (stage: {}) 2 (from [::1]:47112) (comment: 02682_quantiles_too_large_size.sql) -- This query throw high-level exception instead of low-level "too large size passed to allocator":
SELECT * FROM format(RowBinary, 'ik2 String, Sum AggregateFunction(sum, UInt16), A$g AggregateFunction(quantiles(0.4, 0.9), UInt64), GroupArray AggregateFunction(groupArray, String)', '295TMi44400000005942762421546108502
�
z
*
ParalcelParsingInputFormat
te Date,
I
�
!
STRING
d Tuple(UInt8)
vvvvvvvvvvvvvvvvvvvvvvvvvvvvvvvvvvvvvvvvvvvvvvvvvvvvvvvvvvvvTabSeparatedWithNamesAndTypes
d Date, a S)ring, x UInt32, y UInt64, z Float32
29TabSeparatevvvvvvvdRawWithNames
a UInt32
26TabSeparatedR,�b UInt32
26TabSeparatedRawWithNthNames
vvvvv
1
key U7878
'); (stage: Complete)
Top short messages:
c message_format_string substr(any(toValidUTF8(message)), 1, 120) min_length_without_exception_boilerplate
1. 18 Cannot TRUNCATE dictionary Code: 62. DB::Exception: Cannot TRUNCATE dictionary. (SYNTAX_ERROR) (version 24.8.14.10548.altinitytest (altinity build) 27
2. 16 {} ThreadFuzzer is enabled. Application will run slowly and unstable. 35
3. 5 Found {} on {} Found snapshot_15.bin.zstd on LocalSnapshotDisk 18
4. 2 Unknown setting '{}' Code: 115. DB::Exception: Unknown setting 'xxx_yyy'. (UNKNOWN_SETTING) (version 24.8.14.10548.altinitytest (altinity bui 27
5. 1 Creating {}: {} Creating table test_9.test2: CREATE TABLE IF NOT EXISTS test_9.test2 UUID '38205e7d-4f58-4f52-9ac3-4182288e513d' (`test` 197
Top messages by level:
(0.01647096428470701,'Cannot parse string {} as {}: syntax error {}') Error
(0.00007520988257857082,'{}') Warning
(0.00813676917146913,'Checking part {}') Information
(0.03656140416850774,'(from {}{}{}){}{} {} (stage: {})') Debug
(0.06023841532777407,'Checking existence of path: {}') Trace
2026-10-09 07:43:39,359 Stress test finished
+ echo -e 'Test script exit code\tOK\t\N\t'
+ rg -Fa 'No queries hung' /test_output/test_results.tsv
+ grep -Fa OK
No queries hung OK \N
+ stop_server
+ local max_tries=90
+ local check_hang=true
+ local pid
++ cat /var/run/clickhouse-server/clickhouse-server.pid
+ pid=2710
+ clickhouse stop --max-tries 90 --do-not-kill
/var/run/clickhouse-server/clickhouse-server.pid file exists and contains pid = 2710.
The process with pid = 2710 is running.
Sent terminate signal to process with pid 2710.
Waiting for server to stop
/var/run/clickhouse-server/clickhouse-server.pid file exists and contains pid = 2710.
The process with pid = 2710 is running.
Waiting for server to stop
/var/run/clickhouse-server/clickhouse-server.pid file exists and contains pid = 2710.
The process with pid = 2710 is running.
Waiting for server to stop
/var/run/clickhouse-server/clickhouse-server.pid file exists and contains pid = 2710.
The process with pid = 2710 is running.
Waiting for server to stop
/var/run/clickhouse-server/clickhouse-server.pid file exists and contains pid = 2710.
The process with pid = 2710 is running.
Waiting for server to stop
/var/run/clickhouse-server/clickhouse-server.pid file exists and contains pid = 2710.
The process with pid = 2710 is running.
Waiting for server to stop
/var/run/clickhouse-server/clickhouse-server.pid file exists and contains pid = 2710.
The process with pid = 2710 is running.
Waiting for server to stop
/var/run/clickhouse-server/clickhouse-server.pid file exists and contains pid = 2710.
The process with pid = 2710 is running.
Waiting for server to stop
/var/run/clickhouse-server/clickhouse-server.pid file exists and contains pid = 2710.
The process with pid = 2710 is running.
Waiting for server to stop
/var/run/clickhouse-server/clickhouse-server.pid file exists and contains pid = 2710.
The process with pid = 2710 does not exist.
Server stopped
+ return
+ mv /var/log/clickhouse-server/clickhouse-server.log /var/log/clickhouse-server/clickhouse-server.stress.log
+ unset THREAD_FUZZER_CPU_TIME_PERIOD_US THREAD_FUZZER_EXPLICIT_MEMORY_EXCEPTION_PROBABILITY THREAD_FUZZER_EXPLICIT_SLEEP_PROBABILITY THREAD_FUZZER_SLEEP_PROBABILITY THREAD_FUZZER_SLEEP_TIME_US_MAX THREAD_FUZZER_pthread_mutex_lock_AFTER_MIGRATE_PROBABILITY THREAD_FUZZER_pthread_mutex_lock_AFTER_SLEEP_PROBABILITY THREAD_FUZZER_pthread_mutex_lock_AFTER_SLEEP_TIME_US_MAX THREAD_FUZZER_pthread_mutex_lock_BEFORE_MIGRATE_PROBABILITY THREAD_FUZZER_pthread_mutex_lock_BEFORE_SLEEP_PROBABILITY THREAD_FUZZER_pthread_mutex_lock_BEFORE_SLEEP_TIME_US_MAX THREAD_FUZZER_pthread_mutex_unlock_AFTER_MIGRATE_PROBABILITY THREAD_FUZZER_pthread_mutex_unlock_AFTER_SLEEP_PROBABILITY THREAD_FUZZER_pthread_mutex_unlock_AFTER_SLEEP_TIME_US_MAX THREAD_FUZZER_pthread_mutex_unlock_BEFORE_MIGRATE_PROBABILITY THREAD_FUZZER_pthread_mutex_unlock_BEFORE_SLEEP_PROBABILITY THREAD_FUZZER_pthread_mutex_unlock_BEFORE_SLEEP_TIME_US_MAX THREAD_POOL_FAULT_INJECTION
+ start_server
+ counter=0
+ max_attempt=120
+ clickhouse-client --query 'SELECT 1'
Code: 210. DB::NetException: Connection refused (localhost:9000). (NETWORK_ERROR)
+ '[' 0 -gt 120 ']'
+ clickhouse start --user root
+ sleep 0.5
+ counter=1
+ clickhouse-client --query 'SELECT 1'
Code: 210. DB::NetException: Connection refused (localhost:9000). (NETWORK_ERROR)
+ '[' 1 -gt 120 ']'
+ clickhouse start --user root
+ sleep 0.5
+ counter=2
+ clickhouse-client --query 'SELECT 1'
Code: 210. DB::NetException: Connection refused (localhost:9000). (NETWORK_ERROR)
+ '[' 2 -gt 120 ']'
+ clickhouse start --user root
127.0.0.1 - - [09/Oct/2026:05:43:49 +0000] "GET /devstoreaccount1/cont?restype=container HTTP/1.1" 200 -
127.0.0.1 - - [09/Oct/2026:05:43:49 +0000] "PUT /devstoreaccount1/cont/bmwlhqpjlgaivxiiutmsxvluguupalkw HTTP/1.1" 201 -
127.0.0.1 - - [09/Oct/2026:05:43:49 +0000] "GET /devstoreaccount1/cont/bmwlhqpjlgaivxiiutmsxvluguupalkw HTTP/1.1" 206 4
127.0.0.1 - - [09/Oct/2026:05:43:49 +0000] "GET /devstoreaccount1/cont/bmwlhqpjlgaivxiiutmsxvluguupalkw HTTP/1.1" 206 2
127.0.0.1 - - [09/Oct/2026:05:43:49 +0000] "DELETE /devstoreaccount1/cont/bmwlhqpjlgaivxiiutmsxvluguupalkw HTTP/1.1" 202 -
+ sleep 0.5
+ counter=3
+ clickhouse-client --query 'SELECT 1'
Code: 210. DB::NetException: Connection refused (localhost:9000). (NETWORK_ERROR)
+ '[' 3 -gt 120 ']'
+ clickhouse start --user root
+ sleep 0.5
+ counter=4
+ clickhouse-client --query 'SELECT 1'
Code: 210. DB::NetException: Connection refused (localhost:9000). (NETWORK_ERROR)
+ '[' 4 -gt 120 ']'
+ clickhouse start --user root
+ sleep 0.5
127.0.0.1 - - [09/Oct/2026:05:43:51 +0000] "GET /devstoreaccount1/cont/pzytgrhezfapxlnvvldaeogrxftzvali HTTP/1.1" 206 1
+ counter=5
+ clickhouse-client --query 'SELECT 1'
1
+ attach_gdb_to_clickhouse
++ run_with_retry 5 clickhouse-client --query 'SELECT count() FROM system.build_options WHERE name = '\''CXX_FLAGS'\'' AND position('\''sanitize=address'\'' IN value)'
++ [[ hxB =~ e ]]
++ set_e=false
++ set +e
++ local total_retries=5
++ shift
++ local retry=0
++ '[' 0 -ge 5 ']'
++ clickhouse-client --query 'SELECT count() FROM system.build_options WHERE name = '\''CXX_FLAGS'\'' AND position('\''sanitize=address'\'' IN value)'
++ false
++ return
+ IS_ASAN=1
+ [[ 1 = \1 ]]
+ echo 'ASAN build detected. Not using gdb since it disables LeakSanitizer detections'
ASAN build detected. Not using gdb since it disables LeakSanitizer detections
+ check_server_start
+ clickhouse-client --query 'SELECT '\''Server successfully started'\'', '\''OK'\'', NULL, '\'''\'''
+ '[' -s /test_output/application_errors.txt ']'
+ rm /test_output/application_errors.txt
rm: cannot remove '/test_output/application_errors.txt': No such file or directory
+ stop_server
+ local max_tries=90
+ local check_hang=true
+ local pid
++ cat /var/run/clickhouse-server/clickhouse-server.pid
+ pid=23130
+ clickhouse stop --max-tries 90 --do-not-kill
/var/run/clickhouse-server/clickhouse-server.pid file exists and contains pid = 23130.
The process with pid = 23130 is running.
Sent terminate signal to process with pid 23130.
Waiting for server to stop
/var/run/clickhouse-server/clickhouse-server.pid file exists and contains pid = 23130.
The process with pid = 23130 is running.
Waiting for server to stop
/var/run/clickhouse-server/clickhouse-server.pid file exists and contains pid = 23130.
The process with pid = 23130 is running.
Waiting for server to stop
/var/run/clickhouse-server/clickhouse-server.pid file exists and contains pid = 23130.
The process with pid = 23130 is running.
Waiting for server to stop
/var/run/clickhouse-server/clickhouse-server.pid file exists and contains pid = 23130.
The process with pid = 23130 is running.
Waiting for server to stop
/var/run/clickhouse-server/clickhouse-server.pid file exists and contains pid = 23130.
The process with pid = 23130 is running.
Waiting for server to stop
/var/run/clickhouse-server/clickhouse-server.pid file exists and contains pid = 23130.
The process with pid = 23130 is running.
Waiting for server to stop
/var/run/clickhouse-server/clickhouse-server.pid file exists and contains pid = 23130.
The process with pid = 23130 is running.
Waiting for server to stop
/var/run/clickhouse-server/clickhouse-server.pid file exists and contains pid = 23130.
The process with pid = 23130 is running.
Waiting for server to stop
/var/run/clickhouse-server/clickhouse-server.pid file exists and contains pid = 23130.
The process with pid = 23130 is running.
Waiting for server to stop
/var/run/clickhouse-server/clickhouse-server.pid file exists and contains pid = 23130.
The process with pid = 23130 is running.
Waiting for server to stop
/var/run/clickhouse-server/clickhouse-server.pid file exists and contains pid = 23130.
The process with pid = 23130 is running.
Waiting for server to stop
Now there is no clickhouse-server process.
Server stopped
+ return
+ '[' -f /var/log/clickhouse-server/clickhouse-server.log ']'
+ '[' -f /var/log/clickhouse-server/stderr.log ']'
+ mv /var/log/clickhouse-server/clickhouse-server.log /var/log/clickhouse-server/clickhouse-server.final.log
+ check_logs_for_critical_errors
+ sed -n '/WARNING:.*anitizer/,/^$/p' /var/log/clickhouse-server/stderr.log
+ rg -Fav -e 'ASan doesn'\''t fully support makecontext/swapcontext functions' -e DB::Exception /test_output/tmp
+ echo -e 'No sanitizer asserts\tOK\t\N\t'
+ rm -f /test_output/tmp
+ rg -Fa ' Application: Child process was terminated by signal 9' /var/log/clickhouse-server/clickhouse-server.err.log /var/log/clickhouse-server/clickhouse-server.final.log /var/log/clickhouse-server/clickhouse-server.initial.log /var/log/clickhouse-server/clickhouse-server.stress.log
+ echo -e 'No OOM messages in clickhouse-server.log\tOK\t\N\t'
+ rg -Fa 'Code: 49. DB::Exception: ' /var/log/clickhouse-server/clickhouse-server.err.log /var/log/clickhouse-server/clickhouse-server.final.log /var/log/clickhouse-server/clickhouse-server.initial.log /var/log/clickhouse-server/clickhouse-server.stress.log
+ echo -e 'No logical errors\tOK\t\N\t'
+ '[' -s /test_output/logical_errors.txt ']'
+ rm /test_output/logical_errors.txt
+ rg --text 'Code: 499.*The specified key does not exist' /var/log/clickhouse-server/clickhouse-server.err.log /var/log/clickhouse-server/clickhouse-server.final.log /var/log/clickhouse-server/clickhouse-server.initial.log /var/log/clickhouse-server/clickhouse-server.stress.log
+ grep -v a.myext
+ echo -e 'No lost s3 keys\tOK\t\N\t'
+ rg -Fa 'it is lost forever' /var/log/clickhouse-server/clickhouse-server.err.log /var/log/clickhouse-server/clickhouse-server.final.log /var/log/clickhouse-server/clickhouse-server.initial.log /var/log/clickhouse-server/clickhouse-server.stress.log
+ grep SharedMergeTreePartCheckThread
+ echo -e 'No SharedMergeTree lost forever in clickhouse-server.log\tOK\t\N\t'
+ '[' -s /test_output/no_such_key_errors.txt ']'
+ rm /test_output/no_such_key_errors.txt
+ rg -Fa '########################################' /var/log/clickhouse-server/clickhouse-server.err.log /var/log/clickhouse-server/clickhouse-server.final.log /var/log/clickhouse-server/clickhouse-server.initial.log /var/log/clickhouse-server/clickhouse-server.stress.log
+ echo -e 'Not crashed\tOK\t\N\t'
+ rg -Fa ' ' /var/log/clickhouse-server/clickhouse-server.err.log /var/log/clickhouse-server/clickhouse-server.final.log /var/log/clickhouse-server/clickhouse-server.initial.log /var/log/clickhouse-server/clickhouse-server.stress.log
+ echo -e 'No fatal messages in clickhouse-server.log\tOK\t\N\t'
+ '[' -s /test_output/fatal_messages.txt ']'
+ rm /test_output/fatal_messages.txt
+ rg -Faz '########################################' /test_output/stress_run_logs.tar.zst /test_output/test_results.tsv
+ rg -v 'rg -Fa'
+ rg -Fa ' received signal ' /test_output/gdb.log
/test_output/gdb.log: No such file or directory (os error 2)
+ dmesg -T
+ grep -q -F -e 'Out of memory: Killed process' -e 'oom_reaper: reaped process' -e oom-kill:constraint=CONSTRAINT_NONE /test_output/dmesg.log
+ echo -e 'No OOM in dmesg\tOK\t\N\t'
+ tar -chf /test_output/coordination.tar /var/lib/clickhouse/coordination
tar: Removing leading `/' from member names
tar: Removing leading `/' from hard link targets
+ collect_query_and_trace_logs
+ for table in query_log trace_log metric_log
+ clickhouse-local --config-file=/etc/clickhouse-server/config.xml --only-system-tables -q 'select * from system.query_log format TSVWithNamesAndTypes'
+ zstd --threads=0
Logging trace to /var/log/clickhouse-server/clickhouse-server.log
Logging errors to /var/log/clickhouse-server/clickhouse-server.err.log
127.0.0.1 - - [09/Oct/2026:05:44:04 +0000] "GET /devstoreaccount1/cont?restype=container HTTP/1.1" 200 -
+ for table in query_log trace_log metric_log
+ zstd --threads=0
+ clickhouse-local --config-file=/etc/clickhouse-server/config.xml --only-system-tables -q 'select * from system.trace_log format TSVWithNamesAndTypes'
Logging trace to /var/log/clickhouse-server/clickhouse-server.log
Logging errors to /var/log/clickhouse-server/clickhouse-server.err.log
127.0.0.1 - - [09/Oct/2026:05:44:08 +0000] "GET /devstoreaccount1/cont?restype=container HTTP/1.1" 200 -
+ for table in query_log trace_log metric_log
+ clickhouse-local --config-file=/etc/clickhouse-server/config.xml --only-system-tables -q 'select * from system.metric_log format TSVWithNamesAndTypes'
+ zstd --threads=0
Logging trace to /var/log/clickhouse-server/clickhouse-server.log
Logging errors to /var/log/clickhouse-server/clickhouse-server.err.log
127.0.0.1 - - [09/Oct/2026:05:44:11 +0000] "GET /devstoreaccount1/cont?restype=container HTTP/1.1" 200 -
+ mv /var/log/clickhouse-server/stderr.log /test_output/
+ clickhouse-local --structure 'test String, res String, time Nullable(Float32), desc String' -q 'SELECT '\''failure'\'', test FROM table WHERE res != '\''OK'\'' order by
(test like '\''%Sanitizer%'\'') DESC,
(test like '\''%Killed by signal%'\'') DESC,
(test like '\''%gdb.log%'\'') DESC,
(test ilike '\''%possible deadlock%'\'') DESC,
(test like '\''%start%'\'') DESC,
(test like '\''%dmesg%'\'') DESC,
(test like '\''%OOM%'\'') DESC,
(test like '\''%Signal 9%'\'') DESC,
(test like '\''%Fatal message%'\'') DESC,
rowNumberInAllBlocks()
LIMIT 1'
+ '[' -s /test_output/check_status.tsv ']'
+ echo -e 'success\tNo errors found'
+ rg 'OOM in dmesg|Signal 9' /test_output/check_status.tsv
+ collect_core_dumps
+ find . -type f -maxdepth 1 -name 'core.*'
+ read -r core