+ ln -s /usr/share/clickhouse-test/ci/stress.py /usr/bin/stress
+ ln -s /usr/share/clickhouse-test/clickhouse-test /usr/bin/clickhouse-test
+ source /attach_gdb.lib
++ source /utils.lib
+++ sysctl kernel.core_pattern=core.%e.%p-%P
kernel.core_pattern = core.%e.%p-%P
+++ sysctl fs.suid_dumpable=1
fs.suid_dumpable = 1
+ source /stress_tests.lib
++ OK='\tOK\t\N\t'
++ FAIL='\tFAIL\t\N\t'
++ FAILURE_CONTEXT_LINES=100
++ FAILURE_CONTEXT_MAX_LINE_WIDTH=300
+ source /utils.lib
++ sysctl kernel.core_pattern=core.%e.%p-%P
kernel.core_pattern = core.%e.%p-%P
++ sysctl fs.suid_dumpable=1
fs.suid_dumpable = 1
+ install_packages package_folder
+ dpkg -i package_folder/clickhouse-common-static_24.8.14.10548.altinitytest_amd64.deb
Selecting previously unselected package clickhouse-common-static.
(Reading database ... 48695 files and directories currently installed.)
Preparing to unpack .../clickhouse-common-static_24.8.14.10548.altinitytest_amd64.deb ...
Unpacking clickhouse-common-static (24.8.14.10548.altinitytest) ...
Setting up clickhouse-common-static (24.8.14.10548.altinitytest) ...
+ dpkg -i package_folder/clickhouse-common-static-dbg_24.8.14.10548.altinitytest_amd64.deb
Selecting previously unselected package clickhouse-common-static-dbg.
(Reading database ... 48722 files and directories currently installed.)
Preparing to unpack .../clickhouse-common-static-dbg_24.8.14.10548.altinitytest_amd64.deb ...
Unpacking clickhouse-common-static-dbg (24.8.14.10548.altinitytest) ...
Setting up clickhouse-common-static-dbg (24.8.14.10548.altinitytest) ...
+ dpkg -i package_folder/clickhouse-server_24.8.14.10548.altinitytest_amd64.deb
Selecting previously unselected package clickhouse-server.
(Reading database ... 48729 files and directories currently installed.)
Preparing to unpack .../clickhouse-server_24.8.14.10548.altinitytest_amd64.deb ...
Unpacking clickhouse-server (24.8.14.10548.altinitytest) ...
Setting up clickhouse-server (24.8.14.10548.altinitytest) ...
ClickHouse binary is already located at /usr/bin/clickhouse
Symlink /usr/bin/clickhouse-server already exists but it points to /clickhouse. Will replace the old symlink to /usr/bin/clickhouse.
Creating symlink /usr/bin/clickhouse-server to /usr/bin/clickhouse.
Creating symlink /usr/bin/clickhouse-client to /usr/bin/clickhouse.
Creating symlink /usr/bin/clickhouse-local to /usr/bin/clickhouse.
Creating symlink /usr/bin/clickhouse-benchmark to /usr/bin/clickhouse.
Creating symlink /usr/bin/clickhouse-obfuscator to /usr/bin/clickhouse.
Creating symlink /usr/bin/clickhouse-git-import to /usr/bin/clickhouse.
Creating symlink /usr/bin/clickhouse-compressor to /usr/bin/clickhouse.
Creating symlink /usr/bin/clickhouse-format to /usr/bin/clickhouse.
Symlink /usr/bin/clickhouse-extract-from-config already exists but it points to /clickhouse. Will replace the old symlink to /usr/bin/clickhouse.
Creating symlink /usr/bin/clickhouse-extract-from-config to /usr/bin/clickhouse.
Symlink /usr/bin/clickhouse-keeper already exists but it points to /clickhouse. Will replace the old symlink to /usr/bin/clickhouse.
Creating symlink /usr/bin/clickhouse-keeper to /usr/bin/clickhouse.
Symlink /usr/bin/clickhouse-keeper-converter already exists but it points to /clickhouse. Will replace the old symlink to /usr/bin/clickhouse.
Creating symlink /usr/bin/clickhouse-keeper-converter to /usr/bin/clickhouse.
Creating symlink /usr/bin/clickhouse-disks to /usr/bin/clickhouse.
Creating symlink /usr/bin/ch to /usr/bin/clickhouse.
Creating symlink /usr/bin/chl to /usr/bin/clickhouse.
Creating symlink /usr/bin/chc to /usr/bin/clickhouse.
Creating clickhouse group if it does not exist.
groupadd -r clickhouse
Creating clickhouse user if it does not exist.
useradd -r --shell /bin/false --home-dir /nonexistent -g clickhouse clickhouse
Will set ulimits for clickhouse user in /etc/security/limits.d/clickhouse.conf.
Creating config directory /etc/clickhouse-server/config.d that is used for tweaks of main server configuration.
Creating config directory /etc/clickhouse-server/users.d that is used for tweaks of users configuration.
Config file /etc/clickhouse-server/config.xml already exists, will keep it and extract path info from it.
/etc/clickhouse-server/config.xml has /var/lib/clickhouse/ as data path.
/etc/clickhouse-server/config.xml has /var/log/clickhouse-server/ as log path.
Users config file /etc/clickhouse-server/users.xml already exists, will keep it and extract users info from it.
Log directory /var/log/clickhouse-server/ already exists.
Creating data directory /var/lib/clickhouse/.
Creating pid directory /var/run/clickhouse-server.
chown -R clickhouse:clickhouse '/var/log/clickhouse-server/'
chown -R clickhouse:clickhouse '/var/run/clickhouse-server'
chown clickhouse:clickhouse '/var/lib/clickhouse/'
Password for the default user is an empty string. See /etc/clickhouse-server/users.xml and /etc/clickhouse-server/users.d to change it.
Setting capabilities for clickhouse binary. This is optional.
chown -R clickhouse:clickhouse '/etc/clickhouse-server'
ClickHouse has been successfully installed.
Start clickhouse-server with:
sudo clickhouse start
Start clickhouse-client with:
clickhouse-client
+ dpkg -i package_folder/clickhouse-client_24.8.14.10548.altinitytest_amd64.deb
Selecting previously unselected package clickhouse-client.
(Reading database ... 48746 files and directories currently installed.)
Preparing to unpack .../clickhouse-client_24.8.14.10548.altinitytest_amd64.deb ...
Unpacking clickhouse-client (24.8.14.10548.altinitytest) ...
Setting up clickhouse-client (24.8.14.10548.altinitytest) ...
+ export THREAD_FUZZER_CPU_TIME_PERIOD_US=1000
+ THREAD_FUZZER_CPU_TIME_PERIOD_US=1000
+ export THREAD_FUZZER_SLEEP_PROBABILITY=0.1
+ THREAD_FUZZER_SLEEP_PROBABILITY=0.1
+ export THREAD_FUZZER_SLEEP_TIME_US_MAX=100000
+ THREAD_FUZZER_SLEEP_TIME_US_MAX=100000
+ export THREAD_FUZZER_pthread_mutex_lock_BEFORE_MIGRATE_PROBABILITY=1
+ THREAD_FUZZER_pthread_mutex_lock_BEFORE_MIGRATE_PROBABILITY=1
+ export THREAD_FUZZER_pthread_mutex_lock_AFTER_MIGRATE_PROBABILITY=1
+ THREAD_FUZZER_pthread_mutex_lock_AFTER_MIGRATE_PROBABILITY=1
+ export THREAD_FUZZER_pthread_mutex_unlock_BEFORE_MIGRATE_PROBABILITY=1
+ THREAD_FUZZER_pthread_mutex_unlock_BEFORE_MIGRATE_PROBABILITY=1
+ export THREAD_FUZZER_pthread_mutex_unlock_AFTER_MIGRATE_PROBABILITY=1
+ THREAD_FUZZER_pthread_mutex_unlock_AFTER_MIGRATE_PROBABILITY=1
+ export THREAD_FUZZER_pthread_mutex_lock_BEFORE_SLEEP_PROBABILITY=0.001
+ THREAD_FUZZER_pthread_mutex_lock_BEFORE_SLEEP_PROBABILITY=0.001
+ export THREAD_FUZZER_pthread_mutex_lock_AFTER_SLEEP_PROBABILITY=0.001
+ THREAD_FUZZER_pthread_mutex_lock_AFTER_SLEEP_PROBABILITY=0.001
+ export THREAD_FUZZER_pthread_mutex_unlock_BEFORE_SLEEP_PROBABILITY=0.001
+ THREAD_FUZZER_pthread_mutex_unlock_BEFORE_SLEEP_PROBABILITY=0.001
+ export THREAD_FUZZER_pthread_mutex_unlock_AFTER_SLEEP_PROBABILITY=0.001
+ THREAD_FUZZER_pthread_mutex_unlock_AFTER_SLEEP_PROBABILITY=0.001
+ export THREAD_FUZZER_pthread_mutex_lock_BEFORE_SLEEP_TIME_US_MAX=10000
+ THREAD_FUZZER_pthread_mutex_lock_BEFORE_SLEEP_TIME_US_MAX=10000
+ export THREAD_FUZZER_pthread_mutex_lock_AFTER_SLEEP_TIME_US_MAX=10000
+ THREAD_FUZZER_pthread_mutex_lock_AFTER_SLEEP_TIME_US_MAX=10000
+ export THREAD_FUZZER_pthread_mutex_unlock_BEFORE_SLEEP_TIME_US_MAX=10000
+ THREAD_FUZZER_pthread_mutex_unlock_BEFORE_SLEEP_TIME_US_MAX=10000
+ export THREAD_FUZZER_pthread_mutex_unlock_AFTER_SLEEP_TIME_US_MAX=10000
+ THREAD_FUZZER_pthread_mutex_unlock_AFTER_SLEEP_TIME_US_MAX=10000
+ export THREAD_FUZZER_EXPLICIT_SLEEP_PROBABILITY=0.01
+ THREAD_FUZZER_EXPLICIT_SLEEP_PROBABILITY=0.01
+ export THREAD_FUZZER_EXPLICIT_MEMORY_EXCEPTION_PROBABILITY=0.01
+ THREAD_FUZZER_EXPLICIT_MEMORY_EXCEPTION_PROBABILITY=0.01
+ export ZOOKEEPER_FAULT_INJECTION=1
+ ZOOKEEPER_FAULT_INJECTION=1
+ configure
+ export USE_DATABASE_ORDINARY=1
+ USE_DATABASE_ORDINARY=1
+ export EXPORT_S3_STORAGE_POLICIES=1
+ EXPORT_S3_STORAGE_POLICIES=1
+ /usr/share/clickhouse-test/config/install.sh
+ DEST_SERVER_PATH=/etc/clickhouse-server
+ DEST_CLIENT_PATH=/etc/clickhouse-client
+++ dirname /usr/share/clickhouse-test/config/install.sh
++ cd /usr/share/clickhouse-test/config
++ pwd -P
Going to install test configs from /usr/share/clickhouse-test/config into /etc/clickhouse-server
+ SRC_PATH=/usr/share/clickhouse-test/config
+ echo 'Going to install test configs from /usr/share/clickhouse-test/config into /etc/clickhouse-server'
+ mkdir -p /etc/clickhouse-server/config.d/
+ mkdir -p /etc/clickhouse-server/users.d/
+ mkdir -p /etc/clickhouse-client
+ ln -sf /usr/share/clickhouse-test/config/config.d/zookeeper_write.xml /etc/clickhouse-server/config.d/
+ ln -sf /usr/share/clickhouse-test/config/config.d/max_num_to_warn.xml /etc/clickhouse-server/config.d/
+ ln -sf /usr/share/clickhouse-test/config/config.d/listen.xml /etc/clickhouse-server/config.d/
+ ln -sf /usr/share/clickhouse-test/config/config.d/text_log.xml /etc/clickhouse-server/config.d/
+ ln -sf /usr/share/clickhouse-test/config/config.d/blob_storage_log.xml /etc/clickhouse-server/config.d/
+ ln -sf /usr/share/clickhouse-test/config/config.d/custom_settings_prefixes.xml /etc/clickhouse-server/config.d/
+ ln -sf /usr/share/clickhouse-test/config/config.d/database_catalog_drop_table_concurrency.xml /etc/clickhouse-server/config.d/
+ ln -sf /usr/share/clickhouse-test/config/config.d/enable_access_control_improvements.xml /etc/clickhouse-server/config.d/
+ ln -sf /usr/share/clickhouse-test/config/config.d/macros.xml /etc/clickhouse-server/config.d/
+ ln -sf /usr/share/clickhouse-test/config/config.d/secure_ports.xml /etc/clickhouse-server/config.d/
+ ln -sf /usr/share/clickhouse-test/config/config.d/clusters.xml /etc/clickhouse-server/config.d/
+ ln -sf /usr/share/clickhouse-test/config/config.d/graphite.xml /etc/clickhouse-server/config.d/
+ ln -sf /usr/share/clickhouse-test/config/config.d/graphite_alternative.xml /etc/clickhouse-server/config.d/
+ ln -sf /usr/share/clickhouse-test/config/config.d/grpc_protocol.xml /etc/clickhouse-server/config.d/
+ ln -sf /usr/share/clickhouse-test/config/config.d/database_atomic.xml /etc/clickhouse-server/config.d/
+ ln -sf /usr/share/clickhouse-test/config/config.d/max_concurrent_queries.xml /etc/clickhouse-server/config.d/
+ ln -sf /usr/share/clickhouse-test/config/config.d/merge_tree_settings.xml /etc/clickhouse-server/config.d/
+ ln -sf /usr/share/clickhouse-test/config/config.d/backoff_failed_mutation.xml /etc/clickhouse-server/config.d/
+ ln -sf /usr/share/clickhouse-test/config/config.d/merge_tree_old_dirs_cleanup.xml /etc/clickhouse-server/config.d/
+ ln -sf /usr/share/clickhouse-test/config/config.d/test_cluster_with_incorrect_pw.xml /etc/clickhouse-server/config.d/
+ ln -sf /usr/share/clickhouse-test/config/config.d/keeper_port.xml /etc/clickhouse-server/config.d/
+ ln -sf /usr/share/clickhouse-test/config/config.d/logging_no_rotate.xml /etc/clickhouse-server/config.d/
+ ln -sf /usr/share/clickhouse-test/config/config.d/merge_tree.xml /etc/clickhouse-server/config.d/
+ ln -sf /usr/share/clickhouse-test/config/config.d/lost_forever_check.xml /etc/clickhouse-server/config.d/
+ ln -sf /usr/share/clickhouse-test/config/config.d/tcp_with_proxy.xml /etc/clickhouse-server/config.d/
+ ln -sf /usr/share/clickhouse-test/config/config.d/prometheus.xml /etc/clickhouse-server/config.d/
+ ln -sf /usr/share/clickhouse-test/config/config.d/top_level_domains_lists.xml /etc/clickhouse-server/config.d/
+ ln -sf /usr/share/clickhouse-test/config/config.d/top_level_domains_path.xml /etc/clickhouse-server/config.d/
+ ln -sf /usr/share/clickhouse-test/config/config.d/transactions.xml /etc/clickhouse-server/config.d/
+ ln -sf /usr/share/clickhouse-test/config/config.d/encryption.xml /etc/clickhouse-server/config.d/
+ ln -sf /usr/share/clickhouse-test/config/config.d/CORS.xml /etc/clickhouse-server/config.d/
+ ln -sf /usr/share/clickhouse-test/config/config.d/zookeeper_log.xml /etc/clickhouse-server/config.d/
+ ln -sf /usr/share/clickhouse-test/config/config.d/logger_trace.xml /etc/clickhouse-server/config.d/
+ ln -sf /usr/share/clickhouse-test/config/config.d/named_collection.xml /etc/clickhouse-server/config.d/
+ ln -sf /usr/share/clickhouse-test/config/config.d/ssl_certs.xml /etc/clickhouse-server/config.d/
+ ln -sf /usr/share/clickhouse-test/config/config.d/filesystem_cache_log.xml /etc/clickhouse-server/config.d/
+ ln -sf /usr/share/clickhouse-test/config/config.d/session_log.xml /etc/clickhouse-server/config.d/
+ ln -sf /usr/share/clickhouse-test/config/config.d/system_unfreeze.xml /etc/clickhouse-server/config.d/
+ ln -sf /usr/share/clickhouse-test/config/config.d/enable_zero_copy_replication.xml /etc/clickhouse-server/config.d/
+ ln -sf /usr/share/clickhouse-test/config/config.d/nlp.xml /etc/clickhouse-server/config.d/
+ ln -sf /usr/share/clickhouse-test/config/config.d/forbidden_headers.xml /etc/clickhouse-server/config.d/
+ ln -sf /usr/share/clickhouse-test/config/config.d/enable_keeper_map.xml /etc/clickhouse-server/config.d/
+ ln -sf /usr/share/clickhouse-test/config/config.d/custom_disks_base_path.xml /etc/clickhouse-server/config.d/
+ ln -sf /usr/share/clickhouse-test/config/config.d/display_name.xml /etc/clickhouse-server/config.d/
+ ln -sf /usr/share/clickhouse-test/config/config.d/compressed_marks_and_index.xml /etc/clickhouse-server/config.d/
+ ln -sf /usr/share/clickhouse-test/config/config.d/disable_s3_env_credentials.xml /etc/clickhouse-server/config.d/
+ ln -sf /usr/share/clickhouse-test/config/config.d/enable_wait_for_shutdown_replicated_tables.xml /etc/clickhouse-server/config.d/
+ ln -sf /usr/share/clickhouse-test/config/config.d/backups.xml /etc/clickhouse-server/config.d/
+ ln -sf /usr/share/clickhouse-test/config/config.d/filesystem_caches_path.xml /etc/clickhouse-server/config.d/
+ ln -sf /usr/share/clickhouse-test/config/config.d/validate_tcp_client_information.xml /etc/clickhouse-server/config.d/
+ ln -sf /usr/share/clickhouse-test/config/config.d/zero_copy_destructive_operations.xml /etc/clickhouse-server/config.d/
+ ln -sf /usr/share/clickhouse-test/config/config.d/block_number.xml /etc/clickhouse-server/config.d/
+ ln -sf /usr/share/clickhouse-test/config/config.d/handlers.yaml /etc/clickhouse-server/config.d/
+ ln -sf /usr/share/clickhouse-test/config/config.d/serverwide_trace_collector.xml /etc/clickhouse-server/config.d/
+ ln -sf /usr/share/clickhouse-test/config/config.d/rocksdb.xml /etc/clickhouse-server/config.d/
+ '[' /etc/clickhouse-server = /etc/clickhouse-server ']'
+ ln -sf /usr/share/clickhouse-test/config/config.d/legacy_geobase.xml /etc/clickhouse-server/config.d/
+ ln -sf /usr/share/clickhouse-test/config/users.d/log_queries.xml /etc/clickhouse-server/users.d/
+ ln -sf /usr/share/clickhouse-test/config/users.d/readonly.xml /etc/clickhouse-server/users.d/
+ ln -sf /usr/share/clickhouse-test/config/users.d/access_management.xml /etc/clickhouse-server/users.d/
+ ln -sf /usr/share/clickhouse-test/config/users.d/database_atomic_drop_detach_sync.xml /etc/clickhouse-server/users.d/
+ ln -sf /usr/share/clickhouse-test/config/users.d/opentelemetry.xml /etc/clickhouse-server/users.d/
+ ln -sf /usr/share/clickhouse-test/config/users.d/remote_queries.xml /etc/clickhouse-server/users.d/
+ ln -sf /usr/share/clickhouse-test/config/users.d/session_log_test.xml /etc/clickhouse-server/users.d/
+ ln -sf /usr/share/clickhouse-test/config/users.d/memory_profiler.xml /etc/clickhouse-server/users.d/
+ ln -sf /usr/share/clickhouse-test/config/users.d/no_fsync_metadata.xml /etc/clickhouse-server/users.d/
+ ln -sf /usr/share/clickhouse-test/config/users.d/filelog.xml /etc/clickhouse-server/users.d/
+ ln -sf /usr/share/clickhouse-test/config/users.d/enable_blobs_check.xml /etc/clickhouse-server/users.d/
+ ln -sf /usr/share/clickhouse-test/config/users.d/marks.xml /etc/clickhouse-server/users.d/
+ ln -sf /usr/share/clickhouse-test/config/users.d/insert_keeper_retries.xml /etc/clickhouse-server/users.d/
+ ln -sf /usr/share/clickhouse-test/config/users.d/prefetch_settings.xml /etc/clickhouse-server/users.d/
+ ln -sf /usr/share/clickhouse-test/config/users.d/nonconst_timezone.xml /etc/clickhouse-server/users.d/
+ ln -sf /usr/share/clickhouse-test/config/users.d/allow_introspection_functions.yaml /etc/clickhouse-server/users.d/
+ ln -sf /usr/share/clickhouse-test/config/users.d/replicated_ddl_entry.xml /etc/clickhouse-server/users.d/
+ [[ -n '' ]]
+ ln -sf /usr/share/clickhouse-test/config/users.d/timeouts.xml /etc/clickhouse-server/users.d/
+ ln -sf /usr/share/clickhouse-test/config/ints_dictionary.xml /etc/clickhouse-server/
+ ln -sf /usr/share/clickhouse-test/config/strings_dictionary.xml /etc/clickhouse-server/
+ ln -sf /usr/share/clickhouse-test/config/decimals_dictionary.xml /etc/clickhouse-server/
+ ln -sf /usr/share/clickhouse-test/config/executable_dictionary.xml /etc/clickhouse-server/
+ ln -sf /usr/share/clickhouse-test/config/executable_pool_dictionary.xml /etc/clickhouse-server/
+ ln -sf /usr/share/clickhouse-test/config/test_function.xml /etc/clickhouse-server/
+ ln -sf /usr/share/clickhouse-test/config/top_level_domains /etc/clickhouse-server/
+ ln -sf /usr/share/clickhouse-test/config/regions_hierarchy.txt /etc/clickhouse-server/config.d/
+ ln -sf /usr/share/clickhouse-test/config/regions_names_en.txt /etc/clickhouse-server/config.d/
+ ln -sf /usr/share/clickhouse-test/config/ext-en.txt /etc/clickhouse-server/config.d/
+ ln -sf /usr/share/clickhouse-test/config/ext-ru.txt /etc/clickhouse-server/config.d/
+ ln -sf /usr/share/clickhouse-test/config/lem-en.bin /etc/clickhouse-server/config.d/
+ ln -sf /usr/share/clickhouse-test/config/server.key /etc/clickhouse-server/
+ ln -sf /usr/share/clickhouse-test/config/server.crt /etc/clickhouse-server/
+ ln -sf /usr/share/clickhouse-test/config/dhparam.pem /etc/clickhouse-server/
+ ln -sf --backup=simple --suffix=_original.xml /usr/share/clickhouse-test/config/config.d/query_masking_rules.xml /etc/clickhouse-server/config.d/
+ [[ -n 1 ]]
+ [[ 1 -eq 1 ]]
+ rm -f /etc/clickhouse-server/config.d/zookeeper.xml
+ ln -sf /usr/share/clickhouse-test/config/config.d/zookeeper_fault_injection.xml /etc/clickhouse-server/config.d/
+ [[ -n '' ]]
+ rm -f /etc/clickhouse-server/config.d/cannot_allocate_thread_injection.xml
+ value=1
+ sed --follow-symlinks -i 's|[01]|1|' /etc/clickhouse-server/config.d/keeper_port.xml
+ value=32991232
+ sed --follow-symlinks -i 's|[[:digit:]]\+|32991232|' /etc/clickhouse-server/config.d/keeper_port.xml
+ value=47108096
+ sed --follow-symlinks -i 's|[[:digit:]]\+|47108096|' /etc/clickhouse-server/config.d/keeper_port.xml
+ [[ -n '' ]]
+ [[ -n 1 ]]
+ [[ 1 -eq 1 ]]
+ ln -sf /usr/share/clickhouse-test/config/users.d/database_ordinary.xml /etc/clickhouse-server/users.d/
+ [[ '' == \1 ]]
+ [[ '' == \1 ]]
+ [[ -n 1 ]]
+ ln -sf /usr/share/clickhouse-test/config/config.d/azure_storage_conf.xml /etc/clickhouse-server/config.d/
+ ln -sf /usr/share/clickhouse-test/config/config.d/storage_conf.xml /etc/clickhouse-server/config.d/
+ ln -sf /usr/share/clickhouse-test/config/config.d/storage_conf_02944.xml /etc/clickhouse-server/config.d/
+ ln -sf /usr/share/clickhouse-test/config/config.d/storage_conf_02963.xml /etc/clickhouse-server/config.d/
+ ln -sf /usr/share/clickhouse-test/config/config.d/storage_conf_02961.xml /etc/clickhouse-server/config.d/
+ ln -sf /usr/share/clickhouse-test/config/users.d/s3_cache.xml /etc/clickhouse-server/users.d/
+ ln -sf /usr/share/clickhouse-test/config/users.d/s3_cache_new.xml /etc/clickhouse-server/users.d/
+ [[ -n '' ]]
+ ln -sf /usr/share/clickhouse-test/config/client_config.xml /etc/clickhouse-client/config.xml
+ sudo cat /etc/clickhouse-server/config.d/keeper_port.xml
+ sed 's|100000|10000|'
+ sudo mv /etc/clickhouse-server/config.d/keeper_port.xml.tmp /etc/clickhouse-server/config.d/keeper_port.xml
+ [[ -n 1 ]]
+ [[ 1 -eq 1 ]]
+ randomize_config_boolean_value filtered_list keeper_port
+ value=1
+ sudo cat /etc/clickhouse-server/config.d/keeper_port.xml
+ sed 's|[01]|1|'
+ sudo mv /etc/clickhouse-server/config.d/keeper_port.xml.tmp /etc/clickhouse-server/config.d/keeper_port.xml
+ randomize_config_boolean_value multi_read keeper_port
+ value=0
+ sudo cat /etc/clickhouse-server/config.d/keeper_port.xml
+ sed 's|[01]|0|'
+ sudo mv /etc/clickhouse-server/config.d/keeper_port.xml.tmp /etc/clickhouse-server/config.d/keeper_port.xml
+ randomize_config_boolean_value check_not_exists keeper_port
+ value=0
+ sudo cat /etc/clickhouse-server/config.d/keeper_port.xml
+ sed 's|[01]|0|'
+ sudo mv /etc/clickhouse-server/config.d/keeper_port.xml.tmp /etc/clickhouse-server/config.d/keeper_port.xml
+ randomize_config_boolean_value create_if_not_exists keeper_port
+ value=1
+ sudo cat /etc/clickhouse-server/config.d/keeper_port.xml
+ sed 's|[01]|1|'
+ sudo mv /etc/clickhouse-server/config.d/keeper_port.xml.tmp /etc/clickhouse-server/config.d/keeper_port.xml
+ sudo chown clickhouse /etc/clickhouse-server/config.d/keeper_port.xml
+ sudo chgrp clickhouse /etc/clickhouse-server/config.d/keeper_port.xml
+ [[ -n 1 ]]
+ [[ 1 -eq 1 ]]
+ randomize_config_boolean_value use_compression zookeeper_fault_injection
+ value=1
+ sudo cat /etc/clickhouse-server/config.d/zookeeper_fault_injection.xml
+ sed 's|[01]|1|'
+ sudo mv /etc/clickhouse-server/config.d/zookeeper_fault_injection.xml.tmp /etc/clickhouse-server/config.d/zookeeper_fault_injection.xml
+ randomize_config_boolean_value enable_block_number_column block_number
+ value=0
+ sudo cat /etc/clickhouse-server/config.d/block_number.xml
+ sed 's|[01]|0|'
+ sudo mv /etc/clickhouse-server/config.d/block_number.xml.tmp /etc/clickhouse-server/config.d/block_number.xml
+ randomize_config_boolean_value enable_block_offset_column block_number
+ value=1
+ sudo cat /etc/clickhouse-server/config.d/block_number.xml
+ sed 's|[01]|1|'
+ sudo mv /etc/clickhouse-server/config.d/block_number.xml.tmp /etc/clickhouse-server/config.d/block_number.xml
+ echo 'ASAN_OPTIONS='\''malloc_context_size=10 verbosity=1 allocator_release_to_os_interval_ms=10000'\'''
+ export 'ASAN_OPTIONS=malloc_context_size=10 allocator_release_to_os_interval_ms=10000'
+ ASAN_OPTIONS='malloc_context_size=10 allocator_release_to_os_interval_ms=10000'
+ sudo chown root: /var/lib/clickhouse
+ local total_mem
++ awk '/MemTotal/ { print $(NF-1) }' /proc/meminfo
+ total_mem=32080800
+ total_mem=32850739200
+ max_server_memory_usage_to_ram_ratio=0.5
+ echo 'Setting max_server_memory_usage_to_ram_ratio to 0.5'
+ cat
Setting max_server_memory_usage_to_ram_ratio to 0.5
+ local max_users_mem
+ max_users_mem=9855221760
+ echo 'Setting max_memory_usage_for_user=9855221760 and max_memory_usage for queries to 10G'
+ cat
Setting max_memory_usage_for_user=9855221760 and max_memory_usage for queries to 10G
+ cat
+ ./setup_minio.sh stateless
+ azurite-blob --blobHost 0.0.0.0 --blobPort 10000 --debug /azurite_log
+ export MINIO_ROOT_USER=clickhouse
+ MINIO_ROOT_USER=clickhouse
+ export MINIO_ROOT_PASSWORD=clickhouse
+ MINIO_ROOT_PASSWORD=clickhouse
+ main stateless
+ local query_dir
++ check_arg stateless
++ local query_dir
++ '[' '!' 1 -eq 1 ']'
++ case "$1" in
++ query_dir=0_stateless
++ echo 0_stateless
+ query_dir=0_stateless
+ '[' '!' -f ./minio ']'
+ start_minio
+ mkdir -p ./minio_data
+ ./minio --version
minio version RELEASE.2024-08-03T04-33-23Z (commit-id=6efb56851c40da88d1ca15112e2d686a4ecec6b3)
Runtime: go1.22.5 linux/amd64
License: GNU AGPLv3 - https://www.gnu.org/licenses/agpl-3.0.html
Copyright: 2015-2024 MinIO, Inc.
+ wait_for_it
+ local counter=0
+ local max_counter=60
+ local url=http://localhost:11111
+ params=('--silent' '--verbose')
+ local params
+ ./minio server --address :11111 ./minio_data
+ curl --silent --verbose http://localhost:11111
+ grep AccessDenied
trying to connect to minio
+ [[ 0 == \6\0 ]]
+ echo 'trying to connect to minio'
+ sleep 1
INFO: Formatting 1st pool, 1 set(s), 1 drives per set.
INFO: WARNING: Host local has more than 0 drives of set. A host failure will result in data becoming unavailable.
MinIO Object Storage Server
Copyright: 2015-2026 MinIO, Inc.
License: GNU AGPLv3 - https://www.gnu.org/licenses/agpl-3.0.html
Version: RELEASE.2024-08-03T04-33-23Z (go1.22.5 linux/amd64)
API: http://172.17.0.2:11111 http://127.0.0.1:11111
WebUI: http://172.17.0.2:46577 http://127.0.0.1:46577
Docs: https://min.io/docs/minio/linux/index.html
Azurite Blob service is starting on 0.0.0.0:10000
Azurite Blob service successfully listens on http://0.0.0.0:10000
+ counter=1
+ curl --silent --verbose http://localhost:11111
+ grep AccessDenied
AccessDeniedAccess Denied./18DA1C0985D6C0267dc7eb22d3288ec80374614e9088e31d3668a6922ead55932dd2a8e56373820f
+ lsof -i :11111
COMMAND PID USER FD TYPE DEVICE SIZE/OFF NODE NAME
minio 277 root 8u IPv6 34111 0t0 TCP *:11111 (LISTEN)
minio 277 root 9u IPv4 34110 0t0 TCP localhost:11111 (LISTEN)
minio 277 root 10u IPv6 34112 0t0 TCP localhost:11111 (LISTEN)
+ sleep 5
+ setup_minio stateless
+ local test_type=stateless
+ ./mc alias set clickminio http://localhost:11111 clickhouse clickhouse
Added `clickminio` successfully.
+ ./mc admin user add clickminio test testtest
Added user `test` successfully.
+ ./mc admin policy attach clickminio readwrite --user=test
Attached Policies: [readwrite]
To User: test
+ ./mc mb --ignore-existing clickminio/test
Bucket created successfully `clickminio/test`.
+ '[' stateless = stateless ']'
+ ./mc anonymous set public clickminio/test
Access permission for `clickminio/test` is set to `public`
+ upload_data 0_stateless /usr/share/clickhouse-test
+ local query_dir=0_stateless
+ local test_path=/usr/share/clickhouse-test
+ local data_path=/usr/share/clickhouse-test/queries/0_stateless/data_minio
+ '[' -d /usr/share/clickhouse-test/queries/0_stateless/data_minio ']'
+ ./mc cp --recursive /usr/share/clickhouse-test/queries/0_stateless/data_minio/ clickminio/test/
`/usr/share/clickhouse-test/queries/0_stateless/data_minio/03036_archive1.zip` -> `clickminio/test/03036_archive1.zip`
`/usr/share/clickhouse-test/queries/0_stateless/data_minio/02366_data.jsonl` -> `clickminio/test/02366_data.jsonl`
`/usr/share/clickhouse-test/queries/0_stateless/data_minio/02731.parquet` -> `clickminio/test/02731.parquet`
`/usr/share/clickhouse-test/queries/0_stateless/data_minio/03036_archive1.tar` -> `clickminio/test/03036_archive1.tar`
`/usr/share/clickhouse-test/queries/0_stateless/data_minio/02731.arrow` -> `clickminio/test/02731.arrow`
`/usr/share/clickhouse-test/queries/0_stateless/data_minio/02876.parquet` -> `clickminio/test/02876.parquet`
`/usr/share/clickhouse-test/queries/0_stateless/data_minio/03036_archive2.tar` -> `clickminio/test/03036_archive2.tar`
`/usr/share/clickhouse-test/queries/0_stateless/data_minio/03036_archive2.zip` -> `clickminio/test/03036_archive2.zip`
`/usr/share/clickhouse-test/queries/0_stateless/data_minio/03036_archive3.tar.gz` -> `clickminio/test/03036_archive3.tar.gz`
`/usr/share/clickhouse-test/queries/0_stateless/data_minio/03036_compressed_file_archive.zip` -> `clickminio/test/03036_compressed_file_archive.zip`
`/usr/share/clickhouse-test/queries/0_stateless/data_minio/03036_json_archive.zip` -> `clickminio/test/03036_json_archive.zip`
`/usr/share/clickhouse-test/queries/0_stateless/data_minio/a.tsv` -> `clickminio/test/a.tsv`
`/usr/share/clickhouse-test/queries/0_stateless/data_minio/b.tsv` -> `clickminio/test/b.tsv`
`/usr/share/clickhouse-test/queries/0_stateless/data_minio/c.tsv` -> `clickminio/test/c.tsv`
`/usr/share/clickhouse-test/queries/0_stateless/data_minio/hive_partitioning/column0=Elizabeth/column1=Gordon/sample.parquet` -> `clickminio/test/hive_partitioning/column0=Elizabeth/column1=Gordon/sample.parquet`
`/usr/share/clickhouse-test/queries/0_stateless/data_minio/hive_partitioning/column0=Elizabeth/column1=Schmidt/sample.parquet` -> `clickminio/test/hive_partitioning/column0=Elizabeth/column1=Schmidt/sample.parquet`
`/usr/share/clickhouse-test/queries/0_stateless/data_minio/hive_partitioning/column0=Elizabeth/sample.parquet` -> `clickminio/test/hive_partitioning/column0=Elizabeth/sample.parquet`
`/usr/share/clickhouse-test/queries/0_stateless/data_minio/hive_partitioning/non_existing_column=Elizabeth/sample.parquet` -> `clickminio/test/hive_partitioning/non_existing_column=Elizabeth/sample.parquet`
`/usr/share/clickhouse-test/queries/0_stateless/data_minio/json_data` -> `clickminio/test/json_data`
`/usr/share/clickhouse-test/queries/0_stateless/data_minio/tsv_with_header.tsv` -> `clickminio/test/tsv_with_header.tsv`
Total: 5.42 MiB, Transferred: 5.42 MiB, Speed: 102.92 MiB/s
+ setup_aws_credentials
+ local minio_root_user=clickhouse
+ local minio_root_password=clickhouse
+ mkdir -p /root/.aws
+ cat
+ config_logs_export_cluster /etc/clickhouse-server/config.d/system_logs_export.yaml
+ set +x
File /tmp/export-logs-config.sh does not exist, do not setup
+ export CLICKHOUSE_MAX_THREADS=8
+ CLICKHOUSE_MAX_THREADS=8
+ export CLICKHOUSE_MAX_CONCURRENT_QUERIES=4
+ CLICKHOUSE_MAX_CONCURRENT_QUERIES=4
+ start_server
+ counter=0
+ max_attempt=120
+ clickhouse-client --query 'SELECT 1'
Code: 210. DB::NetException: Connection refused (localhost:9000). (NETWORK_ERROR)
+ '[' 0 -gt 120 ']'
+ clickhouse start --user root
+ sleep 0.5
+ counter=1
+ clickhouse-client --query 'SELECT 1'
Code: 210. DB::NetException: Connection refused (localhost:9000). (NETWORK_ERROR)
+ '[' 1 -gt 120 ']'
+ clickhouse start --user root
+ sleep 0.5
+ counter=2
+ clickhouse-client --query 'SELECT 1'
Code: 210. DB::NetException: Connection refused (localhost:9000). (NETWORK_ERROR)
+ '[' 2 -gt 120 ']'
+ clickhouse start --user root
+ sleep 0.5
+ counter=3
+ clickhouse-client --query 'SELECT 1'
Code: 210. DB::NetException: Connection refused (localhost:9000). (NETWORK_ERROR)
+ '[' 3 -gt 120 ']'
+ clickhouse start --user root
+ sleep 0.5
+ counter=4
+ clickhouse-client --query 'SELECT 1'
Code: 210. DB::NetException: Connection refused (localhost:9000). (NETWORK_ERROR)
+ '[' 4 -gt 120 ']'
+ clickhouse start --user root
+ sleep 0.5
+ counter=5
+ clickhouse-client --query 'SELECT 1'
Code: 210. DB::NetException: Connection refused (localhost:9000). (NETWORK_ERROR)
+ '[' 5 -gt 120 ']'
+ clickhouse start --user root
+ sleep 0.5
+ counter=6
+ clickhouse-client --query 'SELECT 1'
Code: 210. DB::NetException: Connection refused (localhost:9000). (NETWORK_ERROR)
+ '[' 6 -gt 120 ']'
+ clickhouse start --user root
+ sleep 0.5
+ counter=7
+ clickhouse-client --query 'SELECT 1'
Code: 210. DB::NetException: Connection refused (localhost:9000). (NETWORK_ERROR)
+ '[' 7 -gt 120 ']'
+ clickhouse start --user root
+ sleep 0.5
+ counter=8
+ clickhouse-client --query 'SELECT 1'
Code: 210. DB::NetException: Connection refused (localhost:9000). (NETWORK_ERROR)
+ '[' 8 -gt 120 ']'
+ clickhouse start --user root
+ sleep 0.5
+ counter=9
+ clickhouse-client --query 'SELECT 1'
Code: 210. DB::NetException: Connection refused (localhost:9000). (NETWORK_ERROR)
+ '[' 9 -gt 120 ']'
+ clickhouse start --user root
+ sleep 0.5
+ counter=10
+ clickhouse-client --query 'SELECT 1'
Code: 210. DB::NetException: Connection refused (localhost:9000). (NETWORK_ERROR)
+ '[' 10 -gt 120 ']'
+ clickhouse start --user root
+ sleep 0.5
+ counter=11
+ clickhouse-client --query 'SELECT 1'
Code: 210. DB::NetException: Connection refused (localhost:9000). (NETWORK_ERROR)
+ '[' 11 -gt 120 ']'
+ clickhouse start --user root
+ sleep 0.5
+ counter=12
+ clickhouse-client --query 'SELECT 1'
Code: 210. DB::NetException: Connection refused (localhost:9000). (NETWORK_ERROR)
+ '[' 12 -gt 120 ']'
+ clickhouse start --user root
+ sleep 0.5
+ counter=13
+ clickhouse-client --query 'SELECT 1'
Code: 210. DB::NetException: Connection refused (localhost:9000). (NETWORK_ERROR)
+ '[' 13 -gt 120 ']'
+ clickhouse start --user root
+ sleep 0.5
+ counter=14
+ clickhouse-client --query 'SELECT 1'
Code: 210. DB::NetException: Connection refused (localhost:9000). (NETWORK_ERROR)
+ '[' 14 -gt 120 ']'
+ clickhouse start --user root
+ sleep 0.5
+ counter=15
+ clickhouse-client --query 'SELECT 1'
Code: 210. DB::NetException: Connection refused (localhost:9000). (NETWORK_ERROR)
+ '[' 15 -gt 120 ']'
+ clickhouse start --user root
+ sleep 0.5
+ counter=16
+ clickhouse-client --query 'SELECT 1'
Code: 210. DB::NetException: Connection refused (localhost:9000). (NETWORK_ERROR)
+ '[' 16 -gt 120 ']'
+ clickhouse start --user root
+ sleep 0.5
127.0.0.1 - - [30/Sep/2026:13:24:06 +0000] "GET /devstoreaccount1/cont?restype=container HTTP/1.1" 404 -
+ counter=17
+ clickhouse-client --query 'SELECT 1'
127.0.0.1 - - [30/Sep/2026:13:24:06 +0000] "PUT /devstoreaccount1/cont?restype=container HTTP/1.1" 201 -
127.0.0.1 - - [30/Sep/2026:13:24:06 +0000] "PUT /devstoreaccount1/cont/erqynmufkuxitmlplcnnrjjetmtfaocv HTTP/1.1" 201 -
127.0.0.1 - - [30/Sep/2026:13:24:06 +0000] "GET /devstoreaccount1/cont/erqynmufkuxitmlplcnnrjjetmtfaocv HTTP/1.1" 206 4
127.0.0.1 - - [30/Sep/2026:13:24:06 +0000] "GET /devstoreaccount1/cont/erqynmufkuxitmlplcnnrjjetmtfaocv HTTP/1.1" 206 2
127.0.0.1 - - [30/Sep/2026:13:24:06 +0000] "DELETE /devstoreaccount1/cont/erqynmufkuxitmlplcnnrjjetmtfaocv HTTP/1.1" 202 -
1
+ attach_gdb_to_clickhouse
++ run_with_retry 5 clickhouse-client --query 'SELECT count() FROM system.build_options WHERE name = '\''CXX_FLAGS'\'' AND position('\''sanitize=address'\'' IN value)'
++ [[ hxB =~ e ]]
++ set_e=false
++ set +e
++ local total_retries=5
++ shift
++ local retry=0
++ '[' 0 -ge 5 ']'
++ clickhouse-client --query 'SELECT count() FROM system.build_options WHERE name = '\''CXX_FLAGS'\'' AND position('\''sanitize=address'\'' IN value)'
++ false
++ return
+ IS_ASAN=0
+ [[ 0 = \1 ]]
++ kill -l SIGRTMIN
+ RTMIN=34
+ echo '
set follow-fork-mode parent
handle SIGHUP nostop noprint pass
handle SIGINT nostop noprint pass
handle SIGQUIT nostop noprint pass
handle SIGPIPE nostop noprint pass
handle SIGTERM nostop noprint pass
handle SIGUSR1 nostop noprint pass
handle SIGUSR2 nostop noprint pass
handle SIG34 nostop noprint pass
info signals
continue
backtrace full
info registers
p top' 1 KiB of the 'stack:
p/x *(uint64_t[128]*)$sp
maintenance info sections
thread apply all backtrace full
disassemble /s
up
disassemble /s
up
disassemble /s
p "done"
detach
quit
'
+ sleep 5
+ ts '%Y-%m-%d %H:%M:%S'
++ cat /var/run/clickhouse-server/clickhouse-server.pid
+ gdb -batch -command script.gdb -p 412
+ run_with_retry 60 clickhouse-client --query 'SELECT '\''Connected to clickhouse-server after attaching gdb'\'''
+ [[ hxB =~ e ]]
+ set_e=false
+ set +e
+ local total_retries=60
+ shift
+ local retry=0
+ '[' 0 -ge 60 ']'
+ clickhouse-client --query 'SELECT '\''Connected to clickhouse-server after attaching gdb'\'''
Connected to clickhouse-server after attaching gdb
+ false
+ return
+ setup_logs_replication
+ set +x
File /tmp/export-logs-config.sh does not exist, do not setup
+ clickhouse-client --query 'CREATE DATABASE datasets'
+ clickhouse-client --multiquery
+ clickhouse-client --query 'SHOW TABLES FROM datasets'
hits_v1
visits_v1
+ clickhouse-client --query 'CREATE DATABASE IF NOT EXISTS test'
+ stop_server
+ local max_tries=90
+ local check_hang=true
+ local pid
++ cat /var/run/clickhouse-server/clickhouse-server.pid
+ pid=412
+ clickhouse stop --max-tries 90 --do-not-kill
script.gdb:13: Error in sourced command file:
No stack.
/var/run/clickhouse-server/clickhouse-server.pid file exists and contains pid = 412.
The process with pid = 412 is running.
Sent terminate signal to process with pid 412.
Waiting for server to stop
/var/run/clickhouse-server/clickhouse-server.pid file exists and contains pid = 412.
The process with pid = 412 is running.
Waiting for server to stop
/var/run/clickhouse-server/clickhouse-server.pid file exists and contains pid = 412.
The process with pid = 412 is running.
Waiting for server to stop
/var/run/clickhouse-server/clickhouse-server.pid file exists and contains pid = 412.
The process with pid = 412 is running.
Waiting for server to stop
/var/run/clickhouse-server/clickhouse-server.pid file exists and contains pid = 412.
The process with pid = 412 is running.
Waiting for server to stop
/var/run/clickhouse-server/clickhouse-server.pid file exists and contains pid = 412.
The process with pid = 412 is running.
Waiting for server to stop
/var/run/clickhouse-server/clickhouse-server.pid file exists and contains pid = 412.
The process with pid = 412 is running.
Waiting for server to stop
/var/run/clickhouse-server/clickhouse-server.pid file exists and contains pid = 412.
The process with pid = 412 is running.
Waiting for server to stop
/var/run/clickhouse-server/clickhouse-server.pid file exists and contains pid = 412.
The process with pid = 412 is running.
Waiting for server to stop
/var/run/clickhouse-server/clickhouse-server.pid file exists and contains pid = 412.
The process with pid = 412 is running.
Waiting for server to stop
/var/run/clickhouse-server/clickhouse-server.pid file exists and contains pid = 412.
The process with pid = 412 is running.
Waiting for server to stop
/var/run/clickhouse-server/clickhouse-server.pid file exists and contains pid = 412.
The process with pid = 412 is running.
Waiting for server to stop
/var/run/clickhouse-server/clickhouse-server.pid file exists and contains pid = 412.
The process with pid = 412 is running.
Waiting for server to stop
/var/run/clickhouse-server/clickhouse-server.pid file exists and contains pid = 412.
The process with pid = 412 is running.
Waiting for server to stop
/var/run/clickhouse-server/clickhouse-server.pid file exists and contains pid = 412.
The process with pid = 412 is running.
Waiting for server to stop
/var/run/clickhouse-server/clickhouse-server.pid file exists and contains pid = 412.
The process with pid = 412 is running.
Waiting for server to stop
/var/run/clickhouse-server/clickhouse-server.pid file exists and contains pid = 412.
The process with pid = 412 is running.
Waiting for server to stop
/var/run/clickhouse-server/clickhouse-server.pid file exists and contains pid = 412.
The process with pid = 412 is running.
Waiting for server to stop
/var/run/clickhouse-server/clickhouse-server.pid file exists and contains pid = 412.
The process with pid = 412 is running.
Waiting for server to stop
/var/run/clickhouse-server/clickhouse-server.pid file exists and contains pid = 412.
The process with pid = 412 is running.
Waiting for server to stop
/var/run/clickhouse-server/clickhouse-server.pid file exists and contains pid = 412.
The process with pid = 412 is running.
Waiting for server to stop
Now there is no clickhouse-server process.
Server stopped
+ return
+ mv /var/log/clickhouse-server/clickhouse-server.log /var/log/clickhouse-server/clickhouse-server.initial.log
+ cache_policy=
+ '[' 0 -eq 1 ']'
+ cache_policy=LRU
+ echo 'Using cache policy: LRU'
+ '[' LRU = SLRU ']'
+ sudo cat /etc/clickhouse-server/users.d/stress_tests_overrides.xml
Using cache policy: LRU
cat: /etc/clickhouse-server/users.d/stress_tests_overrides.xml: No such file or directory
+ start_server
+ counter=0
+ max_attempt=120
+ clickhouse-client --query 'SELECT 1'
Code: 210. DB::NetException: Connection refused (localhost:9000). (NETWORK_ERROR)
+ '[' 0 -gt 120 ']'
+ clickhouse start --user root
+ sleep 0.5
+ counter=1
+ clickhouse-client --query 'SELECT 1'
Code: 210. DB::NetException: Connection refused (localhost:9000). (NETWORK_ERROR)
+ '[' 1 -gt 120 ']'
+ clickhouse start --user root
+ sleep 0.5
+ counter=2
+ clickhouse-client --query 'SELECT 1'
Code: 210. DB::NetException: Connection refused (localhost:9000). (NETWORK_ERROR)
+ '[' 2 -gt 120 ']'
+ clickhouse start --user root
+ sleep 0.5
+ counter=3
+ clickhouse-client --query 'SELECT 1'
Code: 210. DB::NetException: Connection refused (localhost:9000). (NETWORK_ERROR)
+ '[' 3 -gt 120 ']'
+ clickhouse start --user root
+ sleep 0.5
+ counter=4
+ clickhouse-client --query 'SELECT 1'
Code: 210. DB::NetException: Connection refused (localhost:9000). (NETWORK_ERROR)
+ '[' 4 -gt 120 ']'
+ clickhouse start --user root
+ sleep 0.5
+ counter=5
+ clickhouse-client --query 'SELECT 1'
Code: 210. DB::NetException: Connection refused (localhost:9000). (NETWORK_ERROR)
+ '[' 5 -gt 120 ']'
+ clickhouse start --user root
+ sleep 0.5
+ counter=6
+ clickhouse-client --query 'SELECT 1'
Code: 210. DB::NetException: Connection refused (localhost:9000). (NETWORK_ERROR)
+ '[' 6 -gt 120 ']'
+ clickhouse start --user root
+ sleep 0.5
+ counter=7
+ clickhouse-client --query 'SELECT 1'
Code: 210. DB::NetException: Connection refused (localhost:9000). (NETWORK_ERROR)
+ '[' 7 -gt 120 ']'
+ clickhouse start --user root
+ sleep 0.5
+ counter=8
+ clickhouse-client --query 'SELECT 1'
Code: 210. DB::NetException: Connection refused (localhost:9000). (NETWORK_ERROR)
+ '[' 8 -gt 120 ']'
+ clickhouse start --user root
+ sleep 0.5
+ counter=9
+ clickhouse-client --query 'SELECT 1'
Code: 210. DB::NetException: Connection refused (localhost:9000). (NETWORK_ERROR)
+ '[' 9 -gt 120 ']'
+ clickhouse start --user root
+ sleep 0.5
+ counter=10
+ clickhouse-client --query 'SELECT 1'
Code: 210. DB::NetException: Connection refused (localhost:9000). (NETWORK_ERROR)
+ '[' 10 -gt 120 ']'
+ clickhouse start --user root
+ sleep 0.5
127.0.0.1 - - [30/Sep/2026:13:25:10 +0000] "GET /devstoreaccount1/cont?restype=container HTTP/1.1" 200 -
127.0.0.1 - - [30/Sep/2026:13:25:10 +0000] "PUT /devstoreaccount1/cont/bphnwmxdwhacjiahuubhfybjlcxetcou HTTP/1.1" 201 -
127.0.0.1 - - [30/Sep/2026:13:25:10 +0000] "GET /devstoreaccount1/cont/bphnwmxdwhacjiahuubhfybjlcxetcou HTTP/1.1" 206 4
127.0.0.1 - - [30/Sep/2026:13:25:10 +0000] "GET /devstoreaccount1/cont/bphnwmxdwhacjiahuubhfybjlcxetcou HTTP/1.1" 206 2
127.0.0.1 - - [30/Sep/2026:13:25:10 +0000] "DELETE /devstoreaccount1/cont/bphnwmxdwhacjiahuubhfybjlcxetcou HTTP/1.1" 202 -
+ counter=11
+ clickhouse-client --query 'SELECT 1'
Code: 210. DB::NetException: Connection refused (localhost:9000). (NETWORK_ERROR)
+ '[' 11 -gt 120 ']'
+ clickhouse start --user root
+ sleep 0.5
+ counter=12
+ clickhouse-client --query 'SELECT 1'
Code: 210. DB::NetException: Connection refused (localhost:9000). (NETWORK_ERROR)
+ '[' 12 -gt 120 ']'
+ clickhouse start --user root
+ sleep 0.5
+ counter=13
+ clickhouse-client --query 'SELECT 1'
Code: 210. DB::NetException: Connection refused (localhost:9000). (NETWORK_ERROR)
+ '[' 13 -gt 120 ']'
+ clickhouse start --user root
+ sleep 0.5
+ counter=14
+ clickhouse-client --query 'SELECT 1'
Code: 210. DB::NetException: Connection refused (localhost:9000). (NETWORK_ERROR)
+ '[' 14 -gt 120 ']'
+ clickhouse start --user root
+ sleep 0.5
+ counter=15
+ clickhouse-client --query 'SELECT 1'
Code: 210. DB::NetException: Connection refused (localhost:9000). (NETWORK_ERROR)
+ '[' 15 -gt 120 ']'
+ clickhouse start --user root
+ sleep 0.5
+ counter=16
+ clickhouse-client --query 'SELECT 1'
Code: 210. DB::NetException: Connection refused (localhost:9000). (NETWORK_ERROR)
+ '[' 16 -gt 120 ']'
+ clickhouse start --user root
+ sleep 0.5
+ counter=17
+ clickhouse-client --query 'SELECT 1'
Code: 210. DB::NetException: Connection refused (localhost:9000). (NETWORK_ERROR)
+ '[' 17 -gt 120 ']'
+ clickhouse start --user root
+ sleep 0.5
+ counter=18
+ clickhouse-client --query 'SELECT 1'
Code: 210. DB::NetException: Connection refused (localhost:9000). (NETWORK_ERROR)
+ '[' 18 -gt 120 ']'
+ clickhouse start --user root
+ sleep 0.5
+ counter=19
+ clickhouse-client --query 'SELECT 1'
Code: 210. DB::NetException: Connection refused (localhost:9000). (NETWORK_ERROR)
+ '[' 19 -gt 120 ']'
+ clickhouse start --user root
+ sleep 0.5
+ counter=20
+ clickhouse-client --query 'SELECT 1'
Code: 210. DB::NetException: Connection refused (localhost:9000). (NETWORK_ERROR)
+ '[' 20 -gt 120 ']'
+ clickhouse start --user root
+ sleep 0.5
+ counter=21
+ clickhouse-client --query 'SELECT 1'
Code: 210. DB::NetException: Connection refused (localhost:9000). (NETWORK_ERROR)
+ '[' 21 -gt 120 ']'
+ clickhouse start --user root
+ sleep 0.5
+ counter=22
+ clickhouse-client --query 'SELECT 1'
Code: 210. DB::NetException: Connection refused (localhost:9000). (NETWORK_ERROR)
+ '[' 22 -gt 120 ']'
+ clickhouse start --user root
+ sleep 0.5
+ counter=23
+ clickhouse-client --query 'SELECT 1'
Code: 210. DB::NetException: Connection refused (localhost:9000). (NETWORK_ERROR)
+ '[' 23 -gt 120 ']'
+ clickhouse start --user root
+ sleep 0.5
+ counter=24
+ clickhouse-client --query 'SELECT 1'
Code: 210. DB::NetException: Connection refused (localhost:9000). (NETWORK_ERROR)
+ '[' 24 -gt 120 ']'
+ clickhouse start --user root
+ sleep 0.5
+ counter=25
+ clickhouse-client --query 'SELECT 1'
Code: 210. DB::NetException: Connection refused (localhost:9000). (NETWORK_ERROR)
+ '[' 25 -gt 120 ']'
+ clickhouse start --user root
+ sleep 0.5
+ counter=26
+ clickhouse-client --query 'SELECT 1'
Code: 210. DB::NetException: Connection refused (localhost:9000). (NETWORK_ERROR)
+ '[' 26 -gt 120 ']'
+ clickhouse start --user root
+ sleep 0.5
+ counter=27
+ clickhouse-client --query 'SELECT 1'
Code: 210. DB::NetException: Connection refused (localhost:9000). (NETWORK_ERROR)
+ '[' 27 -gt 120 ']'
+ clickhouse start --user root
+ sleep 0.5
+ counter=28
+ clickhouse-client --query 'SELECT 1'
Code: 210. DB::NetException: Connection refused (localhost:9000). (NETWORK_ERROR)
+ '[' 28 -gt 120 ']'
+ clickhouse start --user root
+ sleep 0.5
+ counter=29
+ clickhouse-client --query 'SELECT 1'
Code: 210. DB::NetException: Connection refused (localhost:9000). (NETWORK_ERROR)
+ '[' 29 -gt 120 ']'
+ clickhouse start --user root
+ sleep 0.5
+ counter=30
+ clickhouse-client --query 'SELECT 1'
1
+ attach_gdb_to_clickhouse
++ run_with_retry 5 clickhouse-client --query 'SELECT count() FROM system.build_options WHERE name = '\''CXX_FLAGS'\'' AND position('\''sanitize=address'\'' IN value)'
++ [[ hxB =~ e ]]
++ set_e=false
++ set +e
++ local total_retries=5
++ shift
++ local retry=0
++ '[' 0 -ge 5 ']'
++ clickhouse-client --query 'SELECT count() FROM system.build_options WHERE name = '\''CXX_FLAGS'\'' AND position('\''sanitize=address'\'' IN value)'
++ false
++ return
+ IS_ASAN=0
+ [[ 0 = \1 ]]
++ kill -l SIGRTMIN
+ RTMIN=34
+ echo '
set follow-fork-mode parent
handle SIGHUP nostop noprint pass
handle SIGINT nostop noprint pass
handle SIGQUIT nostop noprint pass
handle SIGPIPE nostop noprint pass
handle SIGTERM nostop noprint pass
handle SIGUSR1 nostop noprint pass
handle SIGUSR2 nostop noprint pass
handle SIG34 nostop noprint pass
info signals
continue
backtrace full
info registers
p top' 1 KiB of the 'stack:
p/x *(uint64_t[128]*)$sp
maintenance info sections
thread apply all backtrace full
disassemble /s
up
disassemble /s
up
disassemble /s
p "done"
detach
quit
'
+ sleep 5
+ ts '%Y-%m-%d %H:%M:%S'
++ cat /var/run/clickhouse-server/clickhouse-server.pid
+ gdb -batch -command script.gdb -p 1400
+ run_with_retry 60 clickhouse-client --query 'SELECT '\''Connected to clickhouse-server after attaching gdb'\'''
+ [[ hxB =~ e ]]
+ set_e=false
+ set +e
+ local total_retries=60
+ shift
+ local retry=0
+ '[' 0 -ge 60 ']'
+ clickhouse-client --query 'SELECT '\''Connected to clickhouse-server after attaching gdb'\'''
Connected to clickhouse-server after attaching gdb
+ false
+ return
+ clickhouse-client --query 'SHOW TABLES FROM datasets'
hits_v1
visits_v1
+ clickhouse-client --query 'SHOW TABLES FROM test'
+ [[ '' == \1 ]]
+ [[ '' == \1 ]]
+ TEMP_POLICY=default
+ clickhouse-client --query 'CREATE TABLE test.hits_s3 (WatchID UInt64, JavaEnable UInt8, Title String, GoodEvent Int16,
EventTime DateTime, EventDate Date, CounterID UInt32, ClientIP UInt32, ClientIP6 FixedString(16), RegionID UInt32,
UserID UInt64, CounterClass Int8, OS UInt8, UserAgent UInt8, URL String, Referer String, URLDomain String, RefererDomain String,
Refresh UInt8, IsRobot UInt8, RefererCategories Array(UInt16), URLCategories Array(UInt16), URLRegions Array(UInt32),
RefererRegions Array(UInt32), ResolutionWidth UInt16, ResolutionHeight UInt16, ResolutionDepth UInt8, FlashMajor UInt8,
FlashMinor UInt8, FlashMinor2 String, NetMajor UInt8, NetMinor UInt8, UserAgentMajor UInt16, UserAgentMinor FixedString(2),
CookieEnable UInt8, JavascriptEnable UInt8, IsMobile UInt8, MobilePhone UInt8, MobilePhoneModel String, Params String,
IPNetworkID UInt32, TraficSourceID Int8, SearchEngineID UInt16, SearchPhrase String, AdvEngineID UInt8, IsArtifical UInt8,
WindowClientWidth UInt16, WindowClientHeight UInt16, ClientTimeZone Int16, ClientEventTime DateTime, SilverlightVersion1 UInt8,
SilverlightVersion2 UInt8, SilverlightVersion3 UInt32, SilverlightVersion4 UInt16, PageCharset String, CodeVersion UInt32,
IsLink UInt8, IsDownload UInt8, IsNotBounce UInt8, FUniqID UInt64, HID UInt32, IsOldCounter UInt8, IsEvent UInt8,
IsParameter UInt8, DontCountHits UInt8, WithHash UInt8, HitColor FixedString(1), UTCEventTime DateTime, Age UInt8,
Sex UInt8, Income UInt8, Interests UInt16, Robotness UInt8, GeneralInterests Array(UInt16), RemoteIP UInt32,
RemoteIP6 FixedString(16), WindowName Int32, OpenerName Int32, HistoryLength Int16, BrowserLanguage FixedString(2),
BrowserCountry FixedString(2), SocialNetwork String, SocialAction String, HTTPError UInt16, SendTiming Int32,
DNSTiming Int32, ConnectTiming Int32, ResponseStartTiming Int32, ResponseEndTiming Int32, FetchTiming Int32,
RedirectTiming Int32, DOMInteractiveTiming Int32, DOMContentLoadedTiming Int32, DOMCompleteTiming Int32,
LoadEventStartTiming Int32, LoadEventEndTiming Int32, NSToDOMContentLoadedTiming Int32, FirstPaintTiming Int32,
RedirectCount Int8, SocialSourceNetworkID UInt8, SocialSourcePage String, ParamPrice Int64, ParamOrderID String,
ParamCurrency FixedString(3), ParamCurrencyID UInt16, GoalsReached Array(UInt32), OpenstatServiceName String,
OpenstatCampaignID String, OpenstatAdID String, OpenstatSourceID String, UTMSource String, UTMMedium String,
UTMCampaign String, UTMContent String, UTMTerm String, FromTag String, HasGCLID UInt8, RefererHash UInt64,
URLHash UInt64, CLID UInt32, YCLID UInt64, ShareService String, ShareURL String, ShareTitle String,
ParsedParams Nested(Key1 String, Key2 String, Key3 String, Key4 String, Key5 String, ValueDouble Float64),
IslandID FixedString(16), RequestNum UInt32, RequestTry UInt8) ENGINE = MergeTree() PARTITION BY toYYYYMM(EventDate)
ORDER BY (CounterID, EventDate, intHash32(UserID)) SAMPLE BY intHash32(UserID) SETTINGS index_granularity = 8192, storage_policy='\''default'\'''
+ clickhouse-client --query 'CREATE TABLE test.hits (WatchID UInt64, JavaEnable UInt8, Title String, GoodEvent Int16,
EventTime DateTime, EventDate Date, CounterID UInt32, ClientIP UInt32, ClientIP6 FixedString(16), RegionID UInt32,
UserID UInt64, CounterClass Int8, OS UInt8, UserAgent UInt8, URL String, Referer String, URLDomain String,
RefererDomain String, Refresh UInt8, IsRobot UInt8, RefererCategories Array(UInt16), URLCategories Array(UInt16),
URLRegions Array(UInt32), RefererRegions Array(UInt32), ResolutionWidth UInt16, ResolutionHeight UInt16, ResolutionDepth UInt8,
FlashMajor UInt8, FlashMinor UInt8, FlashMinor2 String, NetMajor UInt8, NetMinor UInt8, UserAgentMajor UInt16,
UserAgentMinor FixedString(2), CookieEnable UInt8, JavascriptEnable UInt8, IsMobile UInt8, MobilePhone UInt8,
MobilePhoneModel String, Params String, IPNetworkID UInt32, TraficSourceID Int8, SearchEngineID UInt16,
SearchPhrase String, AdvEngineID UInt8, IsArtifical UInt8, WindowClientWidth UInt16, WindowClientHeight UInt16,
ClientTimeZone Int16, ClientEventTime DateTime, SilverlightVersion1 UInt8, SilverlightVersion2 UInt8, SilverlightVersion3 UInt32,
SilverlightVersion4 UInt16, PageCharset String, CodeVersion UInt32, IsLink UInt8, IsDownload UInt8, IsNotBounce UInt8,
FUniqID UInt64, HID UInt32, IsOldCounter UInt8, IsEvent UInt8, IsParameter UInt8, DontCountHits UInt8, WithHash UInt8,
HitColor FixedString(1), UTCEventTime DateTime, Age UInt8, Sex UInt8, Income UInt8, Interests UInt16, Robotness UInt8,
GeneralInterests Array(UInt16), RemoteIP UInt32, RemoteIP6 FixedString(16), WindowName Int32, OpenerName Int32,
HistoryLength Int16, BrowserLanguage FixedString(2), BrowserCountry FixedString(2), SocialNetwork String, SocialAction String,
HTTPError UInt16, SendTiming Int32, DNSTiming Int32, ConnectTiming Int32, ResponseStartTiming Int32, ResponseEndTiming Int32,
FetchTiming Int32, RedirectTiming Int32, DOMInteractiveTiming Int32, DOMContentLoadedTiming Int32, DOMCompleteTiming Int32,
LoadEventStartTiming Int32, LoadEventEndTiming Int32, NSToDOMContentLoadedTiming Int32, FirstPaintTiming Int32,
RedirectCount Int8, SocialSourceNetworkID UInt8, SocialSourcePage String, ParamPrice Int64, ParamOrderID String,
ParamCurrency FixedString(3), ParamCurrencyID UInt16, GoalsReached Array(UInt32), OpenstatServiceName String,
OpenstatCampaignID String, OpenstatAdID String, OpenstatSourceID String, UTMSource String, UTMMedium String,
UTMCampaign String, UTMContent String, UTMTerm String, FromTag String, HasGCLID UInt8, RefererHash UInt64,
URLHash UInt64, CLID UInt32, YCLID UInt64, ShareService String, ShareURL String, ShareTitle String,
ParsedParams Nested(Key1 String, Key2 String, Key3 String, Key4 String, Key5 String, ValueDouble Float64),
IslandID FixedString(16), RequestNum UInt32, RequestTry UInt8) ENGINE = MergeTree() PARTITION BY toYYYYMM(EventDate)
ORDER BY (CounterID, EventDate, intHash32(UserID)) SAMPLE BY intHash32(UserID) SETTINGS index_granularity = 8192, storage_policy='\''default'\'''
+ clickhouse-client --query 'CREATE TABLE test.visits (CounterID UInt32, StartDate Date, Sign Int8, IsNew UInt8,
VisitID UInt64, UserID UInt64, StartTime DateTime, Duration UInt32, UTCStartTime DateTime, PageViews Int32,
Hits Int32, IsBounce UInt8, Referer String, StartURL String, RefererDomain String, StartURLDomain String,
EndURL String, LinkURL String, IsDownload UInt8, TraficSourceID Int8, SearchEngineID UInt16, SearchPhrase String,
AdvEngineID UInt8, PlaceID Int32, RefererCategories Array(UInt16), URLCategories Array(UInt16), URLRegions Array(UInt32),
RefererRegions Array(UInt32), IsYandex UInt8, GoalReachesDepth Int32, GoalReachesURL Int32, GoalReachesAny Int32,
SocialSourceNetworkID UInt8, SocialSourcePage String, MobilePhoneModel String, ClientEventTime DateTime, RegionID UInt32,
ClientIP UInt32, ClientIP6 FixedString(16), RemoteIP UInt32, RemoteIP6 FixedString(16), IPNetworkID UInt32,
SilverlightVersion3 UInt32, CodeVersion UInt32, ResolutionWidth UInt16, ResolutionHeight UInt16, UserAgentMajor UInt16,
UserAgentMinor UInt16, WindowClientWidth UInt16, WindowClientHeight UInt16, SilverlightVersion2 UInt8, SilverlightVersion4 UInt16,
FlashVersion3 UInt16, FlashVersion4 UInt16, ClientTimeZone Int16, OS UInt8, UserAgent UInt8, ResolutionDepth UInt8,
FlashMajor UInt8, FlashMinor UInt8, NetMajor UInt8, NetMinor UInt8, MobilePhone UInt8, SilverlightVersion1 UInt8,
Age UInt8, Sex UInt8, Income UInt8, JavaEnable UInt8, CookieEnable UInt8, JavascriptEnable UInt8, IsMobile UInt8,
BrowserLanguage UInt16, BrowserCountry UInt16, Interests UInt16, Robotness UInt8, GeneralInterests Array(UInt16),
Params Array(String), Goals Nested(ID UInt32, Serial UInt32, EventTime DateTime, Price Int64, OrderID String, CurrencyID UInt32),
WatchIDs Array(UInt64), ParamSumPrice Int64, ParamCurrency FixedString(3), ParamCurrencyID UInt16, ClickLogID UInt64,
ClickEventID Int32, ClickGoodEvent Int32, ClickEventTime DateTime, ClickPriorityID Int32, ClickPhraseID Int32, ClickPageID Int32,
ClickPlaceID Int32, ClickTypeID Int32, ClickResourceID Int32, ClickCost UInt32, ClickClientIP UInt32, ClickDomainID UInt32,
ClickURL String, ClickAttempt UInt8, ClickOrderID UInt32, ClickBannerID UInt32, ClickMarketCategoryID UInt32, ClickMarketPP UInt32,
ClickMarketCategoryName String, ClickMarketPPName String, ClickAWAPSCampaignName String, ClickPageName String, ClickTargetType UInt16,
ClickTargetPhraseID UInt64, ClickContextType UInt8, ClickSelectType Int8, ClickOptions String, ClickGroupBannerID Int32,
OpenstatServiceName String, OpenstatCampaignID String, OpenstatAdID String, OpenstatSourceID String, UTMSource String,
UTMMedium String, UTMCampaign String, UTMContent String, UTMTerm String, FromTag String, HasGCLID UInt8, FirstVisit DateTime,
PredLastVisit Date, LastVisit Date, TotalVisits UInt32, TraficSource Nested(ID Int8, SearchEngineID UInt16, AdvEngineID UInt8,
PlaceID UInt16, SocialSourceNetworkID UInt8, Domain String, SearchPhrase String, SocialSourcePage String), Attendance FixedString(16),
CLID UInt32, YCLID UInt64, NormalizedRefererHash UInt64, SearchPhraseHash UInt64, RefererDomainHash UInt64, NormalizedStartURLHash UInt64,
StartURLDomainHash UInt64, NormalizedEndURLHash UInt64, TopLevelDomain UInt64, URLScheme UInt64, OpenstatServiceNameHash UInt64,
OpenstatCampaignIDHash UInt64, OpenstatAdIDHash UInt64, OpenstatSourceIDHash UInt64, UTMSourceHash UInt64, UTMMediumHash UInt64,
UTMCampaignHash UInt64, UTMContentHash UInt64, UTMTermHash UInt64, FromHash UInt64, WebVisorEnabled UInt8, WebVisorActivity UInt32,
ParsedParams Nested(Key1 String, Key2 String, Key3 String, Key4 String, Key5 String, ValueDouble Float64),
Market Nested(Type UInt8, GoalID UInt32, OrderID String, OrderPrice Int64, PP UInt32, DirectPlaceID UInt32, DirectOrderID UInt32,
DirectBannerID UInt32, GoodID String, GoodName String, GoodQuantity Int32, GoodPrice Int64), IslandID FixedString(16))
ENGINE = CollapsingMergeTree(Sign) PARTITION BY toYYYYMM(StartDate) ORDER BY (CounterID, StartDate, intHash32(UserID), VisitID)
SAMPLE BY intHash32(UserID) SETTINGS index_granularity = 8192, storage_policy='\''default'\'''
+ clickhouse-client --query 'INSERT INTO test.hits_s3 SELECT * FROM datasets.hits_v1 SETTINGS enable_filesystem_cache_on_write_operations=0, max_insert_threads=16'
Received exception from server (version 24.8.14):
Code: 241. DB::Exception: Received from localhost:9000. DB::Exception: Memory limit (total) exceeded: would use 15.76 GiB (attempt to allocate chunk of 2228159 bytes), maximum: 15.30 GiB. OvercommitTracker decision: Query was selected to stop by OvercommitTracker.: (while reading column Referer): (while reading from part store/78e/78ebf6a1-d987-4579-b3ec-00c1a087b1f3/201403_1_1_2/ in table datasets.hits_v1 (78ebf6a1-d987-4579-b3ec-00c1a087b1f3) located on disk __tmp_internal_262634248876485800814430204900764312493 of type web, from mark 20 with max_rows_to_read = 8192): While executing MergeTreeSelect(pool: ReadPool, algorithm: Thread). (MEMORY_LIMIT_EXCEEDED)
(query: INSERT INTO test.hits_s3 SELECT * FROM datasets.hits_v1 SETTINGS enable_filesystem_cache_on_write_operations=0, max_insert_threads=16)
+ clickhouse-client --query 'INSERT INTO test.hits SELECT * FROM datasets.hits_v1 SETTINGS enable_filesystem_cache_on_write_operations=0, max_insert_threads=16'
Received exception from server (version 24.8.14):
Code: 241. DB::Exception: Received from localhost:9000. DB::Exception: Memory limit (total) exceeded: would use 17.63 GiB (attempt to allocate chunk of 1816664 bytes), maximum: 15.30 GiB. OvercommitTracker decision: Query was selected to stop by OvercommitTracker.: While executing MergeTreeSelect(pool: ReadPool, algorithm: Thread). (MEMORY_LIMIT_EXCEEDED)
(query: INSERT INTO test.hits SELECT * FROM datasets.hits_v1 SETTINGS enable_filesystem_cache_on_write_operations=0, max_insert_threads=16)
+ clickhouse-client --query 'INSERT INTO test.visits SELECT * FROM datasets.visits_v1 SETTINGS enable_filesystem_cache_on_write_operations=0, max_insert_threads=16'
+ clickhouse-client --query 'DROP TABLE datasets.visits_v1 SYNC'
+ clickhouse-client --query 'DROP TABLE datasets.hits_v1 SYNC'
+ clickhouse-client --query 'SHOW TABLES FROM test'
hits
hits_s3
visits
+ clickhouse-client --query 'SYSTEM STOP THREAD FUZZER'
+ stop_server
+ local max_tries=90
+ local check_hang=true
+ local pid
++ cat /var/run/clickhouse-server/clickhouse-server.pid
+ pid=1400
+ clickhouse stop --max-tries 90 --do-not-kill
script.gdb:13: Error in sourced command file:
No stack.
/var/run/clickhouse-server/clickhouse-server.pid file exists and contains pid = 1400.
The process with pid = 1400 is running.
Sent terminate signal to process with pid 1400.
Waiting for server to stop
/var/run/clickhouse-server/clickhouse-server.pid file exists and contains pid = 1400.
The process with pid = 1400 is running.
Waiting for server to stop
/var/run/clickhouse-server/clickhouse-server.pid file exists and contains pid = 1400.
The process with pid = 1400 is running.
Waiting for server to stop
/var/run/clickhouse-server/clickhouse-server.pid file exists and contains pid = 1400.
The process with pid = 1400 is running.
Waiting for server to stop
Now there is no clickhouse-server process.
Server stopped
+ return
+ export RANDOMIZE_OBJECT_KEY_TYPE=1
+ RANDOMIZE_OBJECT_KEY_TYPE=1
+ export ZOOKEEPER_FAULT_INJECTION=1
+ ZOOKEEPER_FAULT_INJECTION=1
+ export THREAD_POOL_FAULT_INJECTION=1
+ THREAD_POOL_FAULT_INJECTION=1
+ configure
+ export USE_DATABASE_ORDINARY=1
+ USE_DATABASE_ORDINARY=1
+ export EXPORT_S3_STORAGE_POLICIES=1
+ EXPORT_S3_STORAGE_POLICIES=1
+ /usr/share/clickhouse-test/config/install.sh
+ DEST_SERVER_PATH=/etc/clickhouse-server
+ DEST_CLIENT_PATH=/etc/clickhouse-client
+++ dirname /usr/share/clickhouse-test/config/install.sh
++ cd /usr/share/clickhouse-test/config
++ pwd -P
+ SRC_PATH=/usr/share/clickhouse-test/config
+ echo 'Going to install test configs from /usr/share/clickhouse-test/config into /etc/clickhouse-server'
+ mkdir -p /etc/clickhouse-server/config.d/
Going to install test configs from /usr/share/clickhouse-test/config into /etc/clickhouse-server
+ mkdir -p /etc/clickhouse-server/users.d/
+ mkdir -p /etc/clickhouse-client
+ ln -sf /usr/share/clickhouse-test/config/config.d/zookeeper_write.xml /etc/clickhouse-server/config.d/
+ ln -sf /usr/share/clickhouse-test/config/config.d/max_num_to_warn.xml /etc/clickhouse-server/config.d/
+ ln -sf /usr/share/clickhouse-test/config/config.d/listen.xml /etc/clickhouse-server/config.d/
+ ln -sf /usr/share/clickhouse-test/config/config.d/text_log.xml /etc/clickhouse-server/config.d/
+ ln -sf /usr/share/clickhouse-test/config/config.d/blob_storage_log.xml /etc/clickhouse-server/config.d/
+ ln -sf /usr/share/clickhouse-test/config/config.d/custom_settings_prefixes.xml /etc/clickhouse-server/config.d/
+ ln -sf /usr/share/clickhouse-test/config/config.d/database_catalog_drop_table_concurrency.xml /etc/clickhouse-server/config.d/
+ ln -sf /usr/share/clickhouse-test/config/config.d/enable_access_control_improvements.xml /etc/clickhouse-server/config.d/
+ ln -sf /usr/share/clickhouse-test/config/config.d/macros.xml /etc/clickhouse-server/config.d/
+ ln -sf /usr/share/clickhouse-test/config/config.d/secure_ports.xml /etc/clickhouse-server/config.d/
+ ln -sf /usr/share/clickhouse-test/config/config.d/clusters.xml /etc/clickhouse-server/config.d/
+ ln -sf /usr/share/clickhouse-test/config/config.d/graphite.xml /etc/clickhouse-server/config.d/
+ ln -sf /usr/share/clickhouse-test/config/config.d/graphite_alternative.xml /etc/clickhouse-server/config.d/
+ ln -sf /usr/share/clickhouse-test/config/config.d/grpc_protocol.xml /etc/clickhouse-server/config.d/
+ ln -sf /usr/share/clickhouse-test/config/config.d/database_atomic.xml /etc/clickhouse-server/config.d/
+ ln -sf /usr/share/clickhouse-test/config/config.d/max_concurrent_queries.xml /etc/clickhouse-server/config.d/
+ ln -sf /usr/share/clickhouse-test/config/config.d/merge_tree_settings.xml /etc/clickhouse-server/config.d/
+ ln -sf /usr/share/clickhouse-test/config/config.d/backoff_failed_mutation.xml /etc/clickhouse-server/config.d/
+ ln -sf /usr/share/clickhouse-test/config/config.d/merge_tree_old_dirs_cleanup.xml /etc/clickhouse-server/config.d/
+ ln -sf /usr/share/clickhouse-test/config/config.d/test_cluster_with_incorrect_pw.xml /etc/clickhouse-server/config.d/
+ ln -sf /usr/share/clickhouse-test/config/config.d/keeper_port.xml /etc/clickhouse-server/config.d/
+ ln -sf /usr/share/clickhouse-test/config/config.d/logging_no_rotate.xml /etc/clickhouse-server/config.d/
+ ln -sf /usr/share/clickhouse-test/config/config.d/merge_tree.xml /etc/clickhouse-server/config.d/
+ ln -sf /usr/share/clickhouse-test/config/config.d/lost_forever_check.xml /etc/clickhouse-server/config.d/
+ ln -sf /usr/share/clickhouse-test/config/config.d/tcp_with_proxy.xml /etc/clickhouse-server/config.d/
+ ln -sf /usr/share/clickhouse-test/config/config.d/prometheus.xml /etc/clickhouse-server/config.d/
+ ln -sf /usr/share/clickhouse-test/config/config.d/top_level_domains_lists.xml /etc/clickhouse-server/config.d/
+ ln -sf /usr/share/clickhouse-test/config/config.d/top_level_domains_path.xml /etc/clickhouse-server/config.d/
+ ln -sf /usr/share/clickhouse-test/config/config.d/transactions.xml /etc/clickhouse-server/config.d/
+ ln -sf /usr/share/clickhouse-test/config/config.d/encryption.xml /etc/clickhouse-server/config.d/
+ ln -sf /usr/share/clickhouse-test/config/config.d/CORS.xml /etc/clickhouse-server/config.d/
+ ln -sf /usr/share/clickhouse-test/config/config.d/zookeeper_log.xml /etc/clickhouse-server/config.d/
+ ln -sf /usr/share/clickhouse-test/config/config.d/logger_trace.xml /etc/clickhouse-server/config.d/
+ ln -sf /usr/share/clickhouse-test/config/config.d/named_collection.xml /etc/clickhouse-server/config.d/
+ ln -sf /usr/share/clickhouse-test/config/config.d/ssl_certs.xml /etc/clickhouse-server/config.d/
+ ln -sf /usr/share/clickhouse-test/config/config.d/filesystem_cache_log.xml /etc/clickhouse-server/config.d/
+ ln -sf /usr/share/clickhouse-test/config/config.d/session_log.xml /etc/clickhouse-server/config.d/
+ ln -sf /usr/share/clickhouse-test/config/config.d/system_unfreeze.xml /etc/clickhouse-server/config.d/
+ ln -sf /usr/share/clickhouse-test/config/config.d/enable_zero_copy_replication.xml /etc/clickhouse-server/config.d/
+ ln -sf /usr/share/clickhouse-test/config/config.d/nlp.xml /etc/clickhouse-server/config.d/
+ ln -sf /usr/share/clickhouse-test/config/config.d/forbidden_headers.xml /etc/clickhouse-server/config.d/
+ ln -sf /usr/share/clickhouse-test/config/config.d/enable_keeper_map.xml /etc/clickhouse-server/config.d/
+ ln -sf /usr/share/clickhouse-test/config/config.d/custom_disks_base_path.xml /etc/clickhouse-server/config.d/
+ ln -sf /usr/share/clickhouse-test/config/config.d/display_name.xml /etc/clickhouse-server/config.d/
+ ln -sf /usr/share/clickhouse-test/config/config.d/compressed_marks_and_index.xml /etc/clickhouse-server/config.d/
+ ln -sf /usr/share/clickhouse-test/config/config.d/disable_s3_env_credentials.xml /etc/clickhouse-server/config.d/
+ ln -sf /usr/share/clickhouse-test/config/config.d/enable_wait_for_shutdown_replicated_tables.xml /etc/clickhouse-server/config.d/
+ ln -sf /usr/share/clickhouse-test/config/config.d/backups.xml /etc/clickhouse-server/config.d/
+ ln -sf /usr/share/clickhouse-test/config/config.d/filesystem_caches_path.xml /etc/clickhouse-server/config.d/
+ ln -sf /usr/share/clickhouse-test/config/config.d/validate_tcp_client_information.xml /etc/clickhouse-server/config.d/
+ ln -sf /usr/share/clickhouse-test/config/config.d/zero_copy_destructive_operations.xml /etc/clickhouse-server/config.d/
+ ln -sf /usr/share/clickhouse-test/config/config.d/block_number.xml /etc/clickhouse-server/config.d/
+ ln -sf /usr/share/clickhouse-test/config/config.d/handlers.yaml /etc/clickhouse-server/config.d/
+ ln -sf /usr/share/clickhouse-test/config/config.d/serverwide_trace_collector.xml /etc/clickhouse-server/config.d/
+ ln -sf /usr/share/clickhouse-test/config/config.d/rocksdb.xml /etc/clickhouse-server/config.d/
+ '[' /etc/clickhouse-server = /etc/clickhouse-server ']'
+ ln -sf /usr/share/clickhouse-test/config/config.d/legacy_geobase.xml /etc/clickhouse-server/config.d/
+ ln -sf /usr/share/clickhouse-test/config/users.d/log_queries.xml /etc/clickhouse-server/users.d/
+ ln -sf /usr/share/clickhouse-test/config/users.d/readonly.xml /etc/clickhouse-server/users.d/
+ ln -sf /usr/share/clickhouse-test/config/users.d/access_management.xml /etc/clickhouse-server/users.d/
+ ln -sf /usr/share/clickhouse-test/config/users.d/database_atomic_drop_detach_sync.xml /etc/clickhouse-server/users.d/
+ ln -sf /usr/share/clickhouse-test/config/users.d/opentelemetry.xml /etc/clickhouse-server/users.d/
+ ln -sf /usr/share/clickhouse-test/config/users.d/remote_queries.xml /etc/clickhouse-server/users.d/
+ ln -sf /usr/share/clickhouse-test/config/users.d/session_log_test.xml /etc/clickhouse-server/users.d/
+ ln -sf /usr/share/clickhouse-test/config/users.d/memory_profiler.xml /etc/clickhouse-server/users.d/
+ ln -sf /usr/share/clickhouse-test/config/users.d/no_fsync_metadata.xml /etc/clickhouse-server/users.d/
+ ln -sf /usr/share/clickhouse-test/config/users.d/filelog.xml /etc/clickhouse-server/users.d/
+ ln -sf /usr/share/clickhouse-test/config/users.d/enable_blobs_check.xml /etc/clickhouse-server/users.d/
+ ln -sf /usr/share/clickhouse-test/config/users.d/marks.xml /etc/clickhouse-server/users.d/
+ ln -sf /usr/share/clickhouse-test/config/users.d/insert_keeper_retries.xml /etc/clickhouse-server/users.d/
+ ln -sf /usr/share/clickhouse-test/config/users.d/prefetch_settings.xml /etc/clickhouse-server/users.d/
+ ln -sf /usr/share/clickhouse-test/config/users.d/nonconst_timezone.xml /etc/clickhouse-server/users.d/
+ ln -sf /usr/share/clickhouse-test/config/users.d/allow_introspection_functions.yaml /etc/clickhouse-server/users.d/
+ ln -sf /usr/share/clickhouse-test/config/users.d/replicated_ddl_entry.xml /etc/clickhouse-server/users.d/
+ [[ -n '' ]]
+ ln -sf /usr/share/clickhouse-test/config/users.d/timeouts.xml /etc/clickhouse-server/users.d/
+ ln -sf /usr/share/clickhouse-test/config/ints_dictionary.xml /etc/clickhouse-server/
+ ln -sf /usr/share/clickhouse-test/config/strings_dictionary.xml /etc/clickhouse-server/
+ ln -sf /usr/share/clickhouse-test/config/decimals_dictionary.xml /etc/clickhouse-server/
+ ln -sf /usr/share/clickhouse-test/config/executable_dictionary.xml /etc/clickhouse-server/
+ ln -sf /usr/share/clickhouse-test/config/executable_pool_dictionary.xml /etc/clickhouse-server/
+ ln -sf /usr/share/clickhouse-test/config/test_function.xml /etc/clickhouse-server/
+ ln -sf /usr/share/clickhouse-test/config/top_level_domains /etc/clickhouse-server/
+ ln -sf /usr/share/clickhouse-test/config/regions_hierarchy.txt /etc/clickhouse-server/config.d/
+ ln -sf /usr/share/clickhouse-test/config/regions_names_en.txt /etc/clickhouse-server/config.d/
+ ln -sf /usr/share/clickhouse-test/config/ext-en.txt /etc/clickhouse-server/config.d/
+ ln -sf /usr/share/clickhouse-test/config/ext-ru.txt /etc/clickhouse-server/config.d/
+ ln -sf /usr/share/clickhouse-test/config/lem-en.bin /etc/clickhouse-server/config.d/
+ ln -sf /usr/share/clickhouse-test/config/server.key /etc/clickhouse-server/
+ ln -sf /usr/share/clickhouse-test/config/server.crt /etc/clickhouse-server/
+ ln -sf /usr/share/clickhouse-test/config/dhparam.pem /etc/clickhouse-server/
+ ln -sf --backup=simple --suffix=_original.xml /usr/share/clickhouse-test/config/config.d/query_masking_rules.xml /etc/clickhouse-server/config.d/
+ [[ -n 1 ]]
+ [[ 1 -eq 1 ]]
+ rm -f /etc/clickhouse-server/config.d/zookeeper.xml
+ ln -sf /usr/share/clickhouse-test/config/config.d/zookeeper_fault_injection.xml /etc/clickhouse-server/config.d/
+ [[ -n 1 ]]
+ [[ 1 -eq 1 ]]
+ ln -sf /usr/share/clickhouse-test/config/config.d/cannot_allocate_thread_injection.xml /etc/clickhouse-server/config.d/
+ value=0
+ sed --follow-symlinks -i 's|[01]|0|' /etc/clickhouse-server/config.d/keeper_port.xml
+ value=18896896
+ sed --follow-symlinks -i 's|[[:digit:]]\+|18896896|' /etc/clickhouse-server/config.d/keeper_port.xml
+ value=17248256
+ sed --follow-symlinks -i 's|[[:digit:]]\+|17248256|' /etc/clickhouse-server/config.d/keeper_port.xml
+ [[ -n '' ]]
+ [[ -n 1 ]]
+ [[ 1 -eq 1 ]]
+ ln -sf /usr/share/clickhouse-test/config/users.d/database_ordinary.xml /etc/clickhouse-server/users.d/
+ [[ '' == \1 ]]
+ [[ '' == \1 ]]
+ [[ -n 1 ]]
+ ln -sf /usr/share/clickhouse-test/config/config.d/azure_storage_conf.xml /etc/clickhouse-server/config.d/
+ ln -sf /usr/share/clickhouse-test/config/config.d/storage_conf.xml /etc/clickhouse-server/config.d/
+ ln -sf /usr/share/clickhouse-test/config/config.d/storage_conf_02944.xml /etc/clickhouse-server/config.d/
+ ln -sf /usr/share/clickhouse-test/config/config.d/storage_conf_02963.xml /etc/clickhouse-server/config.d/
+ ln -sf /usr/share/clickhouse-test/config/config.d/storage_conf_02961.xml /etc/clickhouse-server/config.d/
+ ln -sf /usr/share/clickhouse-test/config/users.d/s3_cache.xml /etc/clickhouse-server/users.d/
+ ln -sf /usr/share/clickhouse-test/config/users.d/s3_cache_new.xml /etc/clickhouse-server/users.d/
+ [[ -n '' ]]
+ ln -sf /usr/share/clickhouse-test/config/client_config.xml /etc/clickhouse-client/config.xml
+ sudo cat /etc/clickhouse-server/config.d/keeper_port.xml
+ sed 's|100000|10000|'
+ sudo mv /etc/clickhouse-server/config.d/keeper_port.xml.tmp /etc/clickhouse-server/config.d/keeper_port.xml
+ [[ -n 1 ]]
+ [[ 1 -eq 1 ]]
+ randomize_config_boolean_value filtered_list keeper_port
+ value=1
+ sudo cat /etc/clickhouse-server/config.d/keeper_port.xml
+ sed 's|[01]|1|'
+ sudo mv /etc/clickhouse-server/config.d/keeper_port.xml.tmp /etc/clickhouse-server/config.d/keeper_port.xml
+ randomize_config_boolean_value multi_read keeper_port
+ value=0
+ sed 's|[01]|0|'
+ sudo cat /etc/clickhouse-server/config.d/keeper_port.xml
+ sudo mv /etc/clickhouse-server/config.d/keeper_port.xml.tmp /etc/clickhouse-server/config.d/keeper_port.xml
+ randomize_config_boolean_value check_not_exists keeper_port
+ value=1
+ sudo cat /etc/clickhouse-server/config.d/keeper_port.xml
+ sed 's|[01]|1|'
+ sudo mv /etc/clickhouse-server/config.d/keeper_port.xml.tmp /etc/clickhouse-server/config.d/keeper_port.xml
+ randomize_config_boolean_value create_if_not_exists keeper_port
+ value=1
+ sudo cat /etc/clickhouse-server/config.d/keeper_port.xml
+ sed 's|[01]|1|'
+ sudo mv /etc/clickhouse-server/config.d/keeper_port.xml.tmp /etc/clickhouse-server/config.d/keeper_port.xml
+ sudo chown clickhouse /etc/clickhouse-server/config.d/keeper_port.xml
+ sudo chgrp clickhouse /etc/clickhouse-server/config.d/keeper_port.xml
+ [[ -n 1 ]]
+ [[ 1 -eq 1 ]]
+ randomize_config_boolean_value use_compression zookeeper_fault_injection
+ value=0
+ sudo cat /etc/clickhouse-server/config.d/zookeeper_fault_injection.xml
+ sed 's|[01]|0|'
+ sudo mv /etc/clickhouse-server/config.d/zookeeper_fault_injection.xml.tmp /etc/clickhouse-server/config.d/zookeeper_fault_injection.xml
+ randomize_config_boolean_value enable_block_number_column block_number
+ value=1
+ sudo cat /etc/clickhouse-server/config.d/block_number.xml
+ sed 's|[01]|1|'
+ sudo mv /etc/clickhouse-server/config.d/block_number.xml.tmp /etc/clickhouse-server/config.d/block_number.xml
+ randomize_config_boolean_value enable_block_offset_column block_number
+ value=1
+ sed 's|[01]|1|'
+ sudo cat /etc/clickhouse-server/config.d/block_number.xml
+ sudo mv /etc/clickhouse-server/config.d/block_number.xml.tmp /etc/clickhouse-server/config.d/block_number.xml
+ echo 'ASAN_OPTIONS='\''malloc_context_size=10 verbosity=1 allocator_release_to_os_interval_ms=10000'\'''
+ export 'ASAN_OPTIONS=malloc_context_size=10 allocator_release_to_os_interval_ms=10000'
+ ASAN_OPTIONS='malloc_context_size=10 allocator_release_to_os_interval_ms=10000'
+ sudo chown root: /var/lib/clickhouse
+ local total_mem
++ awk '/MemTotal/ { print $(NF-1) }' /proc/meminfo
+ total_mem=32080800
+ total_mem=32850739200
+ max_server_memory_usage_to_ram_ratio=0.5
Setting max_server_memory_usage_to_ram_ratio to 0.5
+ echo 'Setting max_server_memory_usage_to_ram_ratio to 0.5'
+ cat
Setting max_memory_usage_for_user=9855221760 and max_memory_usage for queries to 10G
+ local max_users_mem
+ max_users_mem=9855221760
+ echo 'Setting max_memory_usage_for_user=9855221760 and max_memory_usage for queries to 10G'
+ cat
+ cat
+ [[ '' == \1 ]]
+ [[ '' == \1 ]]
+ sudo cat /etc/clickhouse-server/config.d/logger_trace.xml
+ sed 's|trace|test|'
+ mv /etc/clickhouse-server/config.d/logger_trace.xml.tmp /etc/clickhouse-server/config.d/logger_trace.xml
+ '[' LRU = SLRU ']'
++ date +%-d
+ '[' 0 -eq 1 ']'
+ start_server
+ counter=0
+ max_attempt=120
+ clickhouse-client --query 'SELECT 1'
Code: 210. DB::NetException: Connection refused (localhost:9000). (NETWORK_ERROR)
+ '[' 0 -gt 120 ']'
+ clickhouse start --user root
+ sleep 0.5
+ counter=1
+ clickhouse-client --query 'SELECT 1'
Code: 210. DB::NetException: Connection refused (localhost:9000). (NETWORK_ERROR)
+ '[' 1 -gt 120 ']'
+ clickhouse start --user root
+ sleep 0.5
+ counter=2
+ clickhouse-client --query 'SELECT 1'
Code: 210. DB::NetException: Connection refused (localhost:9000). (NETWORK_ERROR)
+ '[' 2 -gt 120 ']'
+ clickhouse start --user root
+ sleep 0.5
+ counter=3
+ clickhouse-client --query 'SELECT 1'
Code: 210. DB::NetException: Connection refused (localhost:9000). (NETWORK_ERROR)
+ '[' 3 -gt 120 ']'
+ clickhouse start --user root
+ sleep 0.5
+ counter=4
+ clickhouse-client --query 'SELECT 1'
Code: 210. DB::NetException: Connection refused (localhost:9000). (NETWORK_ERROR)
+ '[' 4 -gt 120 ']'
+ clickhouse start --user root
+ sleep 0.5
+ counter=5
+ clickhouse-client --query 'SELECT 1'
Code: 210. DB::NetException: Connection refused (localhost:9000). (NETWORK_ERROR)
+ '[' 5 -gt 120 ']'
+ clickhouse start --user root
+ sleep 0.5
+ counter=6
+ clickhouse-client --query 'SELECT 1'
Code: 210. DB::NetException: Connection refused (localhost:9000). (NETWORK_ERROR)
+ '[' 6 -gt 120 ']'
+ clickhouse start --user root
+ sleep 0.5
+ counter=7
+ clickhouse-client --query 'SELECT 1'
Code: 210. DB::NetException: Connection refused (localhost:9000). (NETWORK_ERROR)
+ '[' 7 -gt 120 ']'
+ clickhouse start --user root
+ sleep 0.5
+ counter=8
+ clickhouse-client --query 'SELECT 1'
Code: 210. DB::NetException: Connection refused (localhost:9000). (NETWORK_ERROR)
+ '[' 8 -gt 120 ']'
+ clickhouse start --user root
+ sleep 0.5
+ counter=9
+ clickhouse-client --query 'SELECT 1'
Code: 210. DB::NetException: Connection refused (localhost:9000). (NETWORK_ERROR)
+ '[' 9 -gt 120 ']'
+ clickhouse start --user root
+ sleep 0.5
+ counter=10
+ clickhouse-client --query 'SELECT 1'
Code: 210. DB::NetException: Connection refused (localhost:9000). (NETWORK_ERROR)
+ '[' 10 -gt 120 ']'
+ clickhouse start --user root
+ sleep 0.5
+ counter=11
+ clickhouse-client --query 'SELECT 1'
Code: 210. DB::NetException: Connection refused (localhost:9000). (NETWORK_ERROR)
+ '[' 11 -gt 120 ']'
+ clickhouse start --user root
+ sleep 0.5
127.0.0.1 - - [30/Sep/2026:13:28:54 +0000] "GET /devstoreaccount1/cont?restype=container HTTP/1.1" 200 -
127.0.0.1 - - [30/Sep/2026:13:28:54 +0000] "PUT /devstoreaccount1/cont/niacutqjgxqudekqksukouuvxhpjsigw HTTP/1.1" 201 -
127.0.0.1 - - [30/Sep/2026:13:28:54 +0000] "GET /devstoreaccount1/cont/niacutqjgxqudekqksukouuvxhpjsigw HTTP/1.1" 206 4
127.0.0.1 - - [30/Sep/2026:13:28:54 +0000] "GET /devstoreaccount1/cont/niacutqjgxqudekqksukouuvxhpjsigw HTTP/1.1" 206 2
127.0.0.1 - - [30/Sep/2026:13:28:54 +0000] "DELETE /devstoreaccount1/cont/niacutqjgxqudekqksukouuvxhpjsigw HTTP/1.1" 202 -
+ counter=12
+ clickhouse-client --query 'SELECT 1'
Code: 210. DB::NetException: Connection refused (localhost:9000). (NETWORK_ERROR)
+ '[' 12 -gt 120 ']'
+ clickhouse start --user root
+ sleep 0.5
+ counter=13
+ clickhouse-client --query 'SELECT 1'
Code: 210. DB::NetException: Connection refused (localhost:9000). (NETWORK_ERROR)
+ '[' 13 -gt 120 ']'
+ clickhouse start --user root
+ sleep 0.5
+ counter=14
+ clickhouse-client --query 'SELECT 1'
Code: 210. DB::NetException: Connection refused (localhost:9000). (NETWORK_ERROR)
+ '[' 14 -gt 120 ']'
+ clickhouse start --user root
+ sleep 0.5
+ counter=15
+ clickhouse-client --query 'SELECT 1'
Code: 210. DB::NetException: Connection refused (localhost:9000). (NETWORK_ERROR)
+ '[' 15 -gt 120 ']'
+ clickhouse start --user root
+ sleep 0.5
+ counter=16
+ clickhouse-client --query 'SELECT 1'
Code: 210. DB::NetException: Connection refused (localhost:9000). (NETWORK_ERROR)
+ '[' 16 -gt 120 ']'
+ clickhouse start --user root
+ sleep 0.5
+ counter=17
+ clickhouse-client --query 'SELECT 1'
Code: 210. DB::NetException: Connection refused (localhost:9000). (NETWORK_ERROR)
+ '[' 17 -gt 120 ']'
+ clickhouse start --user root
+ sleep 0.5
+ counter=18
+ clickhouse-client --query 'SELECT 1'
Code: 210. DB::NetException: Connection refused (localhost:9000). (NETWORK_ERROR)
+ '[' 18 -gt 120 ']'
+ clickhouse start --user root
+ sleep 0.5
+ counter=19
+ clickhouse-client --query 'SELECT 1'
Code: 210. DB::NetException: Connection refused (localhost:9000). (NETWORK_ERROR)
+ '[' 19 -gt 120 ']'
+ clickhouse start --user root
+ sleep 0.5
+ counter=20
+ clickhouse-client --query 'SELECT 1'
Code: 210. DB::NetException: Connection refused (localhost:9000). (NETWORK_ERROR)
+ '[' 20 -gt 120 ']'
+ clickhouse start --user root
+ sleep 0.5
+ counter=21
+ clickhouse-client --query 'SELECT 1'
Code: 210. DB::NetException: Connection refused (localhost:9000). (NETWORK_ERROR)
+ '[' 21 -gt 120 ']'
+ clickhouse start --user root
+ sleep 0.5
+ counter=22
+ clickhouse-client --query 'SELECT 1'
Code: 210. DB::NetException: Connection refused (localhost:9000). (NETWORK_ERROR)
+ '[' 22 -gt 120 ']'
+ clickhouse start --user root
+ sleep 0.5
+ counter=23
+ clickhouse-client --query 'SELECT 1'
Code: 210. DB::NetException: Connection refused (localhost:9000). (NETWORK_ERROR)
+ '[' 23 -gt 120 ']'
+ clickhouse start --user root
+ sleep 0.5
+ counter=24
+ clickhouse-client --query 'SELECT 1'
Code: 210. DB::NetException: Connection refused (localhost:9000). (NETWORK_ERROR)
+ '[' 24 -gt 120 ']'
+ clickhouse start --user root
+ sleep 0.5
+ counter=25
+ clickhouse-client --query 'SELECT 1'
Code: 210. DB::NetException: Connection refused (localhost:9000). (NETWORK_ERROR)
+ '[' 25 -gt 120 ']'
+ clickhouse start --user root
+ sleep 0.5
+ counter=26
+ clickhouse-client --query 'SELECT 1'
Code: 210. DB::NetException: Connection refused (localhost:9000). (NETWORK_ERROR)
+ '[' 26 -gt 120 ']'
+ clickhouse start --user root
+ sleep 0.5
+ counter=27
+ clickhouse-client --query 'SELECT 1'
Code: 210. DB::NetException: Connection refused (localhost:9000). (NETWORK_ERROR)
+ '[' 27 -gt 120 ']'
+ clickhouse start --user root
+ sleep 0.5
+ counter=28
+ clickhouse-client --query 'SELECT 1'
Code: 210. DB::NetException: Connection refused (localhost:9000). (NETWORK_ERROR)
+ '[' 28 -gt 120 ']'
+ clickhouse start --user root
+ sleep 0.5
+ counter=29
+ clickhouse-client --query 'SELECT 1'
Code: 210. DB::NetException: Connection refused (localhost:9000). (NETWORK_ERROR)
+ '[' 29 -gt 120 ']'
+ clickhouse start --user root
+ sleep 0.5
+ counter=30
+ clickhouse-client --query 'SELECT 1'
1
+ attach_gdb_to_clickhouse
++ run_with_retry 5 clickhouse-client --query 'SELECT count() FROM system.build_options WHERE name = '\''CXX_FLAGS'\'' AND position('\''sanitize=address'\'' IN value)'
++ [[ hxB =~ e ]]
++ set_e=false
++ set +e
++ local total_retries=5
++ shift
++ local retry=0
++ '[' 0 -ge 5 ']'
++ clickhouse-client --query 'SELECT count() FROM system.build_options WHERE name = '\''CXX_FLAGS'\'' AND position('\''sanitize=address'\'' IN value)'
Received exception from server (version 24.8.14):
Code: 439. DB::Exception: Received from localhost:9000. DB::Exception: Cannot schedule a task: fault injected (threads=7, jobs=7). (CANNOT_SCHEDULE_TASK)
(query: SELECT count() FROM system.build_options WHERE name = 'CXX_FLAGS' AND position('sanitize=address' IN value))
++ retry=1
++ sleep 5
++ '[' 1 -ge 5 ']'
++ clickhouse-client --query 'SELECT count() FROM system.build_options WHERE name = '\''CXX_FLAGS'\'' AND position('\''sanitize=address'\'' IN value)'
++ false
++ return
+ IS_ASAN=0
+ [[ 0 = \1 ]]
++ kill -l SIGRTMIN
+ RTMIN=34
+ echo '
set follow-fork-mode parent
handle SIGHUP nostop noprint pass
handle SIGINT nostop noprint pass
handle SIGQUIT nostop noprint pass
handle SIGPIPE nostop noprint pass
handle SIGTERM nostop noprint pass
handle SIGUSR1 nostop noprint pass
handle SIGUSR2 nostop noprint pass
handle SIG34 nostop noprint pass
info signals
continue
backtrace full
info registers
p top' 1 KiB of the 'stack:
p/x *(uint64_t[128]*)$sp
maintenance info sections
thread apply all backtrace full
disassemble /s
up
disassemble /s
up
disassemble /s
p "done"
detach
quit
'
+ sleep 5
+ ts '%Y-%m-%d %H:%M:%S'
++ cat /var/run/clickhouse-server/clickhouse-server.pid
+ gdb -batch -command script.gdb -p 2985
+ run_with_retry 60 clickhouse-client --query 'SELECT '\''Connected to clickhouse-server after attaching gdb'\'''
+ [[ hxB =~ e ]]
+ set_e=false
+ set +e
+ local total_retries=60
+ shift
+ local retry=0
+ '[' 0 -ge 60 ']'
+ clickhouse-client --query 'SELECT '\''Connected to clickhouse-server after attaching gdb'\'''
Connected to clickhouse-server after attaching gdb
+ false
+ return
+ stress --hung-check --drop-databases --output-folder test_output --skip-func-tests '' --global-time-limit 1200
2026-09-30 15:29:24,263 Run func tests '/usr/bin/clickhouse-test --client-option ignore_drop_queries_probability=0.5 --global_time_limit=1200 '
2026-09-30 15:29:24,765 Run func tests '/usr/bin/clickhouse-test --order=random --database=test_1 --client-option join_use_nulls=1 join_algorithm='parallel_hash' use_query_cache=1 query_cache_nondeterministic_function_handling='ignore' query_cache_system_table_handling='ignore' memory_tracker_fault_probability=0.001 merge_tree_read_split_ranges_into_intersecting_and_non_intersecting_injection_probability=0.05 group_by_use_nulls=1 optimize_trivial_approximate_count_query=1 http_make_head_request=1 ignore_drop_queries_probability=0.5 --global_time_limit=1200 '
2026-09-30 15:29:25,266 Run func tests '/usr/bin/clickhouse-test --order=random --db-engine="Replicated('/test/db/test_2', 's1', 'r1')" --client-option enable_deflate_qpl_codec=1 enable_zstd_qat_codec=1 use_query_cache=1 query_cache_nondeterministic_function_handling='ignore' query_cache_system_table_handling='ignore' optimize_trivial_approximate_count_query=1 http_make_head_request=0 ignore_drop_queries_probability=0.5 enable_parallel_replicas=1 max_parallel_replicas=3 cluster_for_parallel_replicas='parallel_replicas' parallel_replicas_for_non_replicated_merge_tree=1 --global_time_limit=1200 '
2026-09-30 15:29:25,767 Run func tests '/usr/bin/clickhouse-test --order=random --database=test_3 --client-option join_algorithm='partial_merge' group_by_use_nulls=1 ignore_drop_queries_probability=0.5 --global_time_limit=1200 '
2026-09-30 15:29:26,268 Run func tests '/usr/bin/clickhouse-test --order=random --client-option join_use_nulls=1 http_make_head_request=0 ignore_drop_queries_probability=0.5 --global_time_limit=1200 '
2026-09-30 15:29:26,770 Run func tests '/usr/bin/clickhouse-test --order=random --db-engine="Replicated('/test/db/test_5', 's1', 'r1')" --database=test_5 --client-option enable_deflate_qpl_codec=1 enable_zstd_qat_codec=1 join_algorithm='full_sorting_merge' group_by_use_nulls=1 http_make_head_request=1 ignore_drop_queries_probability=0.5 enable_parallel_replicas=1 max_parallel_replicas=3 cluster_for_parallel_replicas='parallel_replicas' parallel_replicas_for_non_replicated_merge_tree=1 --global_time_limit=1200 '
2026-09-30 15:29:27,271 Run func tests '/usr/bin/clickhouse-test --order=random --client-option memory_tracker_fault_probability=0.001 merge_tree_read_split_ranges_into_intersecting_and_non_intersecting_injection_probability=0.05 ignore_drop_queries_probability=0.5 --global_time_limit=1200 '
2026-09-30 15:29:27,773 Run func tests '/usr/bin/clickhouse-test --order=random --database=test_7 --client-option join_use_nulls=1 join_algorithm='grace_hash' group_by_use_nulls=1 http_make_head_request=0 ignore_drop_queries_probability=0.5 --global_time_limit=1200 '
2026-09-30 15:29:28,274 Run func tests '/usr/bin/clickhouse-test --order=random --db-engine="Replicated('/test/db/test_8', 's1', 'r1')" --client-option enable_deflate_qpl_codec=1 enable_zstd_qat_codec=1 use_query_cache=1 query_cache_nondeterministic_function_handling='ignore' query_cache_system_table_handling='ignore' ignore_drop_queries_probability=0.5 --global_time_limit=1200 '
2026-09-30 15:29:28,776 Run func tests '/usr/bin/clickhouse-test --order=random --database=test_9 --client-option join_algorithm='auto' max_rows_in_join=1000 use_query_cache=1 query_cache_nondeterministic_function_handling='ignore' query_cache_system_table_handling='ignore' group_by_use_nulls=1 http_make_head_request=0 ignore_drop_queries_probability=0.5 --global_time_limit=1200 '
2026-09-30 15:29:29,277 Run func tests '/usr/bin/clickhouse-test --order=random --client-option join_use_nulls=1 use_query_cache=1 query_cache_nondeterministic_function_handling='ignore' query_cache_system_table_handling='ignore' ignore_drop_queries_probability=0.5 --global_time_limit=1200 '
2026-09-30 15:29:29,778 Run func tests '/usr/bin/clickhouse-test --order=random --db-engine="Replicated('/test/db/test_11', 's1', 'r1')" --database=test_11 --client-option enable_deflate_qpl_codec=1 enable_zstd_qat_codec=1 join_algorithm='parallel_hash' use_query_cache=1 query_cache_nondeterministic_function_handling='ignore' query_cache_system_table_handling='ignore' memory_tracker_fault_probability=0.001 merge_tree_read_split_ranges_into_intersecting_and_non_intersecting_injection_probability=0.05 group_by_use_nulls=1 ignore_drop_queries_probability=0.5 --global_time_limit=1200 '
2026-09-30 15:29:30,279 Run func tests '/usr/bin/clickhouse-test --order=random --client-option implicit_transaction=1 throw_on_unsupported_query_inside_transaction=0 ignore_drop_queries_probability=0.5 enable_parallel_replicas=1 max_parallel_replicas=3 cluster_for_parallel_replicas='parallel_replicas' parallel_replicas_for_non_replicated_merge_tree=1 --global_time_limit=1200 '
2026-09-30 15:29:30,781 Run func tests '/usr/bin/clickhouse-test --order=random --database=test_13 --client-option join_use_nulls=1 join_algorithm='partial_merge' group_by_use_nulls=1 http_make_head_request=1 ignore_drop_queries_probability=0.5 --global_time_limit=1200 '
2026-09-30 15:29:31,282 Run func tests '/usr/bin/clickhouse-test --order=random --db-engine="Replicated('/test/db/test_14', 's1', 'r1')" --client-option enable_deflate_qpl_codec=1 enable_zstd_qat_codec=1 use_query_cache=1 query_cache_nondeterministic_function_handling='ignore' query_cache_system_table_handling='ignore' ignore_drop_queries_probability=0.5 --global_time_limit=1200 '
2026-09-30 15:29:31,783 Run func tests '/usr/bin/clickhouse-test --order=random --database=test_15 --client-option join_algorithm='full_sorting_merge' group_by_use_nulls=1 ignore_drop_queries_probability=0.5 --global_time_limit=1200 '
2026-09-30 15:29:32,284 Will wait functests to finish
2026-09-30 15:29:32,284 Finished 6 from 16 processes
2026-09-30 15:29:37,289 Finished 6 from 16 processes
2026-09-30 15:29:42,294 Finished 6 from 16 processes
2026-09-30 15:29:47,298 Finished 6 from 16 processes
2026-09-30 15:29:52,302 Finished 6 from 16 processes
2026-09-30 15:29:57,306 Finished 6 from 16 processes
2026-09-30 15:30:02,310 Finished 6 from 16 processes
2026-09-30 15:30:07,314 Finished 6 from 16 processes
2026-09-30 15:30:12,318 Finished 6 from 16 processes
2026-09-30 15:30:17,322 Finished 6 from 16 processes
2026-09-30 15:30:22,326 Finished 6 from 16 processes
2026-09-30 15:30:27,330 Finished 6 from 16 processes
2026-09-30 15:30:32,334 Finished 6 from 16 processes
2026-09-30 15:30:37,338 Finished 6 from 16 processes
2026-09-30 15:30:42,342 Finished 6 from 16 processes
2026-09-30 15:30:47,346 Finished 6 from 16 processes
2026-09-30 15:30:52,350 Finished 6 from 16 processes
2026-09-30 15:30:57,354 Finished 6 from 16 processes
2026-09-30 15:31:02,358 Finished 6 from 16 processes
2026-09-30 15:31:07,362 Finished 6 from 16 processes
2026-09-30 15:31:12,367 Finished 6 from 16 processes
2026-09-30 15:31:17,370 Finished 6 from 16 processes
2026-09-30 15:31:22,375 Finished 6 from 16 processes
2026-09-30 15:31:27,378 Finished 6 from 16 processes
2026-09-30 15:31:32,382 Finished 6 from 16 processes
2026-09-30 15:31:37,387 Finished 6 from 16 processes
2026-09-30 15:31:42,390 Finished 6 from 16 processes
2026-09-30 15:31:47,395 Finished 6 from 16 processes
2026-09-30 15:31:52,398 Finished 6 from 16 processes
2026-09-30 15:31:57,402 Finished 6 from 16 processes
2026-09-30 15:32:02,406 Finished 7 from 16 processes
2026-09-30 15:32:07,410 Finished 9 from 16 processes
2026-09-30 15:32:12,414 Finished 9 from 16 processes
2026-09-30 15:32:17,418 Finished 9 from 16 processes
2026-09-30 15:32:22,422 Finished 9 from 16 processes
2026-09-30 15:32:27,426 Finished 9 from 16 processes
2026-09-30 15:32:32,430 Finished 9 from 16 processes
2026-09-30 15:32:37,434 Finished 9 from 16 processes
2026-09-30 15:32:42,438 Finished 9 from 16 processes
2026-09-30 15:32:47,442 Finished 9 from 16 processes
2026-09-30 15:32:52,446 Finished 9 from 16 processes
2026-09-30 15:32:57,450 Finished 9 from 16 processes
2026-09-30 15:33:02,454 Finished 9 from 16 processes
2026-09-30 15:33:07,458 Finished 9 from 16 processes
2026-09-30 15:33:12,462 Finished 9 from 16 processes
2026-09-30 15:33:17,466 Finished 9 from 16 processes
2026-09-30 15:33:22,470 Finished 9 from 16 processes
2026-09-30 15:33:27,474 Finished 9 from 16 processes
2026-09-30 15:33:32,478 Finished 9 from 16 processes
2026-09-30 15:33:37,482 Finished 9 from 16 processes
2026-09-30 15:33:42,486 Finished 9 from 16 processes
2026-09-30 15:33:47,490 Finished 9 from 16 processes
2026-09-30 15:33:52,494 Finished 9 from 16 processes
2026-09-30 15:33:57,498 Finished 9 from 16 processes
2026-09-30 15:34:02,502 Finished 9 from 16 processes
2026-09-30 15:34:07,506 Finished 9 from 16 processes
2026-09-30 15:34:12,510 Finished 9 from 16 processes
2026-09-30 15:34:17,514 Finished 9 from 16 processes
2026-09-30 15:34:22,518 Finished 9 from 16 processes
2026-09-30 15:34:27,522 Finished 9 from 16 processes
2026-09-30 15:34:32,526 Finished 9 from 16 processes
2026-09-30 15:34:37,530 Finished 9 from 16 processes
2026-09-30 15:34:42,534 Finished 9 from 16 processes
2026-09-30 15:34:47,538 Finished 9 from 16 processes
2026-09-30 15:34:52,542 Finished 9 from 16 processes
2026-09-30 15:34:57,546 Finished 9 from 16 processes
2026-09-30 15:35:02,550 Finished 9 from 16 processes
2026-09-30 15:35:07,554 Finished 9 from 16 processes
2026-09-30 15:35:12,558 Finished 9 from 16 processes
2026-09-30 15:35:17,562 Finished 9 from 16 processes
2026-09-30 15:35:22,566 Finished 9 from 16 processes
2026-09-30 15:35:27,570 Finished 9 from 16 processes
2026-09-30 15:35:32,574 Finished 9 from 16 processes
2026-09-30 15:35:37,578 Finished 9 from 16 processes
2026-09-30 15:35:42,582 Finished 9 from 16 processes
2026-09-30 15:35:47,586 Finished 9 from 16 processes
2026-09-30 15:35:52,590 Finished 9 from 16 processes
2026-09-30 15:35:57,594 Finished 9 from 16 processes
2026-09-30 15:36:02,598 Finished 9 from 16 processes
2026-09-30 15:36:07,602 Finished 9 from 16 processes
2026-09-30 15:36:12,607 Finished 9 from 16 processes
2026-09-30 15:36:17,610 Finished 9 from 16 processes
2026-09-30 15:36:22,614 Finished 9 from 16 processes
2026-09-30 15:36:27,618 Finished 9 from 16 processes
2026-09-30 15:36:32,622 Finished 9 from 16 processes
2026-09-30 15:36:37,626 Finished 9 from 16 processes
2026-09-30 15:36:42,630 Finished 9 from 16 processes
2026-09-30 15:36:47,634 Finished 9 from 16 processes
2026-09-30 15:36:52,639 Finished 9 from 16 processes
2026-09-30 15:36:57,642 Finished 9 from 16 processes
2026-09-30 15:37:02,646 Finished 9 from 16 processes
2026-09-30 15:37:07,650 Finished 9 from 16 processes
2026-09-30 15:37:12,654 Finished 9 from 16 processes
2026-09-30 15:37:17,658 Finished 9 from 16 processes
2026-09-30 15:37:22,662 Finished 9 from 16 processes
2026-09-30 15:37:27,666 Finished 9 from 16 processes
2026-09-30 15:37:32,670 Finished 9 from 16 processes
2026-09-30 15:37:37,674 Finished 9 from 16 processes
2026-09-30 15:37:42,678 Finished 9 from 16 processes
2026-09-30 15:37:47,682 Finished 9 from 16 processes
2026-09-30 15:37:52,686 Finished 9 from 16 processes
2026-09-30 15:37:57,690 Finished 9 from 16 processes
2026-09-30 15:38:02,694 Finished 9 from 16 processes
2026-09-30 15:38:07,698 Finished 9 from 16 processes
2026-09-30 15:38:12,702 Finished 9 from 16 processes
2026-09-30 15:38:17,706 Finished 9 from 16 processes
2026-09-30 15:38:22,710 Finished 9 from 16 processes
2026-09-30 15:38:27,714 Finished 9 from 16 processes
2026-09-30 15:38:32,718 Finished 9 from 16 processes
2026-09-30 15:38:37,722 Finished 9 from 16 processes
2026-09-30 15:38:42,726 Finished 9 from 16 processes
2026-09-30 15:38:47,730 Finished 9 from 16 processes
2026-09-30 15:38:52,735 Finished 9 from 16 processes
2026-09-30 15:38:57,738 Finished 9 from 16 processes
2026-09-30 15:39:02,742 Finished 9 from 16 processes
2026-09-30 15:39:07,746 Finished 9 from 16 processes
2026-09-30 15:39:12,750 Finished 9 from 16 processes
2026-09-30 15:39:17,754 Finished 9 from 16 processes
2026-09-30 15:39:22,758 Finished 9 from 16 processes
2026-09-30 15:39:27,762 Finished 9 from 16 processes
2026-09-30 15:39:32,766 Finished 9 from 16 processes
2026-09-30 15:39:37,770 Finished 9 from 16 processes
2026-09-30 15:39:42,774 Finished 9 from 16 processes
2026-09-30 15:39:47,778 Finished 9 from 16 processes
2026-09-30 15:39:52,782 Finished 9 from 16 processes
2026-09-30 15:39:57,786 Finished 9 from 16 processes
2026-09-30 15:40:02,790 Finished 9 from 16 processes
2026-09-30 15:40:07,794 Finished 9 from 16 processes
2026-09-30 15:40:12,798 Finished 9 from 16 processes
2026-09-30 15:40:17,802 Finished 9 from 16 processes
2026-09-30 15:40:22,806 Finished 9 from 16 processes
2026-09-30 15:40:27,810 Finished 9 from 16 processes
2026-09-30 15:40:32,814 Finished 9 from 16 processes
2026-09-30 15:40:37,818 Finished 9 from 16 processes
2026-09-30 15:40:42,822 Finished 9 from 16 processes
2026-09-30 15:40:47,826 Finished 9 from 16 processes
2026-09-30 15:40:52,830 Finished 9 from 16 processes
2026-09-30 15:40:57,834 Finished 9 from 16 processes
2026-09-30 15:41:02,838 Finished 9 from 16 processes
2026-09-30 15:41:07,842 Finished 9 from 16 processes
2026-09-30 15:41:12,846 Finished 9 from 16 processes
2026-09-30 15:41:17,850 Finished 9 from 16 processes
2026-09-30 15:41:22,854 Finished 9 from 16 processes
2026-09-30 15:41:27,858 Finished 9 from 16 processes
2026-09-30 15:41:32,862 Finished 9 from 16 processes
2026-09-30 15:41:37,866 Finished 9 from 16 processes
2026-09-30 15:41:42,871 Finished 9 from 16 processes
2026-09-30 15:41:47,874 Finished 9 from 16 processes
2026-09-30 15:41:52,878 Finished 9 from 16 processes
2026-09-30 15:41:57,882 Finished 9 from 16 processes
2026-09-30 15:42:02,886 Finished 9 from 16 processes
2026-09-30 15:42:07,890 Finished 9 from 16 processes
2026-09-30 15:42:12,894 Finished 9 from 16 processes
2026-09-30 15:42:17,899 Finished 9 from 16 processes
2026-09-30 15:42:22,903 Finished 9 from 16 processes
2026-09-30 15:42:27,907 Finished 10 from 16 processes
2026-09-30 15:42:32,910 Finished 10 from 16 processes
2026-09-30 15:42:37,914 Finished 10 from 16 processes
2026-09-30 15:42:42,918 Finished 10 from 16 processes
2026-09-30 15:42:47,922 Finished 10 from 16 processes
2026-09-30 15:42:52,926 Finished 10 from 16 processes
2026-09-30 15:42:57,931 Finished 10 from 16 processes
2026-09-30 15:43:02,936 Finished 10 from 16 processes
2026-09-30 15:43:07,941 Finished 10 from 16 processes
2026-09-30 15:43:12,946 Finished 10 from 16 processes
2026-09-30 15:43:17,950 Finished 10 from 16 processes
2026-09-30 15:43:22,954 Finished 10 from 16 processes
2026-09-30 15:43:27,959 Finished 10 from 16 processes
2026-09-30 15:43:32,962 Finished 10 from 16 processes
2026-09-30 15:43:37,966 Finished 10 from 16 processes
2026-09-30 15:43:42,970 Finished 10 from 16 processes
2026-09-30 15:43:47,974 Finished 10 from 16 processes
2026-09-30 15:43:52,979 Finished 10 from 16 processes
2026-09-30 15:43:57,982 Finished 10 from 16 processes
2026-09-30 15:44:02,986 Finished 10 from 16 processes
2026-09-30 15:44:07,990 Finished 10 from 16 processes
2026-09-30 15:44:12,994 Finished 10 from 16 processes
2026-09-30 15:44:17,998 Finished 10 from 16 processes
2026-09-30 15:44:23,002 Finished 11 from 16 processes
2026-09-30 15:44:28,006 Finished 11 from 16 processes
2026-09-30 15:44:33,010 Finished 11 from 16 processes
2026-09-30 15:44:38,014 Finished 11 from 16 processes
2026-09-30 15:44:43,018 Finished 11 from 16 processes
2026-09-30 15:44:48,022 Finished 11 from 16 processes
2026-09-30 15:44:53,026 Finished 11 from 16 processes
2026-09-30 15:44:58,030 Finished 11 from 16 processes
2026-09-30 15:45:03,034 Finished 11 from 16 processes
2026-09-30 15:45:08,038 Finished 11 from 16 processes
2026-09-30 15:45:13,042 Finished 11 from 16 processes
2026-09-30 15:45:18,046 Finished 11 from 16 processes
2026-09-30 15:45:23,050 Finished 11 from 16 processes
2026-09-30 15:45:28,054 Finished 11 from 16 processes
2026-09-30 15:45:33,058 Finished 11 from 16 processes
2026-09-30 15:45:38,062 Finished 11 from 16 processes
2026-09-30 15:45:43,066 Finished 11 from 16 processes
2026-09-30 15:45:48,070 Finished 11 from 16 processes
2026-09-30 15:45:53,074 Finished 11 from 16 processes
2026-09-30 15:45:58,078 Finished 11 from 16 processes
2026-09-30 15:46:03,082 Finished 11 from 16 processes
2026-09-30 15:46:08,086 Finished 11 from 16 processes
2026-09-30 15:46:13,090 Finished 11 from 16 processes
2026-09-30 15:46:18,094 Finished 11 from 16 processes
2026-09-30 15:46:23,098 Finished 11 from 16 processes
2026-09-30 15:46:28,102 Finished 11 from 16 processes
2026-09-30 15:46:33,106 Finished 11 from 16 processes
2026-09-30 15:46:38,110 Finished 11 from 16 processes
2026-09-30 15:46:43,114 Finished 11 from 16 processes
2026-09-30 15:46:48,118 Finished 11 from 16 processes
2026-09-30 15:46:53,122 Finished 11 from 16 processes
2026-09-30 15:46:58,126 Finished 11 from 16 processes
2026-09-30 15:47:03,130 Finished 11 from 16 processes
2026-09-30 15:47:08,134 Finished 11 from 16 processes
2026-09-30 15:47:13,138 Finished 11 from 16 processes
2026-09-30 15:47:18,142 Finished 11 from 16 processes
2026-09-30 15:47:23,144 Finished 11 from 16 processes
2026-09-30 15:47:28,146 Finished 11 from 16 processes
2026-09-30 15:47:33,150 Finished 11 from 16 processes
2026-09-30 15:47:38,154 Finished 11 from 16 processes
2026-09-30 15:47:43,158 Finished 11 from 16 processes
2026-09-30 15:47:48,162 Finished 11 from 16 processes
2026-09-30 15:47:53,166 Finished 11 from 16 processes
2026-09-30 15:47:58,170 Finished 11 from 16 processes
2026-09-30 15:48:03,174 Finished 11 from 16 processes
2026-09-30 15:48:08,178 Finished 11 from 16 processes
2026-09-30 15:48:13,182 Finished 11 from 16 processes
2026-09-30 15:48:18,186 Finished 11 from 16 processes
2026-09-30 15:48:23,191 Finished 11 from 16 processes
2026-09-30 15:48:28,194 Finished 11 from 16 processes
2026-09-30 15:48:33,198 Finished 11 from 16 processes
2026-09-30 15:48:38,202 Finished 11 from 16 processes
2026-09-30 15:48:43,206 Finished 11 from 16 processes
2026-09-30 15:48:48,210 Finished 11 from 16 processes
2026-09-30 15:48:53,211 Finished 11 from 16 processes
2026-09-30 15:48:58,214 Finished 11 from 16 processes
2026-09-30 15:49:03,218 Finished 11 from 16 processes
2026-09-30 15:49:08,222 Finished 11 from 16 processes
2026-09-30 15:49:13,227 Finished 11 from 16 processes
2026-09-30 15:49:18,230 Finished 11 from 16 processes
2026-09-30 15:49:23,235 Finished 11 from 16 processes
2026-09-30 15:49:28,238 Finished 11 from 16 processes
2026-09-30 15:49:33,242 Finished 13 from 16 processes
2026-09-30 15:49:38,248 Finished 14 from 16 processes
2026-09-30 15:49:43,250 Finished 14 from 16 processes
2026-09-30 15:49:48,254 Finished 14 from 16 processes
2026-09-30 15:49:53,258 Finished 14 from 16 processes
2026-09-30 15:49:58,262 Finished 14 from 16 processes
2026-09-30 15:50:03,266 Finished 14 from 16 processes
2026-09-30 15:50:08,270 Finished 14 from 16 processes
2026-09-30 15:50:13,274 Finished 14 from 16 processes
2026-09-30 15:50:18,277 Finished 14 from 16 processes
2026-09-30 15:50:23,282 Finished 14 from 16 processes
2026-09-30 15:50:28,286 Finished 14 from 16 processes
2026-09-30 15:50:33,290 Finished 14 from 16 processes
2026-09-30 15:50:38,294 Finished 14 from 16 processes
2026-09-30 15:50:43,298 Finished 14 from 16 processes
2026-09-30 15:50:48,302 Finished 14 from 16 processes
2026-09-30 15:50:53,306 Finished 14 from 16 processes
2026-09-30 15:50:58,310 Finished 14 from 16 processes
2026-09-30 15:51:03,314 Finished 14 from 16 processes
2026-09-30 15:51:08,318 Finished 14 from 16 processes
2026-09-30 15:51:13,322 Finished 14 from 16 processes
2026-09-30 15:51:18,327 Finished 14 from 16 processes
2026-09-30 15:51:23,330 Finished 14 from 16 processes
2026-09-30 15:51:28,334 Finished 14 from 16 processes
2026-09-30 15:51:33,338 Finished 14 from 16 processes
2026-09-30 15:51:38,342 Finished 14 from 16 processes
2026-09-30 15:51:43,346 Finished 14 from 16 processes
2026-09-30 15:51:48,350 Finished 14 from 16 processes
2026-09-30 15:51:53,354 Finished 14 from 16 processes
2026-09-30 15:51:58,358 Finished 14 from 16 processes
2026-09-30 15:52:03,362 Finished 14 from 16 processes
2026-09-30 15:52:08,363 Finished 14 from 16 processes
2026-09-30 15:52:13,368 Finished 14 from 16 processes
2026-09-30 15:52:18,370 Finished 14 from 16 processes
2026-09-30 15:52:23,374 Finished 14 from 16 processes
2026-09-30 15:52:28,378 Finished 14 from 16 processes
2026-09-30 15:52:33,382 Finished 14 from 16 processes
2026-09-30 15:52:38,386 Finished 14 from 16 processes
2026-09-30 15:52:43,390 Finished 14 from 16 processes
2026-09-30 15:52:48,394 Finished 14 from 16 processes
2026-09-30 15:52:53,397 Finished 14 from 16 processes
2026-09-30 15:52:58,398 Finished 14 from 16 processes
2026-09-30 15:53:03,402 Finished 14 from 16 processes
2026-09-30 15:53:08,406 Finished 14 from 16 processes
2026-09-30 15:53:13,410 Finished 14 from 16 processes
2026-09-30 15:53:18,415 Finished 14 from 16 processes
2026-09-30 15:53:23,418 Finished 14 from 16 processes
2026-09-30 15:53:28,422 Finished 14 from 16 processes
2026-09-30 15:53:33,427 Finished 14 from 16 processes
2026-09-30 15:53:38,430 Finished 14 from 16 processes
2026-09-30 15:53:43,434 Finished 14 from 16 processes
2026-09-30 15:53:48,438 Finished 14 from 16 processes
2026-09-30 15:53:53,442 Finished 14 from 16 processes
2026-09-30 15:53:58,446 Finished 14 from 16 processes
2026-09-30 15:54:03,449 Finished 14 from 16 processes
2026-09-30 15:54:08,455 Finished 15 from 16 processes
2026-09-30 15:54:13,458 Finished 15 from 16 processes
2026-09-30 15:54:18,463 Finished 15 from 16 processes
2026-09-30 15:54:23,466 Finished 15 from 16 processes
2026-09-30 15:54:28,470 Finished 15 from 16 processes
2026-09-30 15:54:33,475 All processes finished
2026-09-30 15:54:33,475 Compressing stress logs
2026-09-30 15:54:33,517 Logs compressed
2026-09-30 15:54:33,517 Will terminate gdb (if any)
2026-09-30 15:54:33,517 Running command: kill -TERM $(pidof gdb)
2026-09-30 15:54:33,525 Running command: timeout 50s tail --pid=$(pidof gdb) -f /dev/null || kill -9 $(pidof gdb) ||:
2026-09-30 15:54:34,542 Running command: kill -CONT $(cat /var/run/clickhouse-server/clickhouse-server.pid) && clickhouse client -q 'SELECT 1 FORMAT Null'
2026-09-30 15:54:34,808 Running command: clickhouse client -q "SYSTEM STOP THREAD FUZZER" --max_untracked_memory=1Gi --memory_profiler_step=1Gi --max_memory_usage_for_user=0 --max_memory_usage_in_client=1000000000
2026-09-30 15:54:34,973 Running command: clickhouse client -q "SYSTEM START MERGES" --max_untracked_memory=1Gi --memory_profiler_step=1Gi --max_memory_usage_for_user=0 --max_memory_usage_in_client=1000000000
2026-09-30 15:54:35,087 Running command: clickhouse client -q "SYSTEM START DISTRIBUTED SENDS" --max_untracked_memory=1Gi --memory_profiler_step=1Gi --max_memory_usage_for_user=0 --max_memory_usage_in_client=1000000000
2026-09-30 15:54:35,201 Running command: clickhouse client -q "SYSTEM START TTL MERGES" --max_untracked_memory=1Gi --memory_profiler_step=1Gi --max_memory_usage_for_user=0 --max_memory_usage_in_client=1000000000
2026-09-30 15:54:35,265 Running command: clickhouse client -q "SYSTEM START MOVES" --max_untracked_memory=1Gi --memory_profiler_step=1Gi --max_memory_usage_for_user=0 --max_memory_usage_in_client=1000000000
2026-09-30 15:54:35,329 Running command: clickhouse client -q "SYSTEM START FETCHES" --max_untracked_memory=1Gi --memory_profiler_step=1Gi --max_memory_usage_for_user=0 --max_memory_usage_in_client=1000000000
2026-09-30 15:54:35,444 Running command: clickhouse client -q "SYSTEM START REPLICATED SENDS" --max_untracked_memory=1Gi --memory_profiler_step=1Gi --max_memory_usage_for_user=0 --max_memory_usage_in_client=1000000000
2026-09-30 15:54:35,559 Running command: clickhouse client -q "SYSTEM START REPLICATION QUEUES" --max_untracked_memory=1Gi --memory_profiler_step=1Gi --max_memory_usage_for_user=0 --max_memory_usage_in_client=1000000000
2026-09-30 15:54:35,674 Running command: clickhouse client -q "SYSTEM DROP MARK CACHE" --max_untracked_memory=1Gi --memory_profiler_step=1Gi --max_memory_usage_for_user=0 --max_memory_usage_in_client=1000000000
2026-09-30 15:54:35,789 Running command: clickhouse client -q "KILL QUERY WHERE upper(query) LIKE 'WATCH %'" --max_untracked_memory=1Gi --memory_profiler_step=1Gi --max_memory_usage_for_user=0 --max_memory_usage_in_client=1000000000
2026-09-30 15:54:35,903 Running command: clickhouse client -q "KILL QUERY WHERE query LIKE 'insert into tableB select %'" --max_untracked_memory=1Gi --memory_profiler_step=1Gi --max_memory_usage_for_user=0 --max_memory_usage_in_client=1000000000
2026-09-30 15:54:36,018 Running command: clickhouse client -q "KILL QUERY WHERE query LIKE 'SELECT URL, uniq(SearchPhrase) AS u FROM test.hits GROUP BY URL ORDER BY u %'" --max_untracked_memory=1Gi --memory_profiler_step=1Gi --max_memory_usage_for_user=0 --max_memory_usage_in_client=1000000000
2026-09-30 15:54:36,133 Running command: clickhouse client -q "KILL QUERY WHERE query LIKE 'SELECT (SELECT number FROM system.numbers WHERE number = 1000000000000)%'" --max_untracked_memory=1Gi --memory_profiler_step=1Gi --max_memory_usage_for_user=0 --max_memory_usage_in_client=1000000000
Received exception from server (version 24.8.14):
Code: 159. DB::Exception: Received from localhost:9000. DB::Exception: Timeout exceeded: elapsed 60.053727906 seconds, maximum: 60. (TIMEOUT_EXCEEDED)
(query: SELECT sleepEachRow((
SELECT maxOrDefault(300 - elapsed) + 1
FROM system.processes
WHERE query NOT LIKE '%FROM system.processes%' AND elapsed < 300
) / 300)
FROM numbers(300)
FORMAT Null
SETTINGS function_sleep_max_microseconds_per_block = 0
)
2026-09-30 15:55:36,714 Checking if some queries hung
Using queries from '/usr/share/clickhouse-test/queries' directory
Connecting to ClickHouse server... OK
Connected to server 24.8.14.10548.altinitytest @ afce47f47998060949b5a27c94acce8f4cc031d4 HEAD
Running 1 stateless tests (MainProcess).
00001_select_1: [ OK ]
1 tests passed. 0 tests skipped. 0.28 s elapsed (MainProcess).
Won't run stateful tests because test data wasn't loaded.
Checking the hung queries: done
No queries hung.
All tests have finished.
Top patterns of log messages:
count count_% size size_% uniq_loggers uniq_threads levels background_% message_format_string
1. 12815 0.052 1.30 MiB 0.019 1 76 ['Trace'] 0.19 Checking existence of path: {}
2. 12743 0.051 2.63 MiB 0.039 1 104 ['Debug'] 0 (from {}{}{}){}{} {} (stage: {})
3. 12648 0.051 1.89 MiB 0.028 4431 103 ['Trace'] 1 {} Creating query context from {} context, user_id: {}, parent context user: {}
4. 10995 0.044 283.83 KiB 0.004 1 108 ['Trace'] 0.001 Query to stage {}{}
5. 10918 0.044 539.27 KiB 0.008 1 108 ['Trace'] 0.001 Query from stage {} to stage {}{}
6. 10396 0.042 440.96 KiB 0.006 1 132 ['Trace'] 1 is disk {} eligible for search: {}
7. 10382 0.042 26.37 MiB 0.393 21 512 ['Error'] 1 Table is in readonly mode (replica path: {})
8. 10372 0.042 292.65 KiB 0.004 1 103 ['Debug'] 0 Processed in {} sec.
9. 5477 0.022 436.25 KiB 0.006 1 73 ['Debug'] 0 Read {} rows, {} in {} sec., {} rows/sec., {}/sec.
10. 5122 0.021 228.67 KiB 0.003 1 3 ['Trace'] 1 Processing requests batch, size: {}, bytes: {}
11. 4452 0.018 204.16 KiB 0.003 4452 110 ['Debug'] 0.998 Authenticating user '{}' from {}
12. 4452 0.018 499.98 KiB 0.007 4452 110 ['Debug'] 0.998 {} Authenticated with global context as user {}
13. 4436 0.018 324.90 KiB 0.005 4436 103 ['Debug'] 1 Creating session context with user_id: {}
14. 4426 0.018 389.00 KiB 0.006 4426 105 ['Debug'] 0.998 {} Logout, user_id: {}
15. 4211 0.017 296.22 KiB 0.004 1 673 ['Trace'] 0.776 Reserved {} on local disk {}, having unreserved {}.
16. 4040 0.016 280.21 KiB 0.004 234 656 ['Trace'] 0.794 Trying to reserve {} using storage policy from min volume index {}
17. 4011 0.016 190.54 KiB 0.003 1 227 ['Trace'] 0.597 filled checksums {}
18. 3992 0.016 472.56 KiB 0.007 232 235 ['Trace'] 0.608 Renaming temporary part {} to {} with tid {}.
19. 3849 0.016 443.58 KiB 0.006 1 25 ['Debug'] 0 Reading {} marks from part {}, total {} rows starting from the beginning of the part, column {}
20. 3597 0.014 339.28 KiB 0.005 1 47 ['Debug'] 0 Reading {} marks from part {}, total {} rows starting from the beginning of the part
21. 3381 0.014 164.64 KiB 0.002 1 102 ['Debug'] 0.237 Peak memory usage{}: {}.
22. 3240 0.013 295.98 KiB 0.004 1 103 ['Debug'] 1 Connected {} version {}.{}.{}, revision: {}{}{}.
23. 3240 0.013 107.93 KiB 0.002 1 103 ['Trace'] 1 TCP Request. Address: {}
24. 3203 0.013 84.45 KiB 0.001 1 96 ['Debug'] 1 Done processing connection.
25. 2815 0.011 167.69 KiB 0.002 467 151 ['Debug'] 0.131 There are {} detached tables. Start searching non used tables.
26. 2815 0.011 118.21 KiB 0.002 467 151 ['Debug'] 0.131 Found {} non used tables in detached tables.
27. 2397 0.01 138.50 KiB 0.002 16 39 ['Trace'] 1 Flushing system log, {} entries to flush up to offset {}
28. 2396 0.01 85.58 KiB 0.001 16 39 ['Trace'] 1 Flushed system log up to offset {}
29. 2124 0.009 187.16 KiB 0.003 1 197 ['Trace'] 0 Aggregated. {} to {} rows (from {}) in {} sec. ({:.3f} rows/sec., {}/sec.)
30. 1984 0.008 8.61 MiB 0.128 2 5 ['Error'] 0 Value passed to '{}' function is non-zero
31. 1880 0.008 148.99 KiB 0.002 145 70 ['Trace'] 0 Reading {} ranges in{}order from part {}, approx. {} rows starting from {}
32. 1738 0.007 218.10 KiB 0.003 1 6 ['Trace'] 1 MemoryTracking: was {}, peak {}, free memory in arenas {}, will set to {} (RSS), difference: {}
33. 1608 0.006 47.91 KiB 0.001 1 194 ['Trace'] 0 Aggregation method: {}
34. 1584 0.006 162.03 KiB 0.002 1 7 ['Trace'] 0.5 Adding file: {}, size: {}
35. 1543 0.006 34.66 KiB 0.001 1 194 ['Trace'] 0 Merging aggregated data
36. 1469 0.006 113.33 KiB 0.002 1 1 ['Debug'] 1 Restarting waiting for CQEs due to: {}
37. 1322 0.005 76.34 KiB 0.001 2 12 ['Trace'] 0.987 Loading config file '{}'.
38. 1278 0.005 98.60 KiB 0.001 1 67 ['Trace'] 0 Query span trace_id for opentelemetry log: {}
39. 1246 0.005 327.00 KiB 0.005 1 58 ['Trace'] 0 {}Keys: {}, datatype: {}, kind: {}, strictness: {}, right header: {}
40. 1236 0.005 530.22 KiB 0.008 2 60 ['Trace'] 1 Request URI: {}
41. 1236 0.005 212.80 KiB 0.003 2 60 ['Trace'] 1 HTTP Request for {}. Method: {}, Address: {}, User-Agent: {}{}, Content Type: {}, Transfer Encoding: {}, X-Forwarded-For: {}
42. 1196 0.005 2.03 MiB 0.03 1 199 ['Trace'] 0.001 Exception while executing query. Current state:
{}
43. 1119 0.005 31.71 KiB 0 1 221 ['Debug'] 1 Stop worker in {}
44. 1119 0.005 43.74 KiB 0.001 1 194 ['Debug'] 0.559 Spawn loader worker #{} in {}
45. 1118 0.005 81.74 KiB 0.001 1 179 ['Debug'] 1 Execute load job '{}' in {}
46. 1118 0.005 77.36 KiB 0.001 1 179 ['Debug'] 1 Finish load job '{}' with status {}
47. 1118 0.005 85.02 KiB 0.001 1 59 ['Debug'] 0.072 Schedule load job '{}' into {}
48. 1107 0.004 102.60 KiB 0.001 1 61 ['Debug'] 0.049 Prioritize load job '{}': {} -> {}
49. 1011 0.004 20.73 KiB 0 2 58 ['Debug'] 0.031 Done processing query
50. 981 0.004 32.56 KiB 0 1 197 ['Debug'] 0.513 Change current priority: {} -> {}
51. 978 0.004 10.51 KiB 0 1 170 ['Trace'] 0 Aggregating
52. 964 0.004 8.47 KiB 0 2 59 ['Trace'] 0.008 No tables
53. 920 0.004 74.41 KiB 0.001 1 176 ['Trace'] 0 An entry for key={} found in cache: sum_of_sizes={}, median_size={}
54. 883 0.004 27.18 KiB 0 174 77 ['Debug'] 0 Key condition: {}
55. 878 0.004 38.58 KiB 0.001 171 77 ['Trace'] 0 Filtering marks by primary and secondary keys
56. 856 0.003 45.52 KiB 0.001 53 457 ['Debug'] 0.945 Selected {} parts from {} to {}
57. 831 0.003 96.14 KiB 0.001 164 75 ['Debug'] 0 Selected {}/{} parts by partition key, {} parts by primary key, {}/{} marks by primary key, {} marks to read from {} ranges
58. 828 0.003 68.21 KiB 0.001 1 49 ['Debug'] 0 Merging {} parts: from {} to {} into {} with storage {}
59. 828 0.003 28.21 KiB 0 1 49 ['Debug'] 0 Selected MergeAlgorithm: {}
60. 823 0.003 83.01 KiB 0.001 170 91 ['Debug'] 0.959 Removing {} parts from filesystem (serially): Parts: [{}]
61. 810 0.003 173.23 KiB 0.003 1 1 ['Error'] 0 Failed to push block to view {}, {}
62. 777 0.003 40.22 KiB 0.001 151 72 ['Trace'] 0 Spreading mark ranges among streams (default reading)
63. 776 0.003 101.32 KiB 0.001 1 48 ['Debug'] 0 Merge sorted {} rows, containing {} columns ({} merged, {} gathered) in {} sec., {} rows/sec., {}/sec.
64. 773 0.003 50.54 KiB 0.001 52 47 ['Trace'] 0 Merged {} parts: [{}, {}] -> {}
65. 689 0.003 62.38 KiB 0.001 38 17 ['Trace'] 0.948 Found {} old parts to remove. Parts: [{}]
66. 688 0.003 62.14 KiB 0.001 38 17 ['Debug'] 0.948 Removing {} parts from memory: Parts: [{}]
67. 687 0.003 114.42 KiB 0.002 1 53 ['Trace'] 0 No query result found for query {}
68. 611 0.002 2.65 MiB 0.04 16 98 ['Error'] 0.128 Cannot schedule a task: {} (threads={}, jobs={})
69. 556 0.002 91.83 KiB 0.001 1 49 ['Trace'] 0 Stored query result of query {}
70. 538 0.002 26.81 KiB 0 23 107 ['Trace'] 0.76 Loading {} part {} from disk {}
71. 538 0.002 30.49 KiB 0 23 107 ['Trace'] 0.76 Finished loading {} part {} on disk {}
72. 518 0.002 53.75 KiB 0.001 1 4 ['Trace'] 1 Creating part at path {}
73. 493 0.002 39.34 KiB 0.001 1 124 ['Trace'] 0 Statistics updated for key={}: new sum_of_sizes={}, median_size={}
74. 489 0.002 40.09 KiB 0.001 468 59 ['Information'] 0.02 Metadata processed, database {} has {} tables and {} dictionaries in total.
75. 485 0.002 28.87 KiB 0 1 59 ['Information'] 0.012 Parsed metadata of {} tables in {} databases in {} sec
76. 483 0.002 33.72 KiB 0 1 60 ['Debug'] 0.017 Wait load job '{}' in {}
77. 476 0.002 54.85 KiB 0.001 1 53 ['Debug'] 0 Done waiting for the table {} to be dropped. The outcome: {}
78. 476 0.002 35.33 KiB 0.001 1 53 ['Debug'] 0 Waiting for table {} to be finally dropped
79. 462 0.002 33.50 KiB 0 1 62 ['Trace'] 0 The min valid primary key position for moving to the tail of PREWHERE is {}
80. 453 0.002 43.35 KiB 0.001 8 56 ['Trace'] 0.971 List of all grants including implicit: {}
81. 453 0.002 34.51 KiB 0.001 8 56 ['Trace'] 0.971 Settings: readonly = {}, allow_ddl = {}, allow_introspection_functions = {}
82. 453 0.002 24.13 KiB 0 8 56 ['Trace'] 0.971 List of all grants: {}
83. 448 0.002 17.94 KiB 0 12 96 ['Trace'] 0.009 Sending external_roles with query: [{}] ({})
84. 443 0.002 31.34 KiB 0 27 87 ['Trace'] 0 Running binary search on index range for part {} ({} marks)
85. 443 0.002 13.44 KiB 0 27 87 ['Trace'] 0 Found (RIGHT) boundary mark: {}
86. 443 0.002 14.55 KiB 0 27 87 ['Trace'] 0 Found {} range {}in {} steps
87. 443 0.002 12.71 KiB 0 27 87 ['Trace'] 0 Found (LEFT) boundary mark: {}
88. 441 0.002 35.64 KiB 0.001 1 4 ['Debug'] 0.596 Merging configuration file '{}'.
89. 433 0.002 84.44 KiB 0.001 1 132 ['Information'] 1 Removing metadata {} of dropped table {}
90. 425 0.002 30.71 KiB 0 1 288 ['Information'] 1 Have {} tables in drop queue ({} of them are in use), will try drop {} tables
91. 423 0.002 7.44 KiB 0 331 103 ['Debug'] 0.156 Loading data parts
92. 400 0.002 11.72 KiB 0 46 31 ['Trace'] 1 Checking task {}
93. 398 0.002 8.62 KiB 0 56 287 ['Trace'] 1 Execution took {} ms.
94. 381 0.002 32.63 KiB 0 50 256 ['Trace'] 1 Scheduling next merge selecting task after {}ms, current attempt status: {}
95. 368 0.001 1.19 MiB 0.018 12 17 ['Error'] 0.62 Directory for {} data {} already exists
96. 357 0.001 57.82 KiB 0.001 12 79 ['Debug'] 0 Sent data for {} scalars, total {} rows in {} sec., {} rows/sec., {} ({}/sec.), compressed {} times to {} ({}/sec.)
97. 356 0.001 15.30 KiB 0 1 4 ['Information'] 1 {} for session {} took {} ms
98. 352 0.001 31.62 KiB 0 54 38 ['Trace'] 1 Trying to initialize replication: our_log_ptr={}, max_log_ptr={}, local_digest={}, zk_digest={}
99. 347 0.001 10.92 KiB 0 20 15 ['Debug'] 0.02 Requested flush up to offset {}
100. 333 0.001 7.48 KiB 0 320 72 ['Debug'] 0.114 There are no data parts
count count_% size size_% uniq_loggers uniq_threads levels background_% message_format_string
Top messages without format string (fmt::runtime):
count pattern runtime_message line
1. 10 CodeDBExceptionReceivedfromDBExc Code: 439. DB::Exception: Received from 127.0.0.2:9000. DB::Exception: Cannot schedule a task: fault injected (threads=27, jobs=4): While executing MergeTreeSelect(pool: ReadPoolInOrder, algorithm: InOrder). Stack trace:
0. /build/contrib/llvm-project/lib ('/executeQuery.cpp',221)
2. 3 ELECTIONTIMEOUTcurrentrolefollow [ELECTION TIMEOUT] current role: follower, log last term 0, state term 0, target p 1, my p 1, hb dead, pre-vote NOT done ('/LoggerWrapper.h',43)
3. 3 Forkedachildprocesstowatch Forked a child process to watch ('',0)
4. 3 statemachinecommitindexprecommit state machine commit index 0, precommit index 0, last log index 0 ('/LoggerWrapper.h',43)
5. 3 bgappendentriesthreadinitiated bg append_entries thread initiated ('/LoggerWrapper.h',43)
6. 3 waitforHBforms wait for HB, for 50 + [0, 0] ms ('/LoggerWrapper.h',43)
7. 3 numberofpendingcommitelements number of pending commit elements: 0 ('/LoggerWrapper.h',43)
8. 3 parameterselectiontimeoutrangehe parameters: election timeout range 0 - 0, heartbeat 0, leadership expiry 0, max batch 100, backoff 50, snapshot distance 10000, enable randomized snapshot creation NO, log sync stop gap 99999, reserved logs 2147483647, client timeout 10000, auto forwarding ('/LoggerWrapper.h',43)
9. 3 newconfigurationlogidxprevlogidx new configuration: log idx 1, prev log idx 0
peer 1, DC ID 0, localhost:9234, voting member, 1
my id: 1, leader: 1, term: 1 ('/LoggerWrapper.h',43)
10. 3 configatindexiscommittedprevconf config at index 1 is committed, prev config log idx 0 ('/LoggerWrapper.h',43)
11. 3 RaftASIOlistenerinitiatedonunsec Raft ASIO listener initiated on :::9234, unsecured ('/LoggerWrapper.h',43)
12. 3 invalidelectiontimeoutupperbound invalid election timeout upper bound detected, adjusted to 0 ('/LoggerWrapper.h',43)
13. 3 peerDCIDlocalhostvotingmembermyi peer 1: DC ID 0, localhost:9234, voting member, 1
my id: 1, voting_member
num peers: 0 ('/LoggerWrapper.h',43)
14. 3 invalidelectiontimeoutlowerbound invalid election timeout lower bound detected, adjusted to 0 ('/LoggerWrapper.h',43)
15. 3 PRIORITYdecaytargetmine [PRIORITY] decay, target 1 -> 1, mine 1 ('/LoggerWrapper.h',43)
16. 3 newelectiontimeoutrange new election timeout range: 0 - 0 ('/LoggerWrapper.h',43)
17. 3 VOTEINITmyidmyrolecandidateterml [VOTE INIT] my id 1, my role candidate, term 1, log idx 0, log term 0, priority (target 1 / mine 1) ('/LoggerWrapper.h',43)
18. 3 Electiontimeoutinitiateleaderele Election timeout, initiate leader election ('/LoggerWrapper.h',43)
19. 3 globalmanagerdoesnotexistwilluse global manager does not exist. will use local thread for commit and append ('/LoggerWrapper.h',43)
20. 3 newconfiglogidxprevlogidxcurconf new config log idx 1, prev log idx 0, cur config log idx 0, prev log idx 0 ('/LoggerWrapper.h',43)
21. 3 startingup starting up ('',0)
22. 3 BECOMELEADERappendednewconfigat [BECOME LEADER] appended new config at 1 ('/LoggerWrapper.h',43)
23. 3 StartingClickHousealtinitytestre Starting ClickHouse 24.8.14.10548.altinitytest (revision: 4294967295, git hash: afce47f47998060949b5a27c94acce8f4cc031d4, build id: E9D52E492D5148EA7F557159551F36D17FEE19EF), PID 412 ('',0)
24. 3 INITRAFTSERVERcommitindextermele === INIT RAFT SERVER ===
commit index 0
term 0
election timer allowed
log store start 1, end 0
config log idx 0, prev log idx 0
-- ASYNC REPLICATION -- ('/LoggerWrapper.h',43)
25. 2 voidDBStorageReplicatedMergeTree void DB::StorageReplicatedMergeTree::mutationsUpdatingTask(): Code: 999. Coordination::Exception: Session expired. (KEEPER_EXCEPTION), Stack trace (when copying this message, always include the lines below):
0. /build/contrib/llvm-project/libcxx/include/e ('/Exception.cpp',273)
26. 2 prevotetermisdifferentresetitto pre-vote term (0) is different, reset it to 1 ('/LoggerWrapper.h',43)
27. 2 CodeDBExceptionPathisrelativewhi Code: 395. DB::Exception: Path is relative: : while executing 'FUNCTION throwIf(_CAST(1_UInt8, 'UInt8'_String) :: 1, 'Path is relative: '_String :: 2) -> throwIf(_CAST(1_UInt8, 'UInt8'_String), 'Path is relative: '_String) UInt8 : 3'. (FUNCTION_THROW_IF_VA ('/executeQuery.cpp',221)
28. 2 CodeDBExceptionFailedtogetobject Code: 499. DB::Exception: Failed to get object info: No response body.. HTTP response code: 404: while reading test: The table structure cannot be extracted from a CSV format file. You can specify the structure manually. (S3_ERROR) (version 24.8.14.10548.a ('/executeQuery.cpp',221)
29. 2 CodeDBExceptionShouldthrowwhilee Code: 395. DB::Exception: Should throw: while executing 'FUNCTION throwIf(equals(__table1.b, 1_UInt8) :: 3, 'Should throw'_String :: 2) -> throwIf(equals(__table1.b, 1_UInt8), 'Should throw'_String) UInt8 : 1': While executing MergeTreeSelect(pool: ReadPoo ('/executeQuery.cpp',221)
30. 1 CodeCoordinationExceptionSession Code: 999. Coordination::Exception: Session expired (fault injected on recv). (KEEPER_EXCEPTION), Stack trace (when copying this message, always include the lines below):
0. /build/contrib/llvm-project/libcxx/include/exception:141: Poco::Exception::Except ('/Exception.cpp',273)
Top messages not matching their format strings:
message_format_string count() any_message
1. {} is in use (by merge/mutation/INSERT) (consider increasing temporary_directories_lifetime setting) 89 /var/lib/clickhouse/store/186/186594a1-7656-47c1-abd6-61ab9b4b9d3c/tmp_merge_202609_1_5_1/ is in use (by merge/mutation/INSERT) (consider increasing temporary_directories_lifetime setting) (skipped 1 similar messages)
2. 72 Forked a child process to watch
3. (from {}{}{}){}{} {} (stage: {}) 1 (from [::1]:58116) (comment: 01674_unicode_asan.sql) SELECT positionCaseInsensitiveUTF8('иголка.ру', 'иголка.р�\0') AS res; (stage: Complete)
Top short messages:
c message_format_string substr(any(toValidUTF8(message)), 1, 120) min_length_without_exception_boilerplate
1. 20 Cannot TRUNCATE dictionary Code: 62. DB::Exception: Cannot TRUNCATE dictionary. (SYNTAX_ERROR) (version 24.8.14.10548.altinitytest (altinity build) 27
2. 16 {} Server was built in debug mode. It will work slowly. 26
3. 6 Bad SSH public key provided Code: 706. DB::Exception: Bad SSH public key provided. (LIBSSH_ERROR) (version 24.8.14.10548.altinitytest (altinity buil 29
4. 5 Found {} on {} Found snapshot_11.bin.zstd on LocalSnapshotDisk 18
5. 4 Illegal HDFS URI: {} Code: 36. DB::Exception: Illegal HDFS URI: //abcd. (BAD_ARGUMENTS) (version 24.8.14.10548.altinitytest (altinity build)) 25
6. 2 Database {} already exists. Code: 82. DB::Exception: Database rdb1 already exists. (DATABASE_ALREADY_EXISTS) (version 24.8.14.10548.altinitytest (al 29
7. 1 Creating {}: {} Creating table test_13ldye7z.manyparts: CREATE TABLE IF NOT EXISTS test_13ldye7z.manyparts UUID 'aa487681-104c-4674-b34d 1099
Top messages by level:
(0.04181114507444413,'Table is in readonly mode (replica path: {})') Error
(0.00012081818071983472,'Client has gone away.') Warning
(0.001969336345733306,'Metadata processed, database {} has {} tables and {} dictionaries in total.') Information
(0.05131953589709513,'(from {}{}{}){}{} {} (stage: {})') Debug
(0.05160949953082273,'Checking existence of path: {}') Trace
2026-09-30 15:55:39,087 Stress test finished
+ echo -e 'Test script exit code\tOK\t\N\t'
+ rg -Fa 'No queries hung' /test_output/test_results.tsv
+ grep -Fa OK
No queries hung OK \N
+ stop_server
+ local max_tries=90
+ local check_hang=true
+ local pid
++ cat /var/run/clickhouse-server/clickhouse-server.pid
+ pid=2985
+ clickhouse stop --max-tries 90 --do-not-kill
/var/run/clickhouse-server/clickhouse-server.pid file exists and contains pid = 2985.
The process with pid = 2985 is running.
Sent terminate signal to process with pid 2985.
Waiting for server to stop
/var/run/clickhouse-server/clickhouse-server.pid file exists and contains pid = 2985.
The process with pid = 2985 is running.
Waiting for server to stop
/var/run/clickhouse-server/clickhouse-server.pid file exists and contains pid = 2985.
The process with pid = 2985 is running.
Waiting for server to stop
/var/run/clickhouse-server/clickhouse-server.pid file exists and contains pid = 2985.
The process with pid = 2985 is running.
Waiting for server to stop
/var/run/clickhouse-server/clickhouse-server.pid file exists and contains pid = 2985.
The process with pid = 2985 is running.
Waiting for server to stop
/var/run/clickhouse-server/clickhouse-server.pid file exists and contains pid = 2985.
The process with pid = 2985 is running.
Waiting for server to stop
/var/run/clickhouse-server/clickhouse-server.pid file exists and contains pid = 2985.
The process with pid = 2985 is running.
Waiting for server to stop
/var/run/clickhouse-server/clickhouse-server.pid file exists and contains pid = 2985.
The process with pid = 2985 is running.
Waiting for server to stop
/var/run/clickhouse-server/clickhouse-server.pid file exists and contains pid = 2985.
The process with pid = 2985 does not exist.
Server stopped
+ return
+ mv /var/log/clickhouse-server/clickhouse-server.log /var/log/clickhouse-server/clickhouse-server.stress.log
+ unset THREAD_FUZZER_CPU_TIME_PERIOD_US THREAD_FUZZER_EXPLICIT_MEMORY_EXCEPTION_PROBABILITY THREAD_FUZZER_EXPLICIT_SLEEP_PROBABILITY THREAD_FUZZER_SLEEP_PROBABILITY THREAD_FUZZER_SLEEP_TIME_US_MAX THREAD_FUZZER_pthread_mutex_lock_AFTER_MIGRATE_PROBABILITY THREAD_FUZZER_pthread_mutex_lock_AFTER_SLEEP_PROBABILITY THREAD_FUZZER_pthread_mutex_lock_AFTER_SLEEP_TIME_US_MAX THREAD_FUZZER_pthread_mutex_lock_BEFORE_MIGRATE_PROBABILITY THREAD_FUZZER_pthread_mutex_lock_BEFORE_SLEEP_PROBABILITY THREAD_FUZZER_pthread_mutex_lock_BEFORE_SLEEP_TIME_US_MAX THREAD_FUZZER_pthread_mutex_unlock_AFTER_MIGRATE_PROBABILITY THREAD_FUZZER_pthread_mutex_unlock_AFTER_SLEEP_PROBABILITY THREAD_FUZZER_pthread_mutex_unlock_AFTER_SLEEP_TIME_US_MAX THREAD_FUZZER_pthread_mutex_unlock_BEFORE_MIGRATE_PROBABILITY THREAD_FUZZER_pthread_mutex_unlock_BEFORE_SLEEP_PROBABILITY THREAD_FUZZER_pthread_mutex_unlock_BEFORE_SLEEP_TIME_US_MAX THREAD_POOL_FAULT_INJECTION
+ start_server
+ counter=0
+ max_attempt=120
+ clickhouse-client --query 'SELECT 1'
Code: 210. DB::NetException: Connection refused (localhost:9000). (NETWORK_ERROR)
+ '[' 0 -gt 120 ']'
+ clickhouse start --user root
+ sleep 0.5
+ counter=1
+ clickhouse-client --query 'SELECT 1'
Code: 210. DB::NetException: Connection refused (localhost:9000). (NETWORK_ERROR)
+ '[' 1 -gt 120 ']'
+ clickhouse start --user root
+ sleep 0.5
127.0.0.1 - - [30/Sep/2026:13:55:47 +0000] "GET /devstoreaccount1/cont?restype=container HTTP/1.1" 200 -
127.0.0.1 - - [30/Sep/2026:13:55:47 +0000] "PUT /devstoreaccount1/cont/axgbaeleoqvuccfkfsnrpfllhscnwadr HTTP/1.1" 201 -
127.0.0.1 - - [30/Sep/2026:13:55:47 +0000] "GET /devstoreaccount1/cont/axgbaeleoqvuccfkfsnrpfllhscnwadr HTTP/1.1" 206 4
127.0.0.1 - - [30/Sep/2026:13:55:47 +0000] "GET /devstoreaccount1/cont/axgbaeleoqvuccfkfsnrpfllhscnwadr HTTP/1.1" 206 2
127.0.0.1 - - [30/Sep/2026:13:55:47 +0000] "DELETE /devstoreaccount1/cont/axgbaeleoqvuccfkfsnrpfllhscnwadr HTTP/1.1" 202 -
+ counter=2
+ clickhouse-client --query 'SELECT 1'
Code: 210. DB::NetException: Connection refused (localhost:9000). (NETWORK_ERROR)
+ '[' 2 -gt 120 ']'
+ clickhouse start --user root
+ sleep 0.5
+ counter=3
+ clickhouse-client --query 'SELECT 1'
Code: 210. DB::NetException: Connection refused (localhost:9000). (NETWORK_ERROR)
+ '[' 3 -gt 120 ']'
+ clickhouse start --user root
+ sleep 0.5
+ counter=4
+ clickhouse-client --query 'SELECT 1'
1
+ attach_gdb_to_clickhouse
++ run_with_retry 5 clickhouse-client --query 'SELECT count() FROM system.build_options WHERE name = '\''CXX_FLAGS'\'' AND position('\''sanitize=address'\'' IN value)'
++ [[ hxB =~ e ]]
++ set_e=false
++ set +e
++ local total_retries=5
++ shift
++ local retry=0
++ '[' 0 -ge 5 ']'
++ clickhouse-client --query 'SELECT count() FROM system.build_options WHERE name = '\''CXX_FLAGS'\'' AND position('\''sanitize=address'\'' IN value)'
Received exception from server (version 24.8.14):
Code: 439. DB::Exception: Received from localhost:9000. DB::Exception: Cannot schedule a task: failed to start the thread (threads=7, jobs=7). (CANNOT_SCHEDULE_TASK)
(query: SELECT count() FROM system.build_options WHERE name = 'CXX_FLAGS' AND position('sanitize=address' IN value))
++ retry=1
++ sleep 5
++ '[' 1 -ge 5 ']'
++ clickhouse-client --query 'SELECT count() FROM system.build_options WHERE name = '\''CXX_FLAGS'\'' AND position('\''sanitize=address'\'' IN value)'
++ false
++ return
+ IS_ASAN=0
+ [[ 0 = \1 ]]
++ kill -l SIGRTMIN
+ RTMIN=34
+ echo '
set follow-fork-mode parent
handle SIGHUP nostop noprint pass
handle SIGINT nostop noprint pass
handle SIGQUIT nostop noprint pass
handle SIGPIPE nostop noprint pass
handle SIGTERM nostop noprint pass
handle SIGUSR1 nostop noprint pass
handle SIGUSR2 nostop noprint pass
handle SIG34 nostop noprint pass
info signals
continue
backtrace full
info registers
p top' 1 KiB of the 'stack:
p/x *(uint64_t[128]*)$sp
maintenance info sections
thread apply all backtrace full
disassemble /s
up
disassemble /s
up
disassemble /s
p "done"
detach
quit
'
+ sleep 5
+ ts '%Y-%m-%d %H:%M:%S'
++ cat /var/run/clickhouse-server/clickhouse-server.pid
+ gdb -batch -command script.gdb -p 38562
+ run_with_retry 60 clickhouse-client --query 'SELECT '\''Connected to clickhouse-server after attaching gdb'\'''
+ [[ hxB =~ e ]]
+ set_e=false
+ set +e
+ local total_retries=60
+ shift
+ local retry=0
+ '[' 0 -ge 60 ']'
+ clickhouse-client --query 'SELECT '\''Connected to clickhouse-server after attaching gdb'\'''
Connected to clickhouse-server after attaching gdb
+ false
+ return
+ check_server_start
+ clickhouse-client --query 'SELECT '\''Server successfully started'\'', '\''OK'\'', NULL, '\'''\'''
Received exception from server (version 24.8.14):
Code: 439. DB::Exception: Received from localhost:9000. DB::Exception: Cannot schedule a task: fault injected (threads=742, jobs=709). (CANNOT_SCHEDULE_TASK)
(query: SELECT 'Server successfully started', 'OK', NULL, '')
+ rg --text '.*Application' /var/log/clickhouse-server/clickhouse-server.log
+ '[' -s /test_output/application_errors.txt ']'
+ rm /test_output/application_errors.txt
+ stop_server
+ local max_tries=90
+ local check_hang=true
+ local pid
++ cat /var/run/clickhouse-server/clickhouse-server.pid
+ pid=38562
+ clickhouse stop --max-tries 90 --do-not-kill
script.gdb:13: Error in sourced command file:
No stack.
/var/run/clickhouse-server/clickhouse-server.pid file exists and contains pid = 38562.
The process with pid = 38562 is running.
Sent terminate signal to process with pid 38562.
Waiting for server to stop
/var/run/clickhouse-server/clickhouse-server.pid file exists and contains pid = 38562.
The process with pid = 38562 is running.
Waiting for server to stop
/var/run/clickhouse-server/clickhouse-server.pid file exists and contains pid = 38562.
The process with pid = 38562 is running.
Waiting for server to stop
/var/run/clickhouse-server/clickhouse-server.pid file exists and contains pid = 38562.
The process with pid = 38562 is running.
Waiting for server to stop
/var/run/clickhouse-server/clickhouse-server.pid file exists and contains pid = 38562.
The process with pid = 38562 is running.
Waiting for server to stop
/var/run/clickhouse-server/clickhouse-server.pid file exists and contains pid = 38562.
The process with pid = 38562 is running.
Waiting for server to stop
/var/run/clickhouse-server/clickhouse-server.pid file exists and contains pid = 38562.
The process with pid = 38562 is running.
Waiting for server to stop
Now there is no clickhouse-server process.
Server stopped
+ return
+ '[' -f /var/log/clickhouse-server/clickhouse-server.log ']'
+ '[' -f /var/log/clickhouse-server/stderr.log ']'
+ mv /var/log/clickhouse-server/clickhouse-server.log /var/log/clickhouse-server/clickhouse-server.final.log
+ check_logs_for_critical_errors
+ sed -n '/WARNING:.*anitizer/,/^$/p' /var/log/clickhouse-server/stderr.log
+ rg -Fav -e 'ASan doesn'\''t fully support makecontext/swapcontext functions' -e DB::Exception /test_output/tmp
+ echo -e 'No sanitizer asserts\tOK\t\N\t'
+ rm -f /test_output/tmp
+ rg -Fa ' Application: Child process was terminated by signal 9' /var/log/clickhouse-server/clickhouse-server.err.log /var/log/clickhouse-server/clickhouse-server.final.log /var/log/clickhouse-server/clickhouse-server.initial.log /var/log/clickhouse-server/clickhouse-server.stress.log
+ echo -e 'No OOM messages in clickhouse-server.log\tOK\t\N\t'
+ rg -Fa 'Code: 49. DB::Exception: ' /var/log/clickhouse-server/clickhouse-server.err.log /var/log/clickhouse-server/clickhouse-server.final.log /var/log/clickhouse-server/clickhouse-server.initial.log /var/log/clickhouse-server/clickhouse-server.stress.log
+ echo -e 'No logical errors\tOK\t\N\t'
+ '[' -s /test_output/logical_errors.txt ']'
+ rm /test_output/logical_errors.txt
+ rg --text 'Code: 499.*The specified key does not exist' /var/log/clickhouse-server/clickhouse-server.err.log /var/log/clickhouse-server/clickhouse-server.final.log /var/log/clickhouse-server/clickhouse-server.initial.log /var/log/clickhouse-server/clickhouse-server.stress.log
+ grep -v a.myext
+ echo -e 'No lost s3 keys\tOK\t\N\t'
+ rg -Fa 'it is lost forever' /var/log/clickhouse-server/clickhouse-server.err.log /var/log/clickhouse-server/clickhouse-server.final.log /var/log/clickhouse-server/clickhouse-server.initial.log /var/log/clickhouse-server/clickhouse-server.stress.log
+ grep SharedMergeTreePartCheckThread
+ echo -e 'No SharedMergeTree lost forever in clickhouse-server.log\tOK\t\N\t'
+ '[' -s /test_output/no_such_key_errors.txt ']'
+ rm /test_output/no_such_key_errors.txt
+ rg -Fa '########################################' /var/log/clickhouse-server/clickhouse-server.err.log /var/log/clickhouse-server/clickhouse-server.final.log /var/log/clickhouse-server/clickhouse-server.initial.log /var/log/clickhouse-server/clickhouse-server.stress.log
+ echo -e 'Not crashed\tOK\t\N\t'
+ rg -Fa ' ' /var/log/clickhouse-server/clickhouse-server.err.log /var/log/clickhouse-server/clickhouse-server.final.log /var/log/clickhouse-server/clickhouse-server.initial.log /var/log/clickhouse-server/clickhouse-server.stress.log
+ echo -e 'No fatal messages in clickhouse-server.log\tOK\t\N\t'
+ '[' -s /test_output/fatal_messages.txt ']'
+ rm /test_output/fatal_messages.txt
+ rg -Faz '########################################' /test_output/gdb.log /test_output/stress_run_logs.tar.zst /test_output/test_results.tsv
+ rg -v 'rg -Fa'
+ rg -Fa ' received signal ' /test_output/gdb.log
+ dmesg -T
+ grep -q -F -e 'Out of memory: Killed process' -e 'oom_reaper: reaped process' -e oom-kill:constraint=CONSTRAINT_NONE /test_output/dmesg.log
+ echo -e 'No OOM in dmesg\tOK\t\N\t'
+ tar -chf /test_output/coordination.tar /var/lib/clickhouse/coordination
tar: Removing leading `/' from member names
tar: Removing leading `/' from hard link targets
+ collect_query_and_trace_logs
+ for table in query_log trace_log metric_log
+ clickhouse-local --config-file=/etc/clickhouse-server/config.xml --only-system-tables -q 'select * from system.query_log format TSVWithNamesAndTypes'
+ zstd --threads=0
Logging trace to /var/log/clickhouse-server/clickhouse-server.log
Logging errors to /var/log/clickhouse-server/clickhouse-server.err.log
127.0.0.1 - - [30/Sep/2026:13:56:11 +0000] "GET /devstoreaccount1/cont?restype=container HTTP/1.1" 200 -
+ for table in query_log trace_log metric_log
+ clickhouse-local --config-file=/etc/clickhouse-server/config.xml --only-system-tables -q 'select * from system.trace_log format TSVWithNamesAndTypes'
+ zstd --threads=0
Logging trace to /var/log/clickhouse-server/clickhouse-server.log
Logging errors to /var/log/clickhouse-server/clickhouse-server.err.log
127.0.0.1 - - [30/Sep/2026:13:56:13 +0000] "GET /devstoreaccount1/cont?restype=container HTTP/1.1" 200 -
+ for table in query_log trace_log metric_log
+ clickhouse-local --config-file=/etc/clickhouse-server/config.xml --only-system-tables -q 'select * from system.metric_log format TSVWithNamesAndTypes'
+ zstd --threads=0
Logging trace to /var/log/clickhouse-server/clickhouse-server.log
Logging errors to /var/log/clickhouse-server/clickhouse-server.err.log
127.0.0.1 - - [30/Sep/2026:13:56:15 +0000] "GET /devstoreaccount1/cont?restype=container HTTP/1.1" 200 -
+ mv /var/log/clickhouse-server/stderr.log /test_output/
+ clickhouse-local --structure 'test String, res String, time Nullable(Float32), desc String' -q 'SELECT '\''failure'\'', test FROM table WHERE res != '\''OK'\'' order by
(test like '\''%Sanitizer%'\'') DESC,
(test like '\''%Killed by signal%'\'') DESC,
(test like '\''%gdb.log%'\'') DESC,
(test ilike '\''%possible deadlock%'\'') DESC,
(test like '\''%start%'\'') DESC,
(test like '\''%dmesg%'\'') DESC,
(test like '\''%OOM%'\'') DESC,
(test like '\''%Signal 9%'\'') DESC,
(test like '\''%Fatal message%'\'') DESC,
rowNumberInAllBlocks()
LIMIT 1'
+ '[' -s /test_output/check_status.tsv ']'
+ echo -e 'success\tNo errors found'
+ rg 'OOM in dmesg|Signal 9' /test_output/check_status.tsv
+ collect_core_dumps
+ find . -type f -maxdepth 1 -name 'core.*'
+ read -r core