+ ln -s /usr/share/clickhouse-test/ci/stress.py /usr/bin/stress
+ ln -s /usr/share/clickhouse-test/clickhouse-test /usr/bin/clickhouse-test
+ source /usr/share/clickhouse-test/ci/attach_gdb.lib
++ source /usr/share/clickhouse-test/ci/utils.lib
+ source /usr/share/clickhouse-test/ci/stress_tests.lib
++ sysctl kernel.core_pattern=core.%e.%p-%P
kernel.core_pattern = core.%e.%p-%P
++ OK='\tOK\t\N\t'
++ FAIL='\tFAIL\t\N\t'
++ FAILURE_CONTEXT_LINES=100
++ FAILURE_CONTEXT_MAX_LINE_WIDTH=300
+ install_packages package_folder
+ dpkg -i package_folder/clickhouse-common-static_23.8.16.43.altinitystable+asan_amd64.deb
Selecting previously unselected package clickhouse-common-static.
(Reading database ... 58864 files and directories currently installed.)
Preparing to unpack .../clickhouse-common-static_23.8.16.43.altinitystable+asan_amd64.deb ...
Unpacking clickhouse-common-static (23.8.16.43.altinitystable+asan) ...
Setting up clickhouse-common-static (23.8.16.43.altinitystable+asan) ...
+ dpkg -i package_folder/clickhouse-common-static-dbg_23.8.16.43.altinitystable+asan_amd64.deb
Selecting previously unselected package clickhouse-common-static-dbg.
(Reading database ... 58878 files and directories currently installed.)
Preparing to unpack .../clickhouse-common-static-dbg_23.8.16.43.altinitystable+asan_amd64.deb ...
Unpacking clickhouse-common-static-dbg (23.8.16.43.altinitystable+asan) ...
Setting up clickhouse-common-static-dbg (23.8.16.43.altinitystable+asan) ...
+ dpkg -i package_folder/clickhouse-server_23.8.16.43.altinitystable+asan_amd64.deb
Selecting previously unselected package clickhouse-server.
(Reading database ... 58887 files and directories currently installed.)
Preparing to unpack .../clickhouse-server_23.8.16.43.altinitystable+asan_amd64.deb ...
Unpacking clickhouse-server (23.8.16.43.altinitystable+asan) ...
Setting up clickhouse-server (23.8.16.43.altinitystable+asan) ...
ClickHouse binary is already located at /usr/bin/clickhouse
Symlink /usr/bin/clickhouse-server already exists but it points to /clickhouse. Will replace the old symlink to /usr/bin/clickhouse.
Creating symlink /usr/bin/clickhouse-server to /usr/bin/clickhouse.
Creating symlink /usr/bin/clickhouse-client to /usr/bin/clickhouse.
Creating symlink /usr/bin/clickhouse-local to /usr/bin/clickhouse.
Creating symlink /usr/bin/clickhouse-benchmark to /usr/bin/clickhouse.
Symlink /usr/bin/clickhouse-copier already exists but it points to /clickhouse. Will replace the old symlink to /usr/bin/clickhouse.
Creating symlink /usr/bin/clickhouse-copier to /usr/bin/clickhouse.
Creating symlink /usr/bin/clickhouse-obfuscator to /usr/bin/clickhouse.
Creating symlink /usr/bin/clickhouse-git-import to /usr/bin/clickhouse.
Creating symlink /usr/bin/clickhouse-compressor to /usr/bin/clickhouse.
Creating symlink /usr/bin/clickhouse-format to /usr/bin/clickhouse.
Symlink /usr/bin/clickhouse-extract-from-config already exists but it points to /clickhouse. Will replace the old symlink to /usr/bin/clickhouse.
Creating symlink /usr/bin/clickhouse-extract-from-config to /usr/bin/clickhouse.
Symlink /usr/bin/clickhouse-keeper already exists but it points to /clickhouse. Will replace the old symlink to /usr/bin/clickhouse.
Creating symlink /usr/bin/clickhouse-keeper to /usr/bin/clickhouse.
Symlink /usr/bin/clickhouse-keeper-converter already exists but it points to /clickhouse. Will replace the old symlink to /usr/bin/clickhouse.
Creating symlink /usr/bin/clickhouse-keeper-converter to /usr/bin/clickhouse.
Creating symlink /usr/bin/clickhouse-disks to /usr/bin/clickhouse.
Creating clickhouse group if it does not exist.
groupadd -r clickhouse
Creating clickhouse user if it does not exist.
useradd -r --shell /bin/false --home-dir /nonexistent -g clickhouse clickhouse
Will set ulimits for clickhouse user in /etc/security/limits.d/clickhouse.conf.
Creating config directory /etc/clickhouse-server/config.d that is used for tweaks of main server configuration.
Creating config directory /etc/clickhouse-server/users.d that is used for tweaks of users configuration.
Config file /etc/clickhouse-server/config.xml already exists, will keep it and extract path info from it.
/etc/clickhouse-server/config.xml has /var/lib/clickhouse/ as data path.
/etc/clickhouse-server/config.xml has /var/log/clickhouse-server/ as log path.
Users config file /etc/clickhouse-server/users.xml already exists, will keep it and extract users info from it.
Log directory /var/log/clickhouse-server/ already exists.
Creating data directory /var/lib/clickhouse/.
Creating pid directory /var/run/clickhouse-server.
chown -R clickhouse:clickhouse '/var/log/clickhouse-server/'
chown -R clickhouse:clickhouse '/var/run/clickhouse-server'
chown clickhouse:clickhouse '/var/lib/clickhouse/'
groupadd -r clickhouse-bridge
useradd -r --shell /bin/false --home-dir /nonexistent -g clickhouse-bridge clickhouse-bridge
chown -R clickhouse-bridge:clickhouse-bridge '/usr/bin/clickhouse-odbc-bridge'
chown -R clickhouse-bridge:clickhouse-bridge '/usr/bin/clickhouse-library-bridge'
[1mPassword for default user is empty string. See /etc/clickhouse-server/users.xml and /etc/clickhouse-server/users.d to change it.[0m
Setting capabilities for clickhouse binary. This is optional.
chown -R clickhouse:clickhouse '/etc/clickhouse-server'
ClickHouse has been successfully installed.
Start clickhouse-server with:
sudo clickhouse start
Start clickhouse-client with:
clickhouse-client
+ dpkg -i package_folder/clickhouse-client_23.8.16.43.altinitystable+asan_amd64.deb
Selecting previously unselected package clickhouse-client.
(Reading database ... 58906 files and directories currently installed.)
Preparing to unpack .../clickhouse-client_23.8.16.43.altinitystable+asan_amd64.deb ...
Unpacking clickhouse-client (23.8.16.43.altinitystable+asan) ...
Setting up clickhouse-client (23.8.16.43.altinitystable+asan) ...
+ export THREAD_FUZZER_CPU_TIME_PERIOD_US=1000
+ THREAD_FUZZER_CPU_TIME_PERIOD_US=1000
+ export THREAD_FUZZER_SLEEP_PROBABILITY=0.1
+ THREAD_FUZZER_SLEEP_PROBABILITY=0.1
+ export THREAD_FUZZER_SLEEP_TIME_US=100000
+ THREAD_FUZZER_SLEEP_TIME_US=100000
+ export THREAD_FUZZER_pthread_mutex_lock_BEFORE_MIGRATE_PROBABILITY=1
+ THREAD_FUZZER_pthread_mutex_lock_BEFORE_MIGRATE_PROBABILITY=1
+ export THREAD_FUZZER_pthread_mutex_lock_AFTER_MIGRATE_PROBABILITY=1
+ THREAD_FUZZER_pthread_mutex_lock_AFTER_MIGRATE_PROBABILITY=1
+ export THREAD_FUZZER_pthread_mutex_unlock_BEFORE_MIGRATE_PROBABILITY=1
+ THREAD_FUZZER_pthread_mutex_unlock_BEFORE_MIGRATE_PROBABILITY=1
+ export THREAD_FUZZER_pthread_mutex_unlock_AFTER_MIGRATE_PROBABILITY=1
+ THREAD_FUZZER_pthread_mutex_unlock_AFTER_MIGRATE_PROBABILITY=1
+ export THREAD_FUZZER_pthread_mutex_lock_BEFORE_SLEEP_PROBABILITY=0.001
+ THREAD_FUZZER_pthread_mutex_lock_BEFORE_SLEEP_PROBABILITY=0.001
+ export THREAD_FUZZER_pthread_mutex_lock_AFTER_SLEEP_PROBABILITY=0.001
+ THREAD_FUZZER_pthread_mutex_lock_AFTER_SLEEP_PROBABILITY=0.001
+ export THREAD_FUZZER_pthread_mutex_unlock_BEFORE_SLEEP_PROBABILITY=0.001
+ THREAD_FUZZER_pthread_mutex_unlock_BEFORE_SLEEP_PROBABILITY=0.001
+ export THREAD_FUZZER_pthread_mutex_unlock_AFTER_SLEEP_PROBABILITY=0.001
+ THREAD_FUZZER_pthread_mutex_unlock_AFTER_SLEEP_PROBABILITY=0.001
+ export THREAD_FUZZER_pthread_mutex_lock_BEFORE_SLEEP_TIME_US=10000
+ THREAD_FUZZER_pthread_mutex_lock_BEFORE_SLEEP_TIME_US=10000
+ export THREAD_FUZZER_pthread_mutex_lock_AFTER_SLEEP_TIME_US=10000
+ THREAD_FUZZER_pthread_mutex_lock_AFTER_SLEEP_TIME_US=10000
+ export THREAD_FUZZER_pthread_mutex_unlock_BEFORE_SLEEP_TIME_US=10000
+ THREAD_FUZZER_pthread_mutex_unlock_BEFORE_SLEEP_TIME_US=10000
+ export THREAD_FUZZER_pthread_mutex_unlock_AFTER_SLEEP_TIME_US=10000
+ THREAD_FUZZER_pthread_mutex_unlock_AFTER_SLEEP_TIME_US=10000
+ export THREAD_FUZZER_EXPLICIT_SLEEP_PROBABILITY=0.01
+ THREAD_FUZZER_EXPLICIT_SLEEP_PROBABILITY=0.01
+ export THREAD_FUZZER_EXPLICIT_MEMORY_EXCEPTION_PROBABILITY=0.01
+ THREAD_FUZZER_EXPLICIT_MEMORY_EXCEPTION_PROBABILITY=0.01
+ export ZOOKEEPER_FAULT_INJECTION=1
+ ZOOKEEPER_FAULT_INJECTION=1
+ configure
+ export USE_DATABASE_ORDINARY=1
+ USE_DATABASE_ORDINARY=1
+ export EXPORT_S3_STORAGE_POLICIES=1
+ EXPORT_S3_STORAGE_POLICIES=1
+ /usr/share/clickhouse-test/config/install.sh
+ DEST_SERVER_PATH=/etc/clickhouse-server
+ DEST_CLIENT_PATH=/etc/clickhouse-client
+++ dirname /usr/share/clickhouse-test/config/install.sh
++ cd /usr/share/clickhouse-test/config
++ pwd -P
+ SRC_PATH=/usr/share/clickhouse-test/config
+ echo 'Going to install test configs from /usr/share/clickhouse-test/config into /etc/clickhouse-server'
+ mkdir -p /etc/clickhouse-server/config.d/
Going to install test configs from /usr/share/clickhouse-test/config into /etc/clickhouse-server
+ mkdir -p /etc/clickhouse-server/users.d/
+ mkdir -p /etc/clickhouse-client
+ ln -sf /usr/share/clickhouse-test/config/config.d/zookeeper_write.xml /etc/clickhouse-server/config.d/
+ ln -sf /usr/share/clickhouse-test/config/config.d/listen.xml /etc/clickhouse-server/config.d/
+ ln -sf /usr/share/clickhouse-test/config/config.d/text_log.xml /etc/clickhouse-server/config.d/
+ ln -sf /usr/share/clickhouse-test/config/config.d/custom_settings_prefixes.xml /etc/clickhouse-server/config.d/
+ ln -sf /usr/share/clickhouse-test/config/config.d/enable_access_control_improvements.xml /etc/clickhouse-server/config.d/
+ ln -sf /usr/share/clickhouse-test/config/config.d/macros.xml /etc/clickhouse-server/config.d/
+ ln -sf /usr/share/clickhouse-test/config/config.d/disks.xml /etc/clickhouse-server/config.d/
+ ln -sf /usr/share/clickhouse-test/config/config.d/secure_ports.xml /etc/clickhouse-server/config.d/
+ ln -sf /usr/share/clickhouse-test/config/config.d/clusters.xml /etc/clickhouse-server/config.d/
+ ln -sf /usr/share/clickhouse-test/config/config.d/graphite.xml /etc/clickhouse-server/config.d/
+ ln -sf /usr/share/clickhouse-test/config/config.d/database_atomic.xml /etc/clickhouse-server/config.d/
+ ln -sf /usr/share/clickhouse-test/config/config.d/max_concurrent_queries.xml /etc/clickhouse-server/config.d/
+ ln -sf /usr/share/clickhouse-test/config/config.d/merge_tree_settings.xml /etc/clickhouse-server/config.d/
+ ln -sf /usr/share/clickhouse-test/config/config.d/merge_tree_old_dirs_cleanup.xml /etc/clickhouse-server/config.d/
+ ln -sf /usr/share/clickhouse-test/config/config.d/test_cluster_with_incorrect_pw.xml /etc/clickhouse-server/config.d/
+ ln -sf /usr/share/clickhouse-test/config/config.d/keeper_port.xml /etc/clickhouse-server/config.d/
+ ln -sf /usr/share/clickhouse-test/config/config.d/logging_no_rotate.xml /etc/clickhouse-server/config.d/
+ ln -sf /usr/share/clickhouse-test/config/config.d/merge_tree.xml /etc/clickhouse-server/config.d/
+ ln -sf /usr/share/clickhouse-test/config/config.d/lost_forever_check.xml /etc/clickhouse-server/config.d/
+ ln -sf /usr/share/clickhouse-test/config/config.d/metadata_cache.xml /etc/clickhouse-server/config.d/
+ ln -sf /usr/share/clickhouse-test/config/config.d/tcp_with_proxy.xml /etc/clickhouse-server/config.d/
+ ln -sf /usr/share/clickhouse-test/config/config.d/prometheus.xml /etc/clickhouse-server/config.d/
+ ln -sf /usr/share/clickhouse-test/config/config.d/top_level_domains_lists.xml /etc/clickhouse-server/config.d/
+ ln -sf /usr/share/clickhouse-test/config/config.d/top_level_domains_path.xml /etc/clickhouse-server/config.d/
+ ln -sf /usr/share/clickhouse-test/config/config.d/transactions.xml /etc/clickhouse-server/config.d/
+ ln -sf /usr/share/clickhouse-test/config/config.d/encryption.xml /etc/clickhouse-server/config.d/
+ ln -sf /usr/share/clickhouse-test/config/config.d/CORS.xml /etc/clickhouse-server/config.d/
+ ln -sf /usr/share/clickhouse-test/config/config.d/zookeeper_log.xml /etc/clickhouse-server/config.d/
+ ln -sf /usr/share/clickhouse-test/config/config.d/logger_trace.xml /etc/clickhouse-server/config.d/
+ ln -sf /usr/share/clickhouse-test/config/config.d/named_collection.xml /etc/clickhouse-server/config.d/
+ ln -sf /usr/share/clickhouse-test/config/config.d/ssl_certs.xml /etc/clickhouse-server/config.d/
+ ln -sf /usr/share/clickhouse-test/config/config.d/filesystem_cache_log.xml /etc/clickhouse-server/config.d/
+ ln -sf /usr/share/clickhouse-test/config/config.d/session_log.xml /etc/clickhouse-server/config.d/
+ ln -sf /usr/share/clickhouse-test/config/config.d/system_unfreeze.xml /etc/clickhouse-server/config.d/
+ ln -sf /usr/share/clickhouse-test/config/config.d/enable_zero_copy_replication.xml /etc/clickhouse-server/config.d/
+ ln -sf /usr/share/clickhouse-test/config/config.d/nlp.xml /etc/clickhouse-server/config.d/
+ ln -sf /usr/share/clickhouse-test/config/config.d/forbidden_headers.xml /etc/clickhouse-server/config.d/
+ ln -sf /usr/share/clickhouse-test/config/config.d/enable_keeper_map.xml /etc/clickhouse-server/config.d/
+ ln -sf /usr/share/clickhouse-test/config/config.d/custom_disks_base_path.xml /etc/clickhouse-server/config.d/
+ ln -sf /usr/share/clickhouse-test/config/config.d/display_name.xml /etc/clickhouse-server/config.d/
+ ln -sf /usr/share/clickhouse-test/config/config.d/reverse_dns_query_function.xml /etc/clickhouse-server/config.d/
+ ln -sf /usr/share/clickhouse-test/config/config.d/compressed_marks_and_index.xml /etc/clickhouse-server/config.d/
+ ln -sf /usr/share/clickhouse-test/config/config.d/disable_s3_env_credentials.xml /etc/clickhouse-server/config.d/
+ ln -sf /usr/share/clickhouse-test/config/config.d/enable_wait_for_shutdown_replicated_tables.xml /etc/clickhouse-server/config.d/
+ ln -sf /usr/share/clickhouse-test/config/config.d/backups.xml /etc/clickhouse-server/config.d/
+ ln -sf /usr/share/clickhouse-test/config/config.d/filesystem_caches_path.xml /etc/clickhouse-server/config.d/
+ ln -sf /usr/share/clickhouse-test/config/config.d/validate_tcp_client_information.xml /etc/clickhouse-server/config.d/
+ '[' /etc/clickhouse-server = /etc/clickhouse-server ']'
+ ln -sf /usr/share/clickhouse-test/config/config.d/legacy_geobase.xml /etc/clickhouse-server/config.d/
+ ln -sf /usr/share/clickhouse-test/config/users.d/log_queries.xml /etc/clickhouse-server/users.d/
+ ln -sf /usr/share/clickhouse-test/config/users.d/readonly.xml /etc/clickhouse-server/users.d/
+ ln -sf /usr/share/clickhouse-test/config/users.d/access_management.xml /etc/clickhouse-server/users.d/
+ ln -sf /usr/share/clickhouse-test/config/users.d/database_atomic_drop_detach_sync.xml /etc/clickhouse-server/users.d/
+ ln -sf /usr/share/clickhouse-test/config/users.d/opentelemetry.xml /etc/clickhouse-server/users.d/
+ ln -sf /usr/share/clickhouse-test/config/users.d/remote_queries.xml /etc/clickhouse-server/users.d/
+ ln -sf /usr/share/clickhouse-test/config/users.d/session_log_test.xml /etc/clickhouse-server/users.d/
+ ln -sf /usr/share/clickhouse-test/config/users.d/memory_profiler.xml /etc/clickhouse-server/users.d/
+ ln -sf /usr/share/clickhouse-test/config/users.d/no_fsync_metadata.xml /etc/clickhouse-server/users.d/
+ ln -sf /usr/share/clickhouse-test/config/users.d/filelog.xml /etc/clickhouse-server/users.d/
+ ln -sf /usr/share/clickhouse-test/config/users.d/enable_blobs_check.xml /etc/clickhouse-server/users.d/
+ ln -sf /usr/share/clickhouse-test/config/users.d/marks.xml /etc/clickhouse-server/users.d/
+ ln -sf /usr/share/clickhouse-test/config/users.d/insert_keeper_retries.xml /etc/clickhouse-server/users.d/
+ ln -sf /usr/share/clickhouse-test/config/users.d/prefetch_settings.xml /etc/clickhouse-server/users.d/
+ ln -sf /usr/share/clickhouse-test/config/users.d/nonconst_timezone.xml /etc/clickhouse-server/users.d/
+ [[ -n '' ]]
+ ln -sf /usr/share/clickhouse-test/config/users.d/timeouts.xml /etc/clickhouse-server/users.d/
+ ln -sf /usr/share/clickhouse-test/config/ints_dictionary.xml /etc/clickhouse-server/
+ ln -sf /usr/share/clickhouse-test/config/strings_dictionary.xml /etc/clickhouse-server/
+ ln -sf /usr/share/clickhouse-test/config/decimals_dictionary.xml /etc/clickhouse-server/
+ ln -sf /usr/share/clickhouse-test/config/executable_dictionary.xml /etc/clickhouse-server/
+ ln -sf /usr/share/clickhouse-test/config/executable_pool_dictionary.xml /etc/clickhouse-server/
+ ln -sf /usr/share/clickhouse-test/config/test_function.xml /etc/clickhouse-server/
+ ln -sf /usr/share/clickhouse-test/config/top_level_domains /etc/clickhouse-server/
+ ln -sf /usr/share/clickhouse-test/config/regions_hierarchy.txt /etc/clickhouse-server/config.d/
+ ln -sf /usr/share/clickhouse-test/config/regions_names_en.txt /etc/clickhouse-server/config.d/
+ ln -sf /usr/share/clickhouse-test/config/ext-en.txt /etc/clickhouse-server/config.d/
+ ln -sf /usr/share/clickhouse-test/config/ext-ru.txt /etc/clickhouse-server/config.d/
+ ln -sf /usr/share/clickhouse-test/config/lem-en.bin /etc/clickhouse-server/config.d/
+ ln -sf /usr/share/clickhouse-test/config/server.key /etc/clickhouse-server/
+ ln -sf /usr/share/clickhouse-test/config/server.crt /etc/clickhouse-server/
+ ln -sf /usr/share/clickhouse-test/config/dhparam.pem /etc/clickhouse-server/
+ ln -sf --backup=simple --suffix=_original.xml /usr/share/clickhouse-test/config/config.d/query_masking_rules.xml /etc/clickhouse-server/config.d/
+ [[ -n 1 ]]
+ [[ 1 -eq 1 ]]
+ rm -f /etc/clickhouse-server/config.d/zookeeper.xml
+ ln -sf /usr/share/clickhouse-test/config/config.d/zookeeper_fault_injection.xml /etc/clickhouse-server/config.d/
+ create_snapshot_on_exit=0
+ sed --follow-symlinks -i 's|true|0|' /etc/clickhouse-server/config.d/keeper_port.xml
+ [[ -n '' ]]
+ [[ -n 1 ]]
+ [[ 1 -eq 1 ]]
+ ln -sf /usr/share/clickhouse-test/config/users.d/database_ordinary.xml /etc/clickhouse-server/users.d/
+ [[ -n '' ]]
+ ARM=aarch64
++ uname -m
+ OS=x86_64
+ [[ -n 1 ]]
+ echo x86_64
+ [[ '' -eq 1 ]]
+ [[ x86_64 == \a\a\r\c\h\6\4 ]]
+ echo 'Adding azure configuration'
+ ln -sf /usr/share/clickhouse-test/config/config.d/azure_storage_conf.xml /etc/clickhouse-server/config.d/
x86_64
Adding azure configuration
+ ln -sf /usr/share/clickhouse-test/config/config.d/storage_conf.xml /etc/clickhouse-server/config.d/
+ ln -sf /usr/share/clickhouse-test/config/users.d/s3_cache.xml /etc/clickhouse-server/users.d/
+ [[ -n '' ]]
+ ln -sf /usr/share/clickhouse-test/config/client_config.xml /etc/clickhouse-client/config.xml
+ sudo cat /etc/clickhouse-server/config.d/keeper_port.xml
+ sed 's|100000|10000|'
+ sudo mv /etc/clickhouse-server/config.d/keeper_port.xml.tmp /etc/clickhouse-server/config.d/keeper_port.xml
+ sudo chown clickhouse /etc/clickhouse-server/config.d/keeper_port.xml
+ sudo chgrp clickhouse /etc/clickhouse-server/config.d/keeper_port.xml
+ echo 'ASAN_OPTIONS='\''malloc_context_size=10 verbosity=1 allocator_release_to_os_interval_ms=10000'\'''
+ export 'ASAN_OPTIONS=malloc_context_size=10 allocator_release_to_os_interval_ms=10000'
+ ASAN_OPTIONS='malloc_context_size=10 allocator_release_to_os_interval_ms=10000'
+ sudo chown root: /var/lib/clickhouse
+ echo '1'
+ local total_mem
++ awk '/MemTotal/ { print $(NF-1) }' /proc/meminfo
Setting max_server_memory_usage_to_ram_ratio to 0.5
+ total_mem=32080792
+ total_mem=32850731008
+ max_server_memory_usage_to_ram_ratio=0.5
+ echo 'Setting max_server_memory_usage_to_ram_ratio to 0.5'
+ cat
Setting max_memory_usage_for_user=9855219302 and max_memory_usage for queries to 10G
+ local max_users_mem
+ max_users_mem=9855219302
+ echo 'Setting max_memory_usage_for_user=9855219302 and max_memory_usage for queries to 10G'
+ cat
+ cat
+ cat
+ ./setup_minio.sh stateless
+ azurite-blob --blobHost 0.0.0.0 --blobPort 10000 --debug /azurite_log
+ export MINIO_ROOT_USER=clickhouse
+ MINIO_ROOT_USER=clickhouse
+ export MINIO_ROOT_PASSWORD=clickhouse
+ MINIO_ROOT_PASSWORD=clickhouse
+ main stateless
+ local query_dir
++ check_arg stateless
++ local query_dir
++ '[' '!' 1 -eq 1 ']'
++ case "$1" in
++ query_dir=0_stateless
++ echo 0_stateless
+ query_dir=0_stateless
+ '[' '!' -f ./minio ']'
+ start_minio
+ mkdir -p ./minio_data
+ ./minio --version
minio version RELEASE.2024-07-31T05-46-26Z (commit-id=a9dc061d847277e30c5c6918d6de6f0606f9d285)
Runtime: go1.22.5 linux/amd64
License: GNU AGPLv3 - https://www.gnu.org/licenses/agpl-3.0.html
Copyright: 2015-2024 MinIO, Inc.
+ wait_for_it
+ local counter=0
+ ./minio server --address :11111 ./minio_data
+ local max_counter=60
+ local url=http://localhost:11111
+ params=('--silent' '--verbose')
+ local params
+ curl --silent --verbose http://localhost:11111
+ grep AccessDenied
trying to connect to minio
+ [[ 0 == \6\0 ]]
+ echo 'trying to connect to minio'
+ sleep 1
Azurite Blob service is starting on 0.0.0.0:10000
Azurite Blob service successfully listens on http://0.0.0.0:10000
INFO: Formatting 1st pool, 1 set(s), 1 drives per set.
INFO: WARNING: Host local has more than 0 drives of set. A host failure will result in data becoming unavailable.
MinIO Object Storage Server
Copyright: 2015-2026 MinIO, Inc.
License: GNU AGPLv3 - https://www.gnu.org/licenses/agpl-3.0.html
Version: RELEASE.2024-07-31T05-46-26Z (go1.22.5 linux/amd64)
API: http://172.17.0.2:11111 http://127.0.0.1:11111
WebUI: http://172.17.0.2:36169 http://127.0.0.1:36169
Docs: https://min.io/docs/minio/linux/index.html
+ counter=1
+ curl --silent --verbose http://localhost:11111
+ grep AccessDenied
AccessDeniedAccess Denied./18E29E1A2F4D169F7dc7eb22d3288ec80374614e9088e31d3668a6922ead55932dd2a8e56373820f
+ lsof -i :11111
COMMAND PID USER FD TYPE DEVICE SIZE/OFF NODE NAME
minio 239 root 8u IPv6 32595 0t0 TCP *:11111 (LISTEN)
minio 239 root 9u IPv4 32594 0t0 TCP localhost:11111 (LISTEN)
minio 239 root 10u IPv6 32596 0t0 TCP localhost:11111 (LISTEN)
+ sleep 5
+ setup_minio stateless
+ local test_type=stateless
+ ./mc alias set clickminio http://localhost:11111 clickhouse clickhouse
Added `clickminio` successfully.
+ ./mc admin user add clickminio test testtest
Added user `test` successfully.
+ ./mc admin policy attach clickminio readwrite --user=test
Attached Policies: [readwrite]
To User: test
+ ./mc mb clickminio/test
Bucket created successfully `clickminio/test`.
+ '[' stateless = stateless ']'
+ ./mc anonymous set public clickminio/test
Access permission for `clickminio/test` is set to `public`
+ upload_data 0_stateless /usr/share/clickhouse-test
+ local query_dir=0_stateless
+ local test_path=/usr/share/clickhouse-test
+ local data_path=/usr/share/clickhouse-test/queries/0_stateless/data_minio
++ ls /usr/share/clickhouse-test/queries/0_stateless/data_minio
02366_data.jsonl
+ for file in $(ls "${data_path}")
+ echo 02366_data.jsonl
+ ./mc cp /usr/share/clickhouse-test/queries/0_stateless/data_minio/02366_data.jsonl clickminio/test/02366_data.jsonl
`/usr/share/clickhouse-test/queries/0_stateless/data_minio/02366_data.jsonl` -> `clickminio/test/02366_data.jsonl`
Total: 0 B, Transferred: 0 B, Speed: 0 B/s
02731.arrow
+ for file in $(ls "${data_path}")
+ echo 02731.arrow
+ ./mc cp /usr/share/clickhouse-test/queries/0_stateless/data_minio/02731.arrow clickminio/test/02731.arrow
`/usr/share/clickhouse-test/queries/0_stateless/data_minio/02731.arrow` -> `clickminio/test/02731.arrow`
Total: 3.82 MiB, Transferred: 3.82 MiB, Speed: 79.68 MiB/s
02731.parquet
+ for file in $(ls "${data_path}")
+ echo 02731.parquet
+ ./mc cp /usr/share/clickhouse-test/queries/0_stateless/data_minio/02731.parquet clickminio/test/02731.parquet
`/usr/share/clickhouse-test/queries/0_stateless/data_minio/02731.parquet` -> `clickminio/test/02731.parquet`
Total: 1.57 MiB, Transferred: 1.57 MiB, Speed: 54.28 MiB/s
a.tsv
+ for file in $(ls "${data_path}")
+ echo a.tsv
+ ./mc cp /usr/share/clickhouse-test/queries/0_stateless/data_minio/a.tsv clickminio/test/a.tsv
`/usr/share/clickhouse-test/queries/0_stateless/data_minio/a.tsv` -> `clickminio/test/a.tsv`
Total: 24 B, Transferred: 24 B, Speed: 1.85 KiB/s
+ for file in $(ls "${data_path}")
+ echo b.tsv
+ ./mc cp /usr/share/clickhouse-test/queries/0_stateless/data_minio/b.tsv clickminio/test/b.tsv
b.tsv
`/usr/share/clickhouse-test/queries/0_stateless/data_minio/b.tsv` -> `clickminio/test/b.tsv`
Total: 33 B, Transferred: 33 B, Speed: 2.60 KiB/s
c.tsv
+ for file in $(ls "${data_path}")
+ echo c.tsv
+ ./mc cp /usr/share/clickhouse-test/queries/0_stateless/data_minio/c.tsv clickminio/test/c.tsv
`/usr/share/clickhouse-test/queries/0_stateless/data_minio/c.tsv` -> `clickminio/test/c.tsv`
Total: 33 B, Transferred: 33 B, Speed: 2.51 KiB/s
tsv_with_header.tsv
+ for file in $(ls "${data_path}")
+ echo tsv_with_header.tsv
+ ./mc cp /usr/share/clickhouse-test/queries/0_stateless/data_minio/tsv_with_header.tsv clickminio/test/tsv_with_header.tsv
`/usr/share/clickhouse-test/queries/0_stateless/data_minio/tsv_with_header.tsv` -> `clickminio/test/tsv_with_header.tsv`
Total: 44 B, Transferred: 44 B, Speed: 3.03 KiB/s
+ setup_aws_credentials
+ local minio_root_user=clickhouse
+ local minio_root_password=clickhouse
+ mkdir -p /root/.aws
+ cat
+ config_logs_export_cluster /etc/clickhouse-server/config.d/system_logs_export.yaml
+ set +x
File /tmp/export-logs-config.sh does not exist, do not setup
+ start
+ counter=0
+ clickhouse-client --query 'SELECT 1'
Code: 210. DB::NetException: Connection refused (localhost:9000). (NETWORK_ERROR)
+ '[' 0 -gt 120 ']'
+ clickhouse start --user root
+ sleep 0.5
+ counter=1
+ clickhouse-client --query 'SELECT 1'
Code: 210. DB::NetException: Connection refused (localhost:9000). (NETWORK_ERROR)
+ '[' 1 -gt 120 ']'
+ clickhouse start --user root
+ sleep 0.5
+ counter=2
+ clickhouse-client --query 'SELECT 1'
Code: 210. DB::NetException: Connection refused (localhost:9000). (NETWORK_ERROR)
+ '[' 2 -gt 120 ']'
+ clickhouse start --user root
+ sleep 0.5
+ counter=3
+ clickhouse-client --query 'SELECT 1'
Code: 210. DB::NetException: Connection refused (localhost:9000). (NETWORK_ERROR)
+ '[' 3 -gt 120 ']'
+ clickhouse start --user root
+ sleep 0.5
+ counter=4
+ clickhouse-client --query 'SELECT 1'
Code: 210. DB::NetException: Connection refused (localhost:9000). (NETWORK_ERROR)
+ '[' 4 -gt 120 ']'
+ clickhouse start --user root
+ sleep 0.5
+ counter=5
+ clickhouse-client --query 'SELECT 1'
Code: 210. DB::NetException: Connection refused (localhost:9000). (NETWORK_ERROR)
+ '[' 5 -gt 120 ']'
+ clickhouse start --user root
+ sleep 0.5
+ counter=6
+ clickhouse-client --query 'SELECT 1'
Code: 210. DB::NetException: Connection refused (localhost:9000). (NETWORK_ERROR)
+ '[' 6 -gt 120 ']'
+ clickhouse start --user root
+ sleep 0.5
+ counter=7
+ clickhouse-client --query 'SELECT 1'
Code: 210. DB::NetException: Connection refused (localhost:9000). (NETWORK_ERROR)
+ '[' 7 -gt 120 ']'
+ clickhouse start --user root
+ sleep 0.5
+ counter=8
+ clickhouse-client --query 'SELECT 1'
Code: 210. DB::NetException: Connection refused (localhost:9000). (NETWORK_ERROR)
+ '[' 8 -gt 120 ']'
+ clickhouse start --user root
+ sleep 0.5
+ counter=9
+ clickhouse-client --query 'SELECT 1'
Code: 210. DB::NetException: Connection refused (localhost:9000). (NETWORK_ERROR)
+ '[' 9 -gt 120 ']'
+ clickhouse start --user root
+ sleep 0.5
+ counter=10
+ clickhouse-client --query 'SELECT 1'
Code: 210. DB::NetException: Connection refused (localhost:9000). (NETWORK_ERROR)
+ '[' 10 -gt 120 ']'
+ clickhouse start --user root
+ sleep 0.5
+ counter=11
+ clickhouse-client --query 'SELECT 1'
Code: 210. DB::NetException: Connection refused (localhost:9000). (NETWORK_ERROR)
+ '[' 11 -gt 120 ']'
+ clickhouse start --user root
+ sleep 0.5
+ counter=12
+ clickhouse-client --query 'SELECT 1'
Code: 210. DB::NetException: Connection refused (localhost:9000). (NETWORK_ERROR)
+ '[' 12 -gt 120 ']'
+ clickhouse start --user root
+ sleep 0.5
+ counter=13
+ clickhouse-client --query 'SELECT 1'
Code: 210. DB::NetException: Connection refused (localhost:9000). (NETWORK_ERROR)
+ '[' 13 -gt 120 ']'
+ clickhouse start --user root
+ sleep 0.5
127.0.0.1 - - [28/Oct/2026:06:37:36 +0000] "PUT /devstoreaccount1/cont?restype=container HTTP/1.1" 201 -
127.0.0.1 - - [28/Oct/2026:06:37:36 +0000] "PUT /devstoreaccount1/cont/xxkaqesarhpmmetqfypuvlxvmqfyjyal?blockid=aqluzxmrbdrrldwisdteugdkngjsbibrtqwkljnczrdgpsunssbyjphxlrkbtbsc&comp=block HTTP/1.1" 201 -
127.0.0.1 - - [28/Oct/2026:06:37:36 +0000] "PUT /devstoreaccount1/cont/xxkaqesarhpmmetqfypuvlxvmqfyjyal?comp=blocklist HTTP/1.1" 201 -
127.0.0.1 - - [28/Oct/2026:06:37:36 +0000] "GET /devstoreaccount1/cont/xxkaqesarhpmmetqfypuvlxvmqfyjyal HTTP/1.1" 206 4
127.0.0.1 - - [28/Oct/2026:06:37:36 +0000] "GET /devstoreaccount1/cont/xxkaqesarhpmmetqfypuvlxvmqfyjyal HTTP/1.1" 206 2
+ counter=14
+ clickhouse-client --query 'SELECT 1'
127.0.0.1 - - [28/Oct/2026:06:37:36 +0000] "DELETE /devstoreaccount1/cont/xxkaqesarhpmmetqfypuvlxvmqfyjyal HTTP/1.1" 202 -
1
+ attach_gdb_to_clickhouse
++ kill -l SIGRTMIN
+ RTMIN=34
+ echo '
set follow-fork-mode parent
handle SIGHUP nostop noprint pass
handle SIGINT nostop noprint pass
handle SIGQUIT nostop noprint pass
handle SIGPIPE nostop noprint pass
handle SIGTERM nostop noprint pass
handle SIGUSR1 nostop noprint pass
handle SIGUSR2 nostop noprint pass
handle SIG34 nostop noprint pass
info signals
continue
backtrace full
thread apply all backtrace full
info registers
disassemble /s
up
disassemble /s
up
disassemble /s
p "done"
detach
quit
'
+ sleep 5
+ ts '%Y-%m-%d %H:%M:%S'
++ cat /var/run/clickhouse-server/clickhouse-server.pid
+ gdb -batch -command script.gdb -p 455
+ run_with_retry 60 clickhouse-client --query 'SELECT '\''Connected to clickhouse-server after attaching gdb'\'''
+ [[ hxB =~ e ]]
+ set_e=false
+ set +e
+ local total_retries=60
+ shift
+ local retry=0
+ '[' 0 -ge 60 ']'
+ clickhouse-client --query 'SELECT '\''Connected to clickhouse-server after attaching gdb'\'''
Connected to clickhouse-server after attaching gdb
+ false
+ return
+ setup_logs_replication
+ set +x
File /tmp/export-logs-config.sh does not exist, do not setup
+ /s3downloader --url-prefix https://s3.amazonaws.com/clickhouse-datasets --dataset-names hits visits
INFO:root:Will fetch following datasets: hits, visits
INFO:root:Processing hits
INFO:root:Downloading from https://s3.amazonaws.com/clickhouse-datasets/hits/partitions/hits_v1.tar to temp path /tmp/2o02goxj
INFO:root:Content length is 1271623680 bytes
INFO:root:Downloading finished
INFO:root:Will unpack data from temp path /tmp/2o02goxj to clickhouse db /var/lib/clickhouse/
INFO:root:Unpack finished
INFO:root:Will remove downloaded file /tmp/2o02goxj from filesystem if it exists
INFO:root:Processing of hits finished
INFO:root:Processing visits
INFO:root:Downloading from https://s3.amazonaws.com/clickhouse-datasets/visits/partitions/visits_v1.tar to temp path /tmp/b34h3ut5
INFO:root:Content length is 563968000 bytes
INFO:root:Downloading finished
INFO:root:Will unpack data from temp path /tmp/b34h3ut5 to clickhouse db /var/lib/clickhouse/
INFO:root:Unpack finished
INFO:root:Will remove downloaded file /tmp/b34h3ut5 from filesystem if it exists
INFO:root:Processing of visits finished
INFO:root:Fetch finished, enjoy your tables!
+ chmod 777 -R /var/lib/clickhouse
+ clickhouse-client --query 'ATTACH DATABASE IF NOT EXISTS datasets ENGINE = Ordinary'
+ clickhouse-client --query 'CREATE DATABASE IF NOT EXISTS test'
+ stop
+ local max_tries=90
+ local check_hang=true
+ local pid
++ cat /var/run/clickhouse-server/clickhouse-server.pid
+ pid=455
+ clickhouse stop --max-tries 90 --do-not-kill
script.gdb:13: Error in sourced command file:
No stack.
/var/run/clickhouse-server/clickhouse-server.pid file exists and contains pid = 455.
The process with pid = 455 is running.
Sent terminate signal to process with pid 455.
Waiting for server to stop
/var/run/clickhouse-server/clickhouse-server.pid file exists and contains pid = 455.
The process with pid = 455 is running.
Waiting for server to stop
/var/run/clickhouse-server/clickhouse-server.pid file exists and contains pid = 455.
The process with pid = 455 is running.
Waiting for server to stop
/var/run/clickhouse-server/clickhouse-server.pid file exists and contains pid = 455.
The process with pid = 455 is running.
Waiting for server to stop
/var/run/clickhouse-server/clickhouse-server.pid file exists and contains pid = 455.
The process with pid = 455 is running.
Waiting for server to stop
/var/run/clickhouse-server/clickhouse-server.pid file exists and contains pid = 455.
The process with pid = 455 is running.
Waiting for server to stop
/var/run/clickhouse-server/clickhouse-server.pid file exists and contains pid = 455.
The process with pid = 455 is running.
Waiting for server to stop
Found pid = 455 in the list of running processes.
The process with pid = 455 is running.
Waiting for server to stop
Found pid = 455 in the list of running processes.
The process with pid = 455 is running.
Waiting for server to stop
Found pid = 455 in the list of running processes.
The process with pid = 455 is running.
Waiting for server to stop
Found pid = 455 in the list of running processes.
The process with pid = 455 is running.
Waiting for server to stop
Found pid = 455 in the list of running processes.
The process with pid = 455 is running.
Waiting for server to stop
Found pid = 455 in the list of running processes.
The process with pid = 455 is running.
Waiting for server to stop
Found pid = 455 in the list of running processes.
The process with pid = 455 is running.
Waiting for server to stop
Found pid = 455 in the list of running processes.
The process with pid = 455 is running.
Waiting for server to stop
Found pid = 455 in the list of running processes.
The process with pid = 455 is running.
Waiting for server to stop
Found pid = 455 in the list of running processes.
The process with pid = 455 is running.
Waiting for server to stop
Found pid = 455 in the list of running processes.
The process with pid = 455 is running.
Waiting for server to stop
Found pid = 455 in the list of running processes.
The process with pid = 455 is running.
Waiting for server to stop
Found pid = 455 in the list of running processes.
The process with pid = 455 is running.
Waiting for server to stop
Found pid = 455 in the list of running processes.
The process with pid = 455 is running.
Waiting for server to stop
Found pid = 455 in the list of running processes.
The process with pid = 455 is running.
Waiting for server to stop
Found pid = 455 in the list of running processes.
The process with pid = 455 is running.
Waiting for server to stop
Found pid = 455 in the list of running processes.
The process with pid = 455 is running.
Waiting for server to stop
Found pid = 455 in the list of running processes.
The process with pid = 455 is running.
Waiting for server to stop
Found pid = 455 in the list of running processes.
The process with pid = 455 is running.
Waiting for server to stop
Found pid = 455 in the list of running processes.
The process with pid = 455 is running.
Waiting for server to stop
Found pid = 455 in the list of running processes.
The process with pid = 455 is running.
Waiting for server to stop
Now there is no clickhouse-server process.
Server stopped
+ return
+ mv /var/log/clickhouse-server/clickhouse-server.log /var/log/clickhouse-server/clickhouse-server.initial.log
+ start
+ counter=0
+ clickhouse-client --query 'SELECT 1'
Code: 210. DB::NetException: Connection refused (localhost:9000). (NETWORK_ERROR)
+ '[' 0 -gt 120 ']'
+ clickhouse start --user root
+ sleep 0.5
+ counter=1
+ clickhouse-client --query 'SELECT 1'
Code: 210. DB::NetException: Connection refused (localhost:9000). (NETWORK_ERROR)
+ '[' 1 -gt 120 ']'
+ clickhouse start --user root
+ sleep 0.5
+ counter=2
+ clickhouse-client --query 'SELECT 1'
Code: 210. DB::NetException: Connection refused (localhost:9000). (NETWORK_ERROR)
+ '[' 2 -gt 120 ']'
+ clickhouse start --user root
+ sleep 0.5
+ counter=3
+ clickhouse-client --query 'SELECT 1'
Code: 210. DB::NetException: Connection refused (localhost:9000). (NETWORK_ERROR)
+ '[' 3 -gt 120 ']'
+ clickhouse start --user root
+ sleep 0.5
+ counter=4
+ clickhouse-client --query 'SELECT 1'
Code: 210. DB::NetException: Connection refused (localhost:9000). (NETWORK_ERROR)
+ '[' 4 -gt 120 ']'
+ clickhouse start --user root
+ sleep 0.5
+ counter=5
+ clickhouse-client --query 'SELECT 1'
Code: 210. DB::NetException: Connection refused (localhost:9000). (NETWORK_ERROR)
+ '[' 5 -gt 120 ']'
+ clickhouse start --user root
+ sleep 0.5
+ counter=6
+ clickhouse-client --query 'SELECT 1'
Code: 210. DB::NetException: Connection refused (localhost:9000). (NETWORK_ERROR)
+ '[' 6 -gt 120 ']'
+ clickhouse start --user root
+ sleep 0.5
+ counter=7
+ clickhouse-client --query 'SELECT 1'
Code: 210. DB::NetException: Connection refused (localhost:9000). (NETWORK_ERROR)
+ '[' 7 -gt 120 ']'
+ clickhouse start --user root
+ sleep 0.5
+ counter=8
+ clickhouse-client --query 'SELECT 1'
Code: 210. DB::NetException: Connection refused (localhost:9000). (NETWORK_ERROR)
+ '[' 8 -gt 120 ']'
+ clickhouse start --user root
+ sleep 0.5
+ counter=9
+ clickhouse-client --query 'SELECT 1'
Code: 210. DB::NetException: Connection refused (localhost:9000). (NETWORK_ERROR)
+ '[' 9 -gt 120 ']'
+ clickhouse start --user root
+ sleep 0.5
+ counter=10
+ clickhouse-client --query 'SELECT 1'
Code: 210. DB::NetException: Connection refused (localhost:9000). (NETWORK_ERROR)
+ '[' 10 -gt 120 ']'
+ clickhouse start --user root
+ sleep 0.5
+ counter=11
+ clickhouse-client --query 'SELECT 1'
Code: 210. DB::NetException: Connection refused (localhost:9000). (NETWORK_ERROR)
+ '[' 11 -gt 120 ']'
+ clickhouse start --user root
+ sleep 0.5
+ counter=12
+ clickhouse-client --query 'SELECT 1'
Code: 210. DB::NetException: Connection refused (localhost:9000). (NETWORK_ERROR)
+ '[' 12 -gt 120 ']'
+ clickhouse start --user root
+ sleep 0.5
127.0.0.1 - - [28/Oct/2026:06:40:34 +0000] "PUT /devstoreaccount1/cont?restype=container HTTP/1.1" 409 -
127.0.0.1 - - [28/Oct/2026:06:40:34 +0000] "PUT /devstoreaccount1/cont/zmtwooimfqmjkganpjltxlwpkukobvlb?blockid=rtjywlyswiuqecmqqnprwvfkhryvykxnyknevulutgdtmbqcxlnhdrovnurldogl&comp=block HTTP/1.1" 201 -
127.0.0.1 - - [28/Oct/2026:06:40:34 +0000] "PUT /devstoreaccount1/cont/zmtwooimfqmjkganpjltxlwpkukobvlb?comp=blocklist HTTP/1.1" 201 -
127.0.0.1 - - [28/Oct/2026:06:40:34 +0000] "GET /devstoreaccount1/cont/zmtwooimfqmjkganpjltxlwpkukobvlb HTTP/1.1" 206 4
127.0.0.1 - - [28/Oct/2026:06:40:34 +0000] "GET /devstoreaccount1/cont/zmtwooimfqmjkganpjltxlwpkukobvlb HTTP/1.1" 206 2
127.0.0.1 - - [28/Oct/2026:06:40:34 +0000] "DELETE /devstoreaccount1/cont/zmtwooimfqmjkganpjltxlwpkukobvlb HTTP/1.1" 202 -
+ counter=13
+ clickhouse-client --query 'SELECT 1'
Code: 210. DB::NetException: Connection refused (localhost:9000). (NETWORK_ERROR)
+ '[' 13 -gt 120 ']'
+ clickhouse start --user root
+ sleep 0.5
+ counter=14
+ clickhouse-client --query 'SELECT 1'
Code: 210. DB::NetException: Connection refused (localhost:9000). (NETWORK_ERROR)
+ '[' 14 -gt 120 ']'
+ clickhouse start --user root
+ sleep 0.5
+ counter=15
+ clickhouse-client --query 'SELECT 1'
Code: 210. DB::NetException: Connection refused (localhost:9000). (NETWORK_ERROR)
+ '[' 15 -gt 120 ']'
+ clickhouse start --user root
+ sleep 0.5
+ counter=16
+ clickhouse-client --query 'SELECT 1'
Code: 210. DB::NetException: Connection refused (localhost:9000). (NETWORK_ERROR)
+ '[' 16 -gt 120 ']'
+ clickhouse start --user root
+ sleep 0.5
+ counter=17
+ clickhouse-client --query 'SELECT 1'
Code: 210. DB::NetException: Connection refused (localhost:9000). (NETWORK_ERROR)
+ '[' 17 -gt 120 ']'
+ clickhouse start --user root
+ sleep 0.5
+ counter=18
+ clickhouse-client --query 'SELECT 1'
1
+ attach_gdb_to_clickhouse
++ kill -l SIGRTMIN
+ RTMIN=34
+ echo '
set follow-fork-mode parent
handle SIGHUP nostop noprint pass
handle SIGINT nostop noprint pass
handle SIGQUIT nostop noprint pass
handle SIGPIPE nostop noprint pass
handle SIGTERM nostop noprint pass
handle SIGUSR1 nostop noprint pass
handle SIGUSR2 nostop noprint pass
handle SIG34 nostop noprint pass
info signals
continue
backtrace full
thread apply all backtrace full
info registers
disassemble /s
up
disassemble /s
up
disassemble /s
p "done"
detach
quit
'
+ sleep 5
++ cat /var/run/clickhouse-server/clickhouse-server.pid
+ ts '%Y-%m-%d %H:%M:%S'
+ gdb -batch -command script.gdb -p 975
+ run_with_retry 60 clickhouse-client --query 'SELECT '\''Connected to clickhouse-server after attaching gdb'\'''
+ [[ hxB =~ e ]]
+ set_e=false
+ set +e
+ local total_retries=60
+ shift
+ local retry=0
+ '[' 0 -ge 60 ']'
+ clickhouse-client --query 'SELECT '\''Connected to clickhouse-server after attaching gdb'\'''
Connected to clickhouse-server after attaching gdb
+ false
+ return
+ clickhouse-client --query 'SHOW TABLES FROM datasets'
hits_v1
visits_v1
+ clickhouse-client --query 'SHOW TABLES FROM test'
+ clickhouse-client --query 'CREATE TABLE test.hits_s3 (WatchID UInt64, JavaEnable UInt8, Title String, GoodEvent Int16,
EventTime DateTime, EventDate Date, CounterID UInt32, ClientIP UInt32, ClientIP6 FixedString(16), RegionID UInt32,
UserID UInt64, CounterClass Int8, OS UInt8, UserAgent UInt8, URL String, Referer String, URLDomain String, RefererDomain String,
Refresh UInt8, IsRobot UInt8, RefererCategories Array(UInt16), URLCategories Array(UInt16), URLRegions Array(UInt32),
RefererRegions Array(UInt32), ResolutionWidth UInt16, ResolutionHeight UInt16, ResolutionDepth UInt8, FlashMajor UInt8,
FlashMinor UInt8, FlashMinor2 String, NetMajor UInt8, NetMinor UInt8, UserAgentMajor UInt16, UserAgentMinor FixedString(2),
CookieEnable UInt8, JavascriptEnable UInt8, IsMobile UInt8, MobilePhone UInt8, MobilePhoneModel String, Params String,
IPNetworkID UInt32, TraficSourceID Int8, SearchEngineID UInt16, SearchPhrase String, AdvEngineID UInt8, IsArtifical UInt8,
WindowClientWidth UInt16, WindowClientHeight UInt16, ClientTimeZone Int16, ClientEventTime DateTime, SilverlightVersion1 UInt8,
SilverlightVersion2 UInt8, SilverlightVersion3 UInt32, SilverlightVersion4 UInt16, PageCharset String, CodeVersion UInt32,
IsLink UInt8, IsDownload UInt8, IsNotBounce UInt8, FUniqID UInt64, HID UInt32, IsOldCounter UInt8, IsEvent UInt8,
IsParameter UInt8, DontCountHits UInt8, WithHash UInt8, HitColor FixedString(1), UTCEventTime DateTime, Age UInt8,
Sex UInt8, Income UInt8, Interests UInt16, Robotness UInt8, GeneralInterests Array(UInt16), RemoteIP UInt32,
RemoteIP6 FixedString(16), WindowName Int32, OpenerName Int32, HistoryLength Int16, BrowserLanguage FixedString(2),
BrowserCountry FixedString(2), SocialNetwork String, SocialAction String, HTTPError UInt16, SendTiming Int32,
DNSTiming Int32, ConnectTiming Int32, ResponseStartTiming Int32, ResponseEndTiming Int32, FetchTiming Int32,
RedirectTiming Int32, DOMInteractiveTiming Int32, DOMContentLoadedTiming Int32, DOMCompleteTiming Int32,
LoadEventStartTiming Int32, LoadEventEndTiming Int32, NSToDOMContentLoadedTiming Int32, FirstPaintTiming Int32,
RedirectCount Int8, SocialSourceNetworkID UInt8, SocialSourcePage String, ParamPrice Int64, ParamOrderID String,
ParamCurrency FixedString(3), ParamCurrencyID UInt16, GoalsReached Array(UInt32), OpenstatServiceName String,
OpenstatCampaignID String, OpenstatAdID String, OpenstatSourceID String, UTMSource String, UTMMedium String,
UTMCampaign String, UTMContent String, UTMTerm String, FromTag String, HasGCLID UInt8, RefererHash UInt64,
URLHash UInt64, CLID UInt32, YCLID UInt64, ShareService String, ShareURL String, ShareTitle String,
ParsedParams Nested(Key1 String, Key2 String, Key3 String, Key4 String, Key5 String, ValueDouble Float64),
IslandID FixedString(16), RequestNum UInt32, RequestTry UInt8) ENGINE = MergeTree() PARTITION BY toYYYYMM(EventDate)
ORDER BY (CounterID, EventDate, intHash32(UserID)) SAMPLE BY intHash32(UserID) SETTINGS index_granularity = 8192, storage_policy='\''s3_cache'\'''
+ clickhouse-client --query 'CREATE TABLE test.hits (WatchID UInt64, JavaEnable UInt8, Title String, GoodEvent Int16,
EventTime DateTime, EventDate Date, CounterID UInt32, ClientIP UInt32, ClientIP6 FixedString(16), RegionID UInt32,
UserID UInt64, CounterClass Int8, OS UInt8, UserAgent UInt8, URL String, Referer String, URLDomain String,
RefererDomain String, Refresh UInt8, IsRobot UInt8, RefererCategories Array(UInt16), URLCategories Array(UInt16),
URLRegions Array(UInt32), RefererRegions Array(UInt32), ResolutionWidth UInt16, ResolutionHeight UInt16, ResolutionDepth UInt8,
FlashMajor UInt8, FlashMinor UInt8, FlashMinor2 String, NetMajor UInt8, NetMinor UInt8, UserAgentMajor UInt16,
UserAgentMinor FixedString(2), CookieEnable UInt8, JavascriptEnable UInt8, IsMobile UInt8, MobilePhone UInt8,
MobilePhoneModel String, Params String, IPNetworkID UInt32, TraficSourceID Int8, SearchEngineID UInt16,
SearchPhrase String, AdvEngineID UInt8, IsArtifical UInt8, WindowClientWidth UInt16, WindowClientHeight UInt16,
ClientTimeZone Int16, ClientEventTime DateTime, SilverlightVersion1 UInt8, SilverlightVersion2 UInt8, SilverlightVersion3 UInt32,
SilverlightVersion4 UInt16, PageCharset String, CodeVersion UInt32, IsLink UInt8, IsDownload UInt8, IsNotBounce UInt8,
FUniqID UInt64, HID UInt32, IsOldCounter UInt8, IsEvent UInt8, IsParameter UInt8, DontCountHits UInt8, WithHash UInt8,
HitColor FixedString(1), UTCEventTime DateTime, Age UInt8, Sex UInt8, Income UInt8, Interests UInt16, Robotness UInt8,
GeneralInterests Array(UInt16), RemoteIP UInt32, RemoteIP6 FixedString(16), WindowName Int32, OpenerName Int32,
HistoryLength Int16, BrowserLanguage FixedString(2), BrowserCountry FixedString(2), SocialNetwork String, SocialAction String,
HTTPError UInt16, SendTiming Int32, DNSTiming Int32, ConnectTiming Int32, ResponseStartTiming Int32, ResponseEndTiming Int32,
FetchTiming Int32, RedirectTiming Int32, DOMInteractiveTiming Int32, DOMContentLoadedTiming Int32, DOMCompleteTiming Int32,
LoadEventStartTiming Int32, LoadEventEndTiming Int32, NSToDOMContentLoadedTiming Int32, FirstPaintTiming Int32,
RedirectCount Int8, SocialSourceNetworkID UInt8, SocialSourcePage String, ParamPrice Int64, ParamOrderID String,
ParamCurrency FixedString(3), ParamCurrencyID UInt16, GoalsReached Array(UInt32), OpenstatServiceName String,
OpenstatCampaignID String, OpenstatAdID String, OpenstatSourceID String, UTMSource String, UTMMedium String,
UTMCampaign String, UTMContent String, UTMTerm String, FromTag String, HasGCLID UInt8, RefererHash UInt64,
URLHash UInt64, CLID UInt32, YCLID UInt64, ShareService String, ShareURL String, ShareTitle String,
ParsedParams Nested(Key1 String, Key2 String, Key3 String, Key4 String, Key5 String, ValueDouble Float64),
IslandID FixedString(16), RequestNum UInt32, RequestTry UInt8) ENGINE = MergeTree() PARTITION BY toYYYYMM(EventDate)
ORDER BY (CounterID, EventDate, intHash32(UserID)) SAMPLE BY intHash32(UserID) SETTINGS index_granularity = 8192, storage_policy='\''s3_cache'\'''
+ clickhouse-client --query 'CREATE TABLE test.visits (CounterID UInt32, StartDate Date, Sign Int8, IsNew UInt8,
VisitID UInt64, UserID UInt64, StartTime DateTime, Duration UInt32, UTCStartTime DateTime, PageViews Int32,
Hits Int32, IsBounce UInt8, Referer String, StartURL String, RefererDomain String, StartURLDomain String,
EndURL String, LinkURL String, IsDownload UInt8, TraficSourceID Int8, SearchEngineID UInt16, SearchPhrase String,
AdvEngineID UInt8, PlaceID Int32, RefererCategories Array(UInt16), URLCategories Array(UInt16), URLRegions Array(UInt32),
RefererRegions Array(UInt32), IsYandex UInt8, GoalReachesDepth Int32, GoalReachesURL Int32, GoalReachesAny Int32,
SocialSourceNetworkID UInt8, SocialSourcePage String, MobilePhoneModel String, ClientEventTime DateTime, RegionID UInt32,
ClientIP UInt32, ClientIP6 FixedString(16), RemoteIP UInt32, RemoteIP6 FixedString(16), IPNetworkID UInt32,
SilverlightVersion3 UInt32, CodeVersion UInt32, ResolutionWidth UInt16, ResolutionHeight UInt16, UserAgentMajor UInt16,
UserAgentMinor UInt16, WindowClientWidth UInt16, WindowClientHeight UInt16, SilverlightVersion2 UInt8, SilverlightVersion4 UInt16,
FlashVersion3 UInt16, FlashVersion4 UInt16, ClientTimeZone Int16, OS UInt8, UserAgent UInt8, ResolutionDepth UInt8,
FlashMajor UInt8, FlashMinor UInt8, NetMajor UInt8, NetMinor UInt8, MobilePhone UInt8, SilverlightVersion1 UInt8,
Age UInt8, Sex UInt8, Income UInt8, JavaEnable UInt8, CookieEnable UInt8, JavascriptEnable UInt8, IsMobile UInt8,
BrowserLanguage UInt16, BrowserCountry UInt16, Interests UInt16, Robotness UInt8, GeneralInterests Array(UInt16),
Params Array(String), Goals Nested(ID UInt32, Serial UInt32, EventTime DateTime, Price Int64, OrderID String, CurrencyID UInt32),
WatchIDs Array(UInt64), ParamSumPrice Int64, ParamCurrency FixedString(3), ParamCurrencyID UInt16, ClickLogID UInt64,
ClickEventID Int32, ClickGoodEvent Int32, ClickEventTime DateTime, ClickPriorityID Int32, ClickPhraseID Int32, ClickPageID Int32,
ClickPlaceID Int32, ClickTypeID Int32, ClickResourceID Int32, ClickCost UInt32, ClickClientIP UInt32, ClickDomainID UInt32,
ClickURL String, ClickAttempt UInt8, ClickOrderID UInt32, ClickBannerID UInt32, ClickMarketCategoryID UInt32, ClickMarketPP UInt32,
ClickMarketCategoryName String, ClickMarketPPName String, ClickAWAPSCampaignName String, ClickPageName String, ClickTargetType UInt16,
ClickTargetPhraseID UInt64, ClickContextType UInt8, ClickSelectType Int8, ClickOptions String, ClickGroupBannerID Int32,
OpenstatServiceName String, OpenstatCampaignID String, OpenstatAdID String, OpenstatSourceID String, UTMSource String,
UTMMedium String, UTMCampaign String, UTMContent String, UTMTerm String, FromTag String, HasGCLID UInt8, FirstVisit DateTime,
PredLastVisit Date, LastVisit Date, TotalVisits UInt32, TraficSource Nested(ID Int8, SearchEngineID UInt16, AdvEngineID UInt8,
PlaceID UInt16, SocialSourceNetworkID UInt8, Domain String, SearchPhrase String, SocialSourcePage String), Attendance FixedString(16),
CLID UInt32, YCLID UInt64, NormalizedRefererHash UInt64, SearchPhraseHash UInt64, RefererDomainHash UInt64, NormalizedStartURLHash UInt64,
StartURLDomainHash UInt64, NormalizedEndURLHash UInt64, TopLevelDomain UInt64, URLScheme UInt64, OpenstatServiceNameHash UInt64,
OpenstatCampaignIDHash UInt64, OpenstatAdIDHash UInt64, OpenstatSourceIDHash UInt64, UTMSourceHash UInt64, UTMMediumHash UInt64,
UTMCampaignHash UInt64, UTMContentHash UInt64, UTMTermHash UInt64, FromHash UInt64, WebVisorEnabled UInt8, WebVisorActivity UInt32,
ParsedParams Nested(Key1 String, Key2 String, Key3 String, Key4 String, Key5 String, ValueDouble Float64),
Market Nested(Type UInt8, GoalID UInt32, OrderID String, OrderPrice Int64, PP UInt32, DirectPlaceID UInt32, DirectOrderID UInt32,
DirectBannerID UInt32, GoodID String, GoodName String, GoodQuantity Int32, GoodPrice Int64), IslandID FixedString(16))
ENGINE = CollapsingMergeTree(Sign) PARTITION BY toYYYYMM(StartDate) ORDER BY (CounterID, StartDate, intHash32(UserID), VisitID)
SAMPLE BY intHash32(UserID) SETTINGS index_granularity = 8192, storage_policy='\''s3_cache'\'''
+ clickhouse-client --query 'INSERT INTO test.hits_s3 SELECT * FROM datasets.hits_v1 SETTINGS enable_filesystem_cache_on_write_operations=0'
+ clickhouse-client --query 'INSERT INTO test.hits SELECT * FROM datasets.hits_v1 SETTINGS enable_filesystem_cache_on_write_operations=0'
+ clickhouse-client --query 'INSERT INTO test.visits SELECT * FROM datasets.visits_v1 SETTINGS enable_filesystem_cache_on_write_operations=0'
+ clickhouse-client --query 'DROP TABLE datasets.visits_v1 SYNC'
+ clickhouse-client --query 'DROP TABLE datasets.hits_v1 SYNC'
+ clickhouse-client --query 'SHOW TABLES FROM test'
hits
hits_s3
visits
+ clickhouse-client --query 'SYSTEM STOP THREAD FUZZER'
+ stop
+ local max_tries=90
+ local check_hang=true
+ local pid
++ cat /var/run/clickhouse-server/clickhouse-server.pid
+ pid=975
+ clickhouse stop --max-tries 90 --do-not-kill
/var/run/clickhouse-server/clickhouse-server.pid file exists and contains pid = 975.
The process with pid = 975 is running.
Sent terminate signal to process with pid 975.
Waiting for server to stop
/var/run/clickhouse-server/clickhouse-server.pid file exists and contains pid = 975.
The process with pid = 975 is running.
Waiting for server to stop
/var/run/clickhouse-server/clickhouse-server.pid file exists and contains pid = 975.
The process with pid = 975 is running.
Waiting for server to stop
/var/run/clickhouse-server/clickhouse-server.pid file exists and contains pid = 975.
The process with pid = 975 is running.
Waiting for server to stop
/var/run/clickhouse-server/clickhouse-server.pid file exists and contains pid = 975.
The process with pid = 975 is running.
Waiting for server to stop
Found pid = 975 in the list of running processes.
The process with pid = 975 is running.
Waiting for server to stop
Found pid = 975 in the list of running processes.
The process with pid = 975 is running.
Waiting for server to stop
Found pid = 975 in the list of running processes.
The process with pid = 975 is running.
Waiting for server to stop
Found pid = 975 in the list of running processes.
The process with pid = 975 is running.
Waiting for server to stop
Found pid = 975 in the list of running processes.
The process with pid = 975 is running.
Waiting for server to stop
Found pid = 975 in the list of running processes.
The process with pid = 975 is running.
Waiting for server to stop
Found pid = 975 in the list of running processes.
The process with pid = 975 is running.
Waiting for server to stop
Found pid = 975 in the list of running processes.
The process with pid = 975 is running.
Waiting for server to stop
Found pid = 975 in the list of running processes.
The process with pid = 975 is running.
Waiting for server to stop
Found pid = 975 in the list of running processes.
The process with pid = 975 is running.
Waiting for server to stop
Found pid = 975 in the list of running processes.
The process with pid = 975 is running.
Waiting for server to stop
Found pid = 975 in the list of running processes.
The process with pid = 975 is running.
Waiting for server to stop
Found pid = 975 in the list of running processes.
The process with pid = 975 is running.
Waiting for server to stop
Found pid = 975 in the list of running processes.
The process with pid = 975 is running.
Waiting for server to stop
Found pid = 975 in the list of running processes.
The process with pid = 975 is running.
Waiting for server to stop
Found pid = 975 in the list of running processes.
The process with pid = 975 is running.
Waiting for server to stop
Found pid = 975 in the list of running processes.
The process with pid = 975 is running.
Waiting for server to stop
Found pid = 975 in the list of running processes.
The process with pid = 975 is running.
Waiting for server to stop
Found pid = 975 in the list of running processes.
The process with pid = 975 is running.
Waiting for server to stop
Found pid = 975 in the list of running processes.
The process with pid = 975 is running.
Waiting for server to stop
Now there is no clickhouse-server process.
Server stopped
script.gdb:13: Error in sourced command file:
No stack.
+ return
+ export USE_S3_STORAGE_FOR_MERGE_TREE=1
+ USE_S3_STORAGE_FOR_MERGE_TREE=1
+ export ZOOKEEPER_FAULT_INJECTION=1
+ ZOOKEEPER_FAULT_INJECTION=1
+ configure
+ export USE_DATABASE_ORDINARY=1
+ USE_DATABASE_ORDINARY=1
+ export EXPORT_S3_STORAGE_POLICIES=1
+ EXPORT_S3_STORAGE_POLICIES=1
+ /usr/share/clickhouse-test/config/install.sh
+ DEST_SERVER_PATH=/etc/clickhouse-server
+ DEST_CLIENT_PATH=/etc/clickhouse-client
+++ dirname /usr/share/clickhouse-test/config/install.sh
++ cd /usr/share/clickhouse-test/config
++ pwd -P
Going to install test configs from /usr/share/clickhouse-test/config into /etc/clickhouse-server
+ SRC_PATH=/usr/share/clickhouse-test/config
+ echo 'Going to install test configs from /usr/share/clickhouse-test/config into /etc/clickhouse-server'
+ mkdir -p /etc/clickhouse-server/config.d/
+ mkdir -p /etc/clickhouse-server/users.d/
+ mkdir -p /etc/clickhouse-client
+ ln -sf /usr/share/clickhouse-test/config/config.d/zookeeper_write.xml /etc/clickhouse-server/config.d/
+ ln -sf /usr/share/clickhouse-test/config/config.d/listen.xml /etc/clickhouse-server/config.d/
+ ln -sf /usr/share/clickhouse-test/config/config.d/text_log.xml /etc/clickhouse-server/config.d/
+ ln -sf /usr/share/clickhouse-test/config/config.d/custom_settings_prefixes.xml /etc/clickhouse-server/config.d/
+ ln -sf /usr/share/clickhouse-test/config/config.d/enable_access_control_improvements.xml /etc/clickhouse-server/config.d/
+ ln -sf /usr/share/clickhouse-test/config/config.d/macros.xml /etc/clickhouse-server/config.d/
+ ln -sf /usr/share/clickhouse-test/config/config.d/disks.xml /etc/clickhouse-server/config.d/
+ ln -sf /usr/share/clickhouse-test/config/config.d/secure_ports.xml /etc/clickhouse-server/config.d/
+ ln -sf /usr/share/clickhouse-test/config/config.d/clusters.xml /etc/clickhouse-server/config.d/
+ ln -sf /usr/share/clickhouse-test/config/config.d/graphite.xml /etc/clickhouse-server/config.d/
+ ln -sf /usr/share/clickhouse-test/config/config.d/database_atomic.xml /etc/clickhouse-server/config.d/
+ ln -sf /usr/share/clickhouse-test/config/config.d/max_concurrent_queries.xml /etc/clickhouse-server/config.d/
+ ln -sf /usr/share/clickhouse-test/config/config.d/merge_tree_settings.xml /etc/clickhouse-server/config.d/
+ ln -sf /usr/share/clickhouse-test/config/config.d/merge_tree_old_dirs_cleanup.xml /etc/clickhouse-server/config.d/
+ ln -sf /usr/share/clickhouse-test/config/config.d/test_cluster_with_incorrect_pw.xml /etc/clickhouse-server/config.d/
+ ln -sf /usr/share/clickhouse-test/config/config.d/keeper_port.xml /etc/clickhouse-server/config.d/
+ ln -sf /usr/share/clickhouse-test/config/config.d/logging_no_rotate.xml /etc/clickhouse-server/config.d/
+ ln -sf /usr/share/clickhouse-test/config/config.d/merge_tree.xml /etc/clickhouse-server/config.d/
+ ln -sf /usr/share/clickhouse-test/config/config.d/lost_forever_check.xml /etc/clickhouse-server/config.d/
+ ln -sf /usr/share/clickhouse-test/config/config.d/metadata_cache.xml /etc/clickhouse-server/config.d/
+ ln -sf /usr/share/clickhouse-test/config/config.d/tcp_with_proxy.xml /etc/clickhouse-server/config.d/
+ ln -sf /usr/share/clickhouse-test/config/config.d/prometheus.xml /etc/clickhouse-server/config.d/
+ ln -sf /usr/share/clickhouse-test/config/config.d/top_level_domains_lists.xml /etc/clickhouse-server/config.d/
+ ln -sf /usr/share/clickhouse-test/config/config.d/top_level_domains_path.xml /etc/clickhouse-server/config.d/
+ ln -sf /usr/share/clickhouse-test/config/config.d/transactions.xml /etc/clickhouse-server/config.d/
+ ln -sf /usr/share/clickhouse-test/config/config.d/encryption.xml /etc/clickhouse-server/config.d/
+ ln -sf /usr/share/clickhouse-test/config/config.d/CORS.xml /etc/clickhouse-server/config.d/
+ ln -sf /usr/share/clickhouse-test/config/config.d/zookeeper_log.xml /etc/clickhouse-server/config.d/
+ ln -sf /usr/share/clickhouse-test/config/config.d/logger_trace.xml /etc/clickhouse-server/config.d/
+ ln -sf /usr/share/clickhouse-test/config/config.d/named_collection.xml /etc/clickhouse-server/config.d/
+ ln -sf /usr/share/clickhouse-test/config/config.d/ssl_certs.xml /etc/clickhouse-server/config.d/
+ ln -sf /usr/share/clickhouse-test/config/config.d/filesystem_cache_log.xml /etc/clickhouse-server/config.d/
+ ln -sf /usr/share/clickhouse-test/config/config.d/session_log.xml /etc/clickhouse-server/config.d/
+ ln -sf /usr/share/clickhouse-test/config/config.d/system_unfreeze.xml /etc/clickhouse-server/config.d/
+ ln -sf /usr/share/clickhouse-test/config/config.d/enable_zero_copy_replication.xml /etc/clickhouse-server/config.d/
+ ln -sf /usr/share/clickhouse-test/config/config.d/nlp.xml /etc/clickhouse-server/config.d/
+ ln -sf /usr/share/clickhouse-test/config/config.d/forbidden_headers.xml /etc/clickhouse-server/config.d/
+ ln -sf /usr/share/clickhouse-test/config/config.d/enable_keeper_map.xml /etc/clickhouse-server/config.d/
+ ln -sf /usr/share/clickhouse-test/config/config.d/custom_disks_base_path.xml /etc/clickhouse-server/config.d/
+ ln -sf /usr/share/clickhouse-test/config/config.d/display_name.xml /etc/clickhouse-server/config.d/
+ ln -sf /usr/share/clickhouse-test/config/config.d/reverse_dns_query_function.xml /etc/clickhouse-server/config.d/
+ ln -sf /usr/share/clickhouse-test/config/config.d/compressed_marks_and_index.xml /etc/clickhouse-server/config.d/
+ ln -sf /usr/share/clickhouse-test/config/config.d/disable_s3_env_credentials.xml /etc/clickhouse-server/config.d/
+ ln -sf /usr/share/clickhouse-test/config/config.d/enable_wait_for_shutdown_replicated_tables.xml /etc/clickhouse-server/config.d/
+ ln -sf /usr/share/clickhouse-test/config/config.d/backups.xml /etc/clickhouse-server/config.d/
+ ln -sf /usr/share/clickhouse-test/config/config.d/filesystem_caches_path.xml /etc/clickhouse-server/config.d/
+ ln -sf /usr/share/clickhouse-test/config/config.d/validate_tcp_client_information.xml /etc/clickhouse-server/config.d/
+ '[' /etc/clickhouse-server = /etc/clickhouse-server ']'
+ ln -sf /usr/share/clickhouse-test/config/config.d/legacy_geobase.xml /etc/clickhouse-server/config.d/
+ ln -sf /usr/share/clickhouse-test/config/users.d/log_queries.xml /etc/clickhouse-server/users.d/
+ ln -sf /usr/share/clickhouse-test/config/users.d/readonly.xml /etc/clickhouse-server/users.d/
+ ln -sf /usr/share/clickhouse-test/config/users.d/access_management.xml /etc/clickhouse-server/users.d/
+ ln -sf /usr/share/clickhouse-test/config/users.d/database_atomic_drop_detach_sync.xml /etc/clickhouse-server/users.d/
+ ln -sf /usr/share/clickhouse-test/config/users.d/opentelemetry.xml /etc/clickhouse-server/users.d/
+ ln -sf /usr/share/clickhouse-test/config/users.d/remote_queries.xml /etc/clickhouse-server/users.d/
+ ln -sf /usr/share/clickhouse-test/config/users.d/session_log_test.xml /etc/clickhouse-server/users.d/
+ ln -sf /usr/share/clickhouse-test/config/users.d/memory_profiler.xml /etc/clickhouse-server/users.d/
+ ln -sf /usr/share/clickhouse-test/config/users.d/no_fsync_metadata.xml /etc/clickhouse-server/users.d/
+ ln -sf /usr/share/clickhouse-test/config/users.d/filelog.xml /etc/clickhouse-server/users.d/
+ ln -sf /usr/share/clickhouse-test/config/users.d/enable_blobs_check.xml /etc/clickhouse-server/users.d/
+ ln -sf /usr/share/clickhouse-test/config/users.d/marks.xml /etc/clickhouse-server/users.d/
+ ln -sf /usr/share/clickhouse-test/config/users.d/insert_keeper_retries.xml /etc/clickhouse-server/users.d/
+ ln -sf /usr/share/clickhouse-test/config/users.d/prefetch_settings.xml /etc/clickhouse-server/users.d/
+ ln -sf /usr/share/clickhouse-test/config/users.d/nonconst_timezone.xml /etc/clickhouse-server/users.d/
+ [[ -n '' ]]
+ ln -sf /usr/share/clickhouse-test/config/users.d/timeouts.xml /etc/clickhouse-server/users.d/
+ ln -sf /usr/share/clickhouse-test/config/ints_dictionary.xml /etc/clickhouse-server/
+ ln -sf /usr/share/clickhouse-test/config/strings_dictionary.xml /etc/clickhouse-server/
+ ln -sf /usr/share/clickhouse-test/config/decimals_dictionary.xml /etc/clickhouse-server/
+ ln -sf /usr/share/clickhouse-test/config/executable_dictionary.xml /etc/clickhouse-server/
+ ln -sf /usr/share/clickhouse-test/config/executable_pool_dictionary.xml /etc/clickhouse-server/
+ ln -sf /usr/share/clickhouse-test/config/test_function.xml /etc/clickhouse-server/
+ ln -sf /usr/share/clickhouse-test/config/top_level_domains /etc/clickhouse-server/
+ ln -sf /usr/share/clickhouse-test/config/regions_hierarchy.txt /etc/clickhouse-server/config.d/
+ ln -sf /usr/share/clickhouse-test/config/regions_names_en.txt /etc/clickhouse-server/config.d/
+ ln -sf /usr/share/clickhouse-test/config/ext-en.txt /etc/clickhouse-server/config.d/
+ ln -sf /usr/share/clickhouse-test/config/ext-ru.txt /etc/clickhouse-server/config.d/
+ ln -sf /usr/share/clickhouse-test/config/lem-en.bin /etc/clickhouse-server/config.d/
+ ln -sf /usr/share/clickhouse-test/config/server.key /etc/clickhouse-server/
+ ln -sf /usr/share/clickhouse-test/config/server.crt /etc/clickhouse-server/
+ ln -sf /usr/share/clickhouse-test/config/dhparam.pem /etc/clickhouse-server/
+ ln -sf --backup=simple --suffix=_original.xml /usr/share/clickhouse-test/config/config.d/query_masking_rules.xml /etc/clickhouse-server/config.d/
+ [[ -n 1 ]]
+ [[ 1 -eq 1 ]]
+ rm -f /etc/clickhouse-server/config.d/zookeeper.xml
+ ln -sf /usr/share/clickhouse-test/config/config.d/zookeeper_fault_injection.xml /etc/clickhouse-server/config.d/
+ create_snapshot_on_exit=1
+ sed --follow-symlinks -i 's|true|1|' /etc/clickhouse-server/config.d/keeper_port.xml
+ [[ -n '' ]]
+ [[ -n 1 ]]
+ [[ 1 -eq 1 ]]
+ ln -sf /usr/share/clickhouse-test/config/users.d/database_ordinary.xml /etc/clickhouse-server/users.d/
+ [[ -n 1 ]]
+ [[ 1 -eq 1 ]]
+ ln -sf /usr/share/clickhouse-test/config/config.d/s3_storage_policy_by_default.xml /etc/clickhouse-server/config.d/
+ ARM=aarch64
++ uname -m
x86_64
Adding azure configuration
+ OS=x86_64
+ [[ -n 1 ]]
+ echo x86_64
+ [[ '' -eq 1 ]]
+ [[ x86_64 == \a\a\r\c\h\6\4 ]]
+ echo 'Adding azure configuration'
+ ln -sf /usr/share/clickhouse-test/config/config.d/azure_storage_conf.xml /etc/clickhouse-server/config.d/
+ ln -sf /usr/share/clickhouse-test/config/config.d/storage_conf.xml /etc/clickhouse-server/config.d/
+ ln -sf /usr/share/clickhouse-test/config/users.d/s3_cache.xml /etc/clickhouse-server/users.d/
+ [[ -n '' ]]
+ ln -sf /usr/share/clickhouse-test/config/client_config.xml /etc/clickhouse-client/config.xml
+ sudo cat /etc/clickhouse-server/config.d/keeper_port.xml
+ sed 's|100000|10000|'
+ sudo mv /etc/clickhouse-server/config.d/keeper_port.xml.tmp /etc/clickhouse-server/config.d/keeper_port.xml
+ sudo chown clickhouse /etc/clickhouse-server/config.d/keeper_port.xml
+ sudo chgrp clickhouse /etc/clickhouse-server/config.d/keeper_port.xml
+ echo 'ASAN_OPTIONS='\''malloc_context_size=10 verbosity=1 allocator_release_to_os_interval_ms=10000'\'''
+ export 'ASAN_OPTIONS=malloc_context_size=10 allocator_release_to_os_interval_ms=10000'
+ ASAN_OPTIONS='malloc_context_size=10 allocator_release_to_os_interval_ms=10000'
+ sudo chown root: /var/lib/clickhouse
+ echo '1'
+ local total_mem
++ awk '/MemTotal/ { print $(NF-1) }' /proc/meminfo
+ total_mem=32080792
+ total_mem=32850731008
+ max_server_memory_usage_to_ram_ratio=0.5
+ echo 'Setting max_server_memory_usage_to_ram_ratio to 0.5'
+ cat
Setting max_server_memory_usage_to_ram_ratio to 0.5
+ local max_users_mem
+ max_users_mem=9855219302
+ echo 'Setting max_memory_usage_for_user=9855219302 and max_memory_usage for queries to 10G'
+ cat
Setting max_memory_usage_for_user=9855219302 and max_memory_usage for queries to 10G
+ cat
+ cat
+ sudo cat /etc/clickhouse-server/config.d/s3_storage_policy_by_default.xml
+ sed 's|s3|s3default|'
+ mv /etc/clickhouse-server/config.d/s3_storage_policy_by_default.xml.tmp /etc/clickhouse-server/config.d/s3_storage_policy_by_default.xml
+ sudo chown clickhouse /etc/clickhouse-server/config.d/s3_storage_policy_by_default.xml
+ sudo chgrp clickhouse /etc/clickhouse-server/config.d/s3_storage_policy_by_default.xml
+ sudo cat /etc/clickhouse-server/config.d/logger_trace.xml
+ sed 's|trace|test|'
+ mv /etc/clickhouse-server/config.d/logger_trace.xml.tmp /etc/clickhouse-server/config.d/logger_trace.xml
+ start
+ counter=0
+ clickhouse-client --query 'SELECT 1'
Code: 210. DB::NetException: Connection refused (localhost:9000). (NETWORK_ERROR)
+ '[' 0 -gt 120 ']'
+ clickhouse start --user root
+ sleep 0.5
+ counter=1
+ clickhouse-client --query 'SELECT 1'
Code: 210. DB::NetException: Connection refused (localhost:9000). (NETWORK_ERROR)
+ '[' 1 -gt 120 ']'
+ clickhouse start --user root
+ sleep 0.5
+ counter=2
+ clickhouse-client --query 'SELECT 1'
Code: 210. DB::NetException: Connection refused (localhost:9000). (NETWORK_ERROR)
+ '[' 2 -gt 120 ']'
+ clickhouse start --user root
+ sleep 0.5
+ counter=3
+ clickhouse-client --query 'SELECT 1'
Code: 210. DB::NetException: Connection refused (localhost:9000). (NETWORK_ERROR)
+ '[' 3 -gt 120 ']'
+ clickhouse start --user root
+ sleep 0.5
+ counter=4
+ clickhouse-client --query 'SELECT 1'
Code: 210. DB::NetException: Connection refused (localhost:9000). (NETWORK_ERROR)
+ '[' 4 -gt 120 ']'
+ clickhouse start --user root
+ sleep 0.5
+ counter=5
+ clickhouse-client --query 'SELECT 1'
Code: 210. DB::NetException: Connection refused (localhost:9000). (NETWORK_ERROR)
+ '[' 5 -gt 120 ']'
+ clickhouse start --user root
+ sleep 0.5
+ counter=6
+ clickhouse-client --query 'SELECT 1'
Code: 210. DB::NetException: Connection refused (localhost:9000). (NETWORK_ERROR)
+ '[' 6 -gt 120 ']'
+ clickhouse start --user root
+ sleep 0.5
+ counter=7
+ clickhouse-client --query 'SELECT 1'
Code: 210. DB::NetException: Connection refused (localhost:9000). (NETWORK_ERROR)
+ '[' 7 -gt 120 ']'
+ clickhouse start --user root
+ sleep 0.5
+ counter=8
+ clickhouse-client --query 'SELECT 1'
Code: 210. DB::NetException: Connection refused (localhost:9000). (NETWORK_ERROR)
+ '[' 8 -gt 120 ']'
+ clickhouse start --user root
+ sleep 0.5
+ counter=9
+ clickhouse-client --query 'SELECT 1'
Code: 210. DB::NetException: Connection refused (localhost:9000). (NETWORK_ERROR)
+ '[' 9 -gt 120 ']'
+ clickhouse start --user root
+ sleep 0.5
+ counter=10
+ clickhouse-client --query 'SELECT 1'
Code: 210. DB::NetException: Connection refused (localhost:9000). (NETWORK_ERROR)
+ '[' 10 -gt 120 ']'
+ clickhouse start --user root
+ sleep 0.5
+ counter=11
+ clickhouse-client --query 'SELECT 1'
Code: 210. DB::NetException: Connection refused (localhost:9000). (NETWORK_ERROR)
+ '[' 11 -gt 120 ']'
+ clickhouse start --user root
+ sleep 0.5
+ counter=12
+ clickhouse-client --query 'SELECT 1'
Code: 210. DB::NetException: Connection refused (localhost:9000). (NETWORK_ERROR)
+ '[' 12 -gt 120 ']'
+ clickhouse start --user root
+ sleep 0.5
+ counter=13
+ clickhouse-client --query 'SELECT 1'
Code: 210. DB::NetException: Connection refused (localhost:9000). (NETWORK_ERROR)
+ '[' 13 -gt 120 ']'
+ clickhouse start --user root
+ sleep 0.5
+ counter=14
+ clickhouse-client --query 'SELECT 1'
Code: 210. DB::NetException: Connection refused (localhost:9000). (NETWORK_ERROR)
+ '[' 14 -gt 120 ']'
+ clickhouse start --user root
+ sleep 0.5
127.0.0.1 - - [28/Oct/2026:07:07:47 +0000] "PUT /devstoreaccount1/cont?restype=container HTTP/1.1" 409 -
127.0.0.1 - - [28/Oct/2026:07:07:47 +0000] "PUT /devstoreaccount1/cont/mwpxxyuneqqlipoxhhmjvocaagoqcorj?blockid=ejjkcasbqxzpzcyksgfqxlnaopypszdccldslstntexzksncprnljqohohgucigg&comp=block HTTP/1.1" 201 -
127.0.0.1 - - [28/Oct/2026:07:07:47 +0000] "PUT /devstoreaccount1/cont/mwpxxyuneqqlipoxhhmjvocaagoqcorj?comp=blocklist HTTP/1.1" 201 -
127.0.0.1 - - [28/Oct/2026:07:07:47 +0000] "GET /devstoreaccount1/cont/mwpxxyuneqqlipoxhhmjvocaagoqcorj HTTP/1.1" 206 4
127.0.0.1 - - [28/Oct/2026:07:07:47 +0000] "GET /devstoreaccount1/cont/mwpxxyuneqqlipoxhhmjvocaagoqcorj HTTP/1.1" 206 2
127.0.0.1 - - [28/Oct/2026:07:07:47 +0000] "DELETE /devstoreaccount1/cont/mwpxxyuneqqlipoxhhmjvocaagoqcorj HTTP/1.1" 202 -
+ counter=15
+ clickhouse-client --query 'SELECT 1'
Code: 210. DB::NetException: Connection refused (localhost:9000). (NETWORK_ERROR)
+ '[' 15 -gt 120 ']'
+ clickhouse start --user root
+ sleep 0.5
+ counter=16
+ clickhouse-client --query 'SELECT 1'
Code: 210. DB::NetException: Connection refused (localhost:9000). (NETWORK_ERROR)
+ '[' 16 -gt 120 ']'
+ clickhouse start --user root
+ sleep 0.5
+ counter=17
+ clickhouse-client --query 'SELECT 1'
Code: 210. DB::NetException: Connection refused (localhost:9000). (NETWORK_ERROR)
+ '[' 17 -gt 120 ']'
+ clickhouse start --user root
+ sleep 0.5
+ counter=18
+ clickhouse-client --query 'SELECT 1'
Code: 210. DB::NetException: Connection refused (localhost:9000). (NETWORK_ERROR)
+ '[' 18 -gt 120 ']'
+ clickhouse start --user root
+ sleep 0.5
+ counter=19
+ clickhouse-client --query 'SELECT 1'
Code: 210. DB::NetException: Connection refused (localhost:9000). (NETWORK_ERROR)
+ '[' 19 -gt 120 ']'
+ clickhouse start --user root
+ sleep 0.5
+ counter=20
+ clickhouse-client --query 'SELECT 1'
Code: 210. DB::NetException: Connection refused (localhost:9000). (NETWORK_ERROR)
+ '[' 20 -gt 120 ']'
+ clickhouse start --user root
+ sleep 0.5
+ counter=21
+ clickhouse-client --query 'SELECT 1'
Code: 210. DB::NetException: Connection refused (localhost:9000). (NETWORK_ERROR)
+ '[' 21 -gt 120 ']'
+ clickhouse start --user root
+ sleep 0.5
+ counter=22
+ clickhouse-client --query 'SELECT 1'
Code: 210. DB::NetException: Connection refused (localhost:9000). (NETWORK_ERROR)
+ '[' 22 -gt 120 ']'
+ clickhouse start --user root
+ sleep 0.5
+ counter=23
+ clickhouse-client --query 'SELECT 1'
Code: 210. DB::NetException: Connection refused (localhost:9000). (NETWORK_ERROR)
+ '[' 23 -gt 120 ']'
+ clickhouse start --user root
+ sleep 0.5
+ counter=24
+ clickhouse-client --query 'SELECT 1'
Code: 210. DB::NetException: Connection refused (localhost:9000). (NETWORK_ERROR)
+ '[' 24 -gt 120 ']'
+ clickhouse start --user root
+ sleep 0.5
+ counter=25
+ clickhouse-client --query 'SELECT 1'
1
+ attach_gdb_to_clickhouse
++ kill -l SIGRTMIN
+ RTMIN=34
+ echo '
set follow-fork-mode parent
handle SIGHUP nostop noprint pass
handle SIGINT nostop noprint pass
handle SIGQUIT nostop noprint pass
handle SIGPIPE nostop noprint pass
handle SIGTERM nostop noprint pass
handle SIGUSR1 nostop noprint pass
handle SIGUSR2 nostop noprint pass
handle SIG34 nostop noprint pass
info signals
continue
backtrace full
thread apply all backtrace full
info registers
disassemble /s
up
disassemble /s
up
disassemble /s
p "done"
detach
quit
'
+ sleep 5
+ ts '%Y-%m-%d %H:%M:%S'
++ cat /var/run/clickhouse-server/clickhouse-server.pid
+ gdb -batch -command script.gdb -p 1872
+ run_with_retry 60 clickhouse-client --query 'SELECT '\''Connected to clickhouse-server after attaching gdb'\'''
+ [[ hxB =~ e ]]
+ set_e=false
+ set +e
+ local total_retries=60
+ shift
+ local retry=0
+ '[' 0 -ge 60 ']'
+ clickhouse-client --query 'SELECT '\''Connected to clickhouse-server after attaching gdb'\'''
Connected to clickhouse-server after attaching gdb
+ false
+ return
+ stress --hung-check --drop-databases --output-folder test_output --skip-func-tests '' --global-time-limit 1200
2026-10-28 08:08:41,056 Run func tests '/usr/bin/clickhouse-test --global_time_limit=1200 '
2026-10-28 08:08:41,557 Run func tests '/usr/bin/clickhouse-test --order=random --database=test_1 --client-option join_use_nulls=1 join_algorithm='parallel_hash' use_query_cache=1 memory_tracker_fault_probability=0.001 group_by_use_nulls=1 --global_time_limit=1200 '
2026-10-28 08:08:42,059 Run func tests '/usr/bin/clickhouse-test --order=random --db-engine="Replicated('/test/db/test_2', 's1', 'r1')" --client-option allow_experimental_database_replicated=1 enable_deflate_qpl_codec=1 --global_time_limit=1200 '
2026-10-28 08:08:42,560 Run func tests '/usr/bin/clickhouse-test --order=random --database=test_3 --client-option join_algorithm='partial_merge' group_by_use_nulls=1 --global_time_limit=1200 '
2026-10-28 08:08:43,062 Run func tests '/usr/bin/clickhouse-test --order=random --client-option join_use_nulls=1 use_query_cache=1 --global_time_limit=1200 '
2026-10-28 08:08:43,563 Run func tests '/usr/bin/clickhouse-test --order=random --db-engine="Replicated('/test/db/test_5', 's1', 'r1')" --database=test_5 --client-option allow_experimental_database_replicated=1 enable_deflate_qpl_codec=1 join_algorithm='full_sorting_merge' group_by_use_nulls=1 --global_time_limit=1200 '
2026-10-28 08:08:44,065 Run func tests '/usr/bin/clickhouse-test --order=random --client-option memory_tracker_fault_probability=0.001 --global_time_limit=1200 '
2026-10-28 08:08:44,566 Run func tests '/usr/bin/clickhouse-test --order=random --database=test_7 --client-option join_use_nulls=1 join_algorithm='grace_hash' group_by_use_nulls=1 --global_time_limit=1200 '
2026-10-28 08:08:45,068 Run func tests '/usr/bin/clickhouse-test --order=random --db-engine="Replicated('/test/db/test_8', 's1', 'r1')" --client-option allow_experimental_database_replicated=1 enable_deflate_qpl_codec=1 use_query_cache=1 --global_time_limit=1200 '
2026-10-28 08:08:45,569 Run func tests '/usr/bin/clickhouse-test --order=random --database=test_9 --client-option join_algorithm='auto' max_rows_in_join=1000 group_by_use_nulls=1 --global_time_limit=1200 '
2026-10-28 08:08:46,070 Run func tests '/usr/bin/clickhouse-test --order=random --client-option join_use_nulls=1 --global_time_limit=1200 '
2026-10-28 08:08:46,572 Run func tests '/usr/bin/clickhouse-test --order=random --db-engine="Replicated('/test/db/test_11', 's1', 'r1')" --database=test_11 --client-option allow_experimental_database_replicated=1 enable_deflate_qpl_codec=1 join_algorithm='parallel_hash' use_query_cache=1 memory_tracker_fault_probability=0.001 group_by_use_nulls=1 --global_time_limit=1200 '
2026-10-28 08:08:47,073 Run func tests '/usr/bin/clickhouse-test --order=random --client-option implicit_transaction=1 throw_on_unsupported_query_inside_transaction=0 --global_time_limit=1200 '
2026-10-28 08:08:47,575 Run func tests '/usr/bin/clickhouse-test --order=random --database=test_13 --client-option join_use_nulls=1 join_algorithm='partial_merge' use_query_cache=1 group_by_use_nulls=1 --global_time_limit=1200 '
2026-10-28 08:08:48,076 Run func tests '/usr/bin/clickhouse-test --order=random --db-engine="Replicated('/test/db/test_14', 's1', 'r1')" --client-option allow_experimental_database_replicated=1 enable_deflate_qpl_codec=1 use_query_cache=1 --global_time_limit=1200 '
2026-10-28 08:08:48,577 Run func tests '/usr/bin/clickhouse-test --order=random --database=test_15 --client-option join_algorithm='full_sorting_merge' group_by_use_nulls=1 --global_time_limit=1200 '
2026-10-28 08:08:49,079 Will wait functests to finish
2026-10-28 08:08:49,079 Finished 0 from 16 processes
2026-10-28 08:08:54,081 Finished 0 from 16 processes
2026-10-28 08:08:59,085 Finished 0 from 16 processes
2026-10-28 08:09:04,089 Finished 0 from 16 processes
2026-10-28 08:09:09,093 Finished 0 from 16 processes
2026-10-28 08:09:14,098 Finished 0 from 16 processes
2026-10-28 08:09:19,102 Finished 0 from 16 processes
2026-10-28 08:09:24,105 Finished 0 from 16 processes
2026-10-28 08:09:29,110 Finished 0 from 16 processes
2026-10-28 08:09:34,114 Finished 0 from 16 processes
2026-10-28 08:09:39,117 Finished 0 from 16 processes
2026-10-28 08:09:44,122 Finished 0 from 16 processes
2026-10-28 08:09:49,125 Finished 0 from 16 processes
2026-10-28 08:09:54,129 Finished 0 from 16 processes
2026-10-28 08:09:59,135 Finished 0 from 16 processes
2026-10-28 08:10:04,140 Finished 0 from 16 processes
2026-10-28 08:10:09,141 Finished 0 from 16 processes
2026-10-28 08:10:14,146 Finished 0 from 16 processes
2026-10-28 08:10:19,150 Finished 0 from 16 processes
2026-10-28 08:10:24,153 Finished 0 from 16 processes
2026-10-28 08:10:29,159 Finished 0 from 16 processes
2026-10-28 08:10:34,161 Finished 0 from 16 processes
2026-10-28 08:10:39,165 Finished 0 from 16 processes
2026-10-28 08:10:44,169 Finished 0 from 16 processes
2026-10-28 08:10:49,174 Finished 0 from 16 processes
2026-10-28 08:10:54,178 Finished 0 from 16 processes
2026-10-28 08:10:59,182 Finished 0 from 16 processes
2026-10-28 08:11:04,187 Finished 0 from 16 processes
2026-10-28 08:11:09,191 Finished 0 from 16 processes
2026-10-28 08:11:14,193 Finished 0 from 16 processes
2026-10-28 08:11:19,197 Finished 0 from 16 processes
2026-10-28 08:11:24,201 Finished 0 from 16 processes
2026-10-28 08:11:29,206 Finished 0 from 16 processes
2026-10-28 08:11:34,210 Finished 0 from 16 processes
2026-10-28 08:11:39,214 Finished 0 from 16 processes
2026-10-28 08:11:44,217 Finished 0 from 16 processes
2026-10-28 08:11:49,221 Finished 0 from 16 processes
2026-10-28 08:11:54,225 Finished 0 from 16 processes
2026-10-28 08:11:59,229 Finished 0 from 16 processes
2026-10-28 08:12:04,233 Finished 0 from 16 processes
2026-10-28 08:12:09,237 Finished 0 from 16 processes
2026-10-28 08:12:14,242 Finished 0 from 16 processes
2026-10-28 08:12:19,242 Finished 0 from 16 processes
2026-10-28 08:12:24,247 Finished 0 from 16 processes
2026-10-28 08:12:29,249 Finished 0 from 16 processes
2026-10-28 08:12:34,253 Finished 0 from 16 processes
2026-10-28 08:12:39,258 Finished 0 from 16 processes
2026-10-28 08:12:44,261 Finished 0 from 16 processes
2026-10-28 08:12:49,265 Finished 0 from 16 processes
2026-10-28 08:12:54,267 Finished 0 from 16 processes
2026-10-28 08:12:59,270 Finished 0 from 16 processes
2026-10-28 08:13:04,273 Finished 0 from 16 processes
2026-10-28 08:13:09,277 Finished 0 from 16 processes
2026-10-28 08:13:14,283 Finished 0 from 16 processes
2026-10-28 08:13:19,286 Finished 0 from 16 processes
2026-10-28 08:13:24,289 Finished 0 from 16 processes
2026-10-28 08:13:29,293 Finished 0 from 16 processes
2026-10-28 08:13:34,297 Finished 0 from 16 processes
2026-10-28 08:13:39,301 Finished 0 from 16 processes
2026-10-28 08:13:44,309 Finished 0 from 16 processes
2026-10-28 08:13:49,313 Finished 0 from 16 processes
2026-10-28 08:13:54,318 Finished 0 from 16 processes
2026-10-28 08:13:59,321 Finished 0 from 16 processes
2026-10-28 08:14:04,325 Finished 0 from 16 processes
2026-10-28 08:14:09,329 Finished 0 from 16 processes
2026-10-28 08:14:14,331 Finished 0 from 16 processes
2026-10-28 08:14:19,333 Finished 0 from 16 processes
2026-10-28 08:14:24,337 Finished 0 from 16 processes
2026-10-28 08:14:29,342 Finished 0 from 16 processes
2026-10-28 08:14:34,347 Finished 0 from 16 processes
2026-10-28 08:14:39,349 Finished 0 from 16 processes
2026-10-28 08:14:44,355 Finished 0 from 16 processes
2026-10-28 08:14:49,358 Finished 0 from 16 processes
2026-10-28 08:14:54,363 Finished 0 from 16 processes
2026-10-28 08:14:59,365 Finished 0 from 16 processes
2026-10-28 08:15:04,369 Finished 0 from 16 processes
2026-10-28 08:15:09,374 Finished 0 from 16 processes
2026-10-28 08:15:14,378 Finished 0 from 16 processes
2026-10-28 08:15:19,382 Finished 0 from 16 processes
2026-10-28 08:15:24,385 Finished 0 from 16 processes
2026-10-28 08:15:29,389 Finished 0 from 16 processes
2026-10-28 08:15:34,394 Finished 0 from 16 processes
2026-10-28 08:15:39,399 Finished 0 from 16 processes
2026-10-28 08:15:44,405 Finished 0 from 16 processes
2026-10-28 08:15:49,409 Finished 0 from 16 processes
2026-10-28 08:15:54,413 Finished 0 from 16 processes
2026-10-28 08:15:59,417 Finished 0 from 16 processes
2026-10-28 08:16:04,423 Finished 0 from 16 processes
2026-10-28 08:16:09,425 Finished 0 from 16 processes
2026-10-28 08:16:14,429 Finished 0 from 16 processes
2026-10-28 08:16:19,433 Finished 0 from 16 processes
2026-10-28 08:16:24,437 Finished 0 from 16 processes
2026-10-28 08:16:29,443 Finished 0 from 16 processes
2026-10-28 08:16:34,445 Finished 0 from 16 processes
2026-10-28 08:16:39,450 Finished 0 from 16 processes
2026-10-28 08:16:44,453 Finished 0 from 16 processes
2026-10-28 08:16:49,461 Finished 0 from 16 processes
2026-10-28 08:16:54,462 Finished 0 from 16 processes
2026-10-28 08:16:59,465 Finished 0 from 16 processes
2026-10-28 08:17:04,471 Finished 0 from 16 processes
2026-10-28 08:17:09,474 Finished 0 from 16 processes
2026-10-28 08:17:14,477 Finished 0 from 16 processes
2026-10-28 08:17:19,481 Finished 0 from 16 processes
2026-10-28 08:17:24,485 Finished 0 from 16 processes
2026-10-28 08:17:29,489 Finished 0 from 16 processes
2026-10-28 08:17:34,493 Finished 0 from 16 processes
2026-10-28 08:17:39,497 Finished 0 from 16 processes
2026-10-28 08:17:44,503 Finished 0 from 16 processes
2026-10-28 08:17:49,505 Finished 0 from 16 processes
2026-10-28 08:17:54,510 Finished 0 from 16 processes
2026-10-28 08:17:59,516 Finished 0 from 16 processes
2026-10-28 08:18:04,518 Finished 0 from 16 processes
2026-10-28 08:18:09,522 Finished 0 from 16 processes
2026-10-28 08:18:14,533 Finished 0 from 16 processes
2026-10-28 08:18:19,538 Finished 0 from 16 processes
2026-10-28 08:18:24,541 Finished 0 from 16 processes
2026-10-28 08:18:29,545 Finished 0 from 16 processes
2026-10-28 08:18:34,549 Finished 0 from 16 processes
2026-10-28 08:18:39,565 Finished 0 from 16 processes
2026-10-28 08:18:44,569 Finished 0 from 16 processes
2026-10-28 08:18:49,573 Finished 0 from 16 processes
2026-10-28 08:18:54,577 Finished 0 from 16 processes
2026-10-28 08:18:59,584 Finished 0 from 16 processes
2026-10-28 08:19:04,621 Finished 0 from 16 processes
2026-10-28 08:19:09,627 Finished 0 from 16 processes
2026-10-28 08:19:14,629 Finished 0 from 16 processes
2026-10-28 08:19:19,633 Finished 0 from 16 processes
2026-10-28 08:19:24,641 Finished 0 from 16 processes
2026-10-28 08:19:29,645 Finished 0 from 16 processes
2026-10-28 08:19:34,650 Finished 0 from 16 processes
2026-10-28 08:19:39,657 Finished 0 from 16 processes
2026-10-28 08:19:44,663 Finished 0 from 16 processes
2026-10-28 08:19:49,666 Finished 0 from 16 processes
2026-10-28 08:19:54,669 Finished 0 from 16 processes
2026-10-28 08:19:59,673 Finished 0 from 16 processes
2026-10-28 08:20:04,677 Finished 0 from 16 processes
2026-10-28 08:20:09,681 Finished 0 from 16 processes
2026-10-28 08:20:14,685 Finished 0 from 16 processes
2026-10-28 08:20:19,689 Finished 0 from 16 processes
2026-10-28 08:20:24,693 Finished 0 from 16 processes
2026-10-28 08:20:29,699 Finished 0 from 16 processes
2026-10-28 08:20:34,704 Finished 0 from 16 processes
2026-10-28 08:20:39,705 Finished 0 from 16 processes
2026-10-28 08:20:44,709 Finished 0 from 16 processes
2026-10-28 08:20:49,715 Finished 0 from 16 processes
2026-10-28 08:20:54,719 Finished 0 from 16 processes
2026-10-28 08:20:59,722 Finished 0 from 16 processes
2026-10-28 08:21:04,725 Finished 0 from 16 processes
2026-10-28 08:21:09,729 Finished 0 from 16 processes
2026-10-28 08:21:14,733 Finished 0 from 16 processes
2026-10-28 08:21:19,738 Finished 0 from 16 processes
2026-10-28 08:21:24,744 Finished 0 from 16 processes
2026-10-28 08:21:29,745 Finished 0 from 16 processes
2026-10-28 08:21:34,750 Finished 0 from 16 processes
2026-10-28 08:21:39,753 Finished 0 from 16 processes
2026-10-28 08:21:44,757 Finished 0 from 16 processes
2026-10-28 08:21:49,761 Finished 0 from 16 processes
2026-10-28 08:21:54,766 Finished 0 from 16 processes
2026-10-28 08:21:59,769 Finished 0 from 16 processes
2026-10-28 08:22:04,773 Finished 0 from 16 processes
2026-10-28 08:22:09,777 Finished 0 from 16 processes
2026-10-28 08:22:14,781 Finished 0 from 16 processes
2026-10-28 08:22:19,785 Finished 0 from 16 processes
2026-10-28 08:22:24,789 Finished 0 from 16 processes
2026-10-28 08:22:29,793 Finished 0 from 16 processes
2026-10-28 08:22:34,797 Finished 0 from 16 processes
2026-10-28 08:22:39,801 Finished 0 from 16 processes
2026-10-28 08:22:44,806 Finished 0 from 16 processes
2026-10-28 08:22:49,810 Finished 0 from 16 processes
2026-10-28 08:22:54,813 Finished 0 from 16 processes
2026-10-28 08:22:59,817 Finished 0 from 16 processes
2026-10-28 08:23:04,821 Finished 0 from 16 processes
2026-10-28 08:23:09,827 Finished 0 from 16 processes
2026-10-28 08:23:14,829 Finished 0 from 16 processes
2026-10-28 08:23:19,833 Finished 0 from 16 processes
2026-10-28 08:23:24,837 Finished 0 from 16 processes
2026-10-28 08:23:29,842 Finished 0 from 16 processes
2026-10-28 08:23:34,847 Finished 0 from 16 processes
2026-10-28 08:23:39,849 Finished 0 from 16 processes
2026-10-28 08:23:44,852 Finished 0 from 16 processes
2026-10-28 08:23:49,858 Finished 0 from 16 processes
2026-10-28 08:23:54,863 Finished 0 from 16 processes
2026-10-28 08:23:59,866 Finished 0 from 16 processes
2026-10-28 08:24:04,869 Finished 0 from 16 processes
2026-10-28 08:24:09,873 Finished 0 from 16 processes
2026-10-28 08:24:14,877 Finished 0 from 16 processes
2026-10-28 08:24:19,881 Finished 0 from 16 processes
2026-10-28 08:24:24,886 Finished 0 from 16 processes
2026-10-28 08:24:29,890 Finished 0 from 16 processes
2026-10-28 08:24:34,893 Finished 0 from 16 processes
2026-10-28 08:24:39,897 Finished 0 from 16 processes
2026-10-28 08:24:44,901 Finished 0 from 16 processes
2026-10-28 08:24:49,905 Finished 0 from 16 processes
2026-10-28 08:24:54,910 Finished 0 from 16 processes
2026-10-28 08:24:59,913 Finished 0 from 16 processes
2026-10-28 08:25:04,917 Finished 0 from 16 processes
2026-10-28 08:25:09,923 Finished 0 from 16 processes
2026-10-28 08:25:14,925 Finished 0 from 16 processes
2026-10-28 08:25:19,930 Finished 0 from 16 processes
2026-10-28 08:25:24,931 Finished 0 from 16 processes
2026-10-28 08:25:29,934 Finished 0 from 16 processes
2026-10-28 08:25:34,936 Finished 0 from 16 processes
2026-10-28 08:25:39,941 Finished 0 from 16 processes
2026-10-28 08:25:44,945 Finished 0 from 16 processes
2026-10-28 08:25:49,951 Finished 0 from 16 processes
2026-10-28 08:25:54,953 Finished 0 from 16 processes
2026-10-28 08:25:59,958 Finished 0 from 16 processes
2026-10-28 08:26:04,962 Finished 0 from 16 processes
2026-10-28 08:26:09,967 Finished 0 from 16 processes
2026-10-28 08:26:14,970 Finished 0 from 16 processes
2026-10-28 08:26:19,975 Finished 0 from 16 processes
2026-10-28 08:26:24,976 Finished 0 from 16 processes
2026-10-28 08:26:29,980 Finished 0 from 16 processes
2026-10-28 08:26:34,984 Finished 0 from 16 processes
2026-10-28 08:26:39,989 Finished 0 from 16 processes
2026-10-28 08:26:44,993 Finished 0 from 16 processes
2026-10-28 08:26:49,997 Finished 0 from 16 processes
2026-10-28 08:26:55,002 Finished 0 from 16 processes
2026-10-28 08:27:00,005 Finished 0 from 16 processes
2026-10-28 08:27:05,009 Finished 0 from 16 processes
2026-10-28 08:27:10,013 Finished 0 from 16 processes
2026-10-28 08:27:15,018 Finished 0 from 16 processes
2026-10-28 08:27:20,021 Finished 0 from 16 processes
2026-10-28 08:27:25,025 Finished 0 from 16 processes
2026-10-28 08:27:30,030 Finished 0 from 16 processes
2026-10-28 08:27:35,033 Finished 0 from 16 processes
2026-10-28 08:27:40,037 Finished 0 from 16 processes
2026-10-28 08:27:45,043 Finished 0 from 16 processes
2026-10-28 08:27:50,045 Finished 0 from 16 processes
2026-10-28 08:27:55,049 Finished 0 from 16 processes
2026-10-28 08:28:00,055 Finished 0 from 16 processes
2026-10-28 08:28:05,057 Finished 0 from 16 processes
2026-10-28 08:28:10,062 Finished 0 from 16 processes
2026-10-28 08:28:15,065 Finished 0 from 16 processes
2026-10-28 08:28:20,071 Finished 0 from 16 processes
2026-10-28 08:28:25,073 Finished 0 from 16 processes
2026-10-28 08:28:30,079 Finished 0 from 16 processes
2026-10-28 08:28:35,082 Finished 0 from 16 processes
2026-10-28 08:28:40,085 Finished 0 from 16 processes
2026-10-28 08:28:45,089 Finished 0 from 16 processes
2026-10-28 08:28:50,094 Finished 1 from 16 processes
2026-10-28 08:28:55,098 Finished 3 from 16 processes
2026-10-28 08:29:00,101 Finished 5 from 16 processes
2026-10-28 08:29:05,106 Finished 5 from 16 processes
2026-10-28 08:29:10,110 Finished 5 from 16 processes
2026-10-28 08:29:15,115 Finished 5 from 16 processes
2026-10-28 08:29:20,117 Finished 5 from 16 processes
2026-10-28 08:29:25,123 Finished 5 from 16 processes
2026-10-28 08:29:30,126 Finished 6 from 16 processes
2026-10-28 08:29:35,129 Finished 6 from 16 processes
2026-10-28 08:29:40,135 Finished 6 from 16 processes
2026-10-28 08:29:45,140 Finished 6 from 16 processes
2026-10-28 08:29:50,146 Finished 6 from 16 processes
2026-10-28 08:29:55,151 Finished 6 from 16 processes
2026-10-28 08:30:00,156 Finished 8 from 16 processes
2026-10-28 08:30:05,162 Finished 9 from 16 processes
2026-10-28 08:30:10,165 Finished 9 from 16 processes
2026-10-28 08:30:15,169 Finished 9 from 16 processes
2026-10-28 08:30:20,173 Finished 9 from 16 processes
2026-10-28 08:30:25,178 Finished 11 from 16 processes
2026-10-28 08:30:30,181 Finished 11 from 16 processes
2026-10-28 08:30:35,185 Finished 11 from 16 processes
2026-10-28 08:30:40,189 Finished 11 from 16 processes
2026-10-28 08:30:45,193 Finished 11 from 16 processes
2026-10-28 08:30:50,199 Finished 12 from 16 processes
2026-10-28 08:30:55,200 Finished 12 from 16 processes
2026-10-28 08:31:00,201 Finished 12 from 16 processes
2026-10-28 08:31:05,206 Finished 13 from 16 processes
2026-10-28 08:31:10,206 Finished 13 from 16 processes
2026-10-28 08:31:15,209 Finished 13 from 16 processes
2026-10-28 08:31:20,215 Finished 13 from 16 processes
2026-10-28 08:31:25,217 Finished 13 from 16 processes
2026-10-28 08:31:30,223 Finished 13 from 16 processes
2026-10-28 08:31:35,227 Finished 13 from 16 processes
2026-10-28 08:31:40,229 Finished 13 from 16 processes
2026-10-28 08:31:45,233 Finished 13 from 16 processes
2026-10-28 08:31:50,239 Finished 13 from 16 processes
2026-10-28 08:31:55,244 Finished 13 from 16 processes
2026-10-28 08:32:00,249 Finished 13 from 16 processes
2026-10-28 08:32:05,255 Finished 13 from 16 processes
2026-10-28 08:32:10,259 Finished 13 from 16 processes
2026-10-28 08:32:15,261 Finished 13 from 16 processes
2026-10-28 08:32:20,267 Finished 13 from 16 processes
2026-10-28 08:32:25,270 Finished 13 from 16 processes
2026-10-28 08:32:30,273 Finished 13 from 16 processes
2026-10-28 08:32:35,279 Finished 13 from 16 processes
2026-10-28 08:32:40,284 Finished 13 from 16 processes
2026-10-28 08:32:45,289 Finished 13 from 16 processes
2026-10-28 08:32:50,293 Finished 13 from 16 processes
2026-10-28 08:32:55,297 Finished 13 from 16 processes
2026-10-28 08:33:00,301 Finished 13 from 16 processes
2026-10-28 08:33:05,305 Finished 13 from 16 processes
2026-10-28 08:33:10,311 Finished 13 from 16 processes
2026-10-28 08:33:15,316 Finished 13 from 16 processes
2026-10-28 08:33:20,321 Finished 13 from 16 processes
2026-10-28 08:33:25,327 Finished 14 from 16 processes
2026-10-28 08:33:30,332 Finished 14 from 16 processes
2026-10-28 08:33:35,337 Finished 14 from 16 processes
2026-10-28 08:33:40,343 Finished 14 from 16 processes
2026-10-28 08:33:45,348 Finished 14 from 16 processes
2026-10-28 08:33:50,349 Finished 14 from 16 processes
2026-10-28 08:33:55,355 Finished 14 from 16 processes
2026-10-28 08:34:00,357 Finished 14 from 16 processes
2026-10-28 08:34:05,361 Finished 14 from 16 processes
2026-10-28 08:34:10,366 Finished 14 from 16 processes
2026-10-28 08:34:15,371 Finished 14 from 16 processes
2026-10-28 08:34:20,373 Finished 14 from 16 processes
2026-10-28 08:34:25,379 Finished 14 from 16 processes
2026-10-28 08:34:30,379 Finished 14 from 16 processes
2026-10-28 08:34:35,381 Finished 14 from 16 processes
2026-10-28 08:34:40,385 Finished 14 from 16 processes
2026-10-28 08:34:45,389 Finished 15 from 16 processes
2026-10-28 08:34:50,393 Finished 15 from 16 processes
2026-10-28 08:34:55,399 Finished 15 from 16 processes
2026-10-28 08:35:00,404 Finished 15 from 16 processes
2026-10-28 08:35:05,409 Finished 15 from 16 processes
2026-10-28 08:35:10,413 Finished 15 from 16 processes
2026-10-28 08:35:15,419 Finished 15 from 16 processes
2026-10-28 08:35:20,423 Finished 15 from 16 processes
2026-10-28 08:35:25,425 Finished 15 from 16 processes
2026-10-28 08:35:30,431 Finished 15 from 16 processes
2026-10-28 08:35:35,436 Finished 15 from 16 processes
2026-10-28 08:35:40,441 Finished 15 from 16 processes
2026-10-28 08:35:45,445 Finished 15 from 16 processes
2026-10-28 08:35:50,449 Finished 15 from 16 processes
2026-10-28 08:35:55,453 Finished 15 from 16 processes
2026-10-28 08:36:00,457 Finished 15 from 16 processes
2026-10-28 08:36:05,459 Finished 15 from 16 processes
2026-10-28 08:36:10,464 Finished 15 from 16 processes
2026-10-28 08:36:15,465 Finished 15 from 16 processes
2026-10-28 08:36:20,471 Finished 15 from 16 processes
2026-10-28 08:36:25,476 Finished 15 from 16 processes
2026-10-28 08:36:30,481 Finished 15 from 16 processes
2026-10-28 08:36:35,485 Finished 15 from 16 processes
2026-10-28 08:36:40,491 Finished 15 from 16 processes
2026-10-28 08:36:45,493 Finished 15 from 16 processes
2026-10-28 08:36:50,497 Finished 15 from 16 processes
2026-10-28 08:36:55,501 Finished 15 from 16 processes
2026-10-28 08:37:00,505 Finished 15 from 16 processes
2026-10-28 08:37:05,511 Finished 15 from 16 processes
2026-10-28 08:37:10,516 Finished 15 from 16 processes
2026-10-28 08:37:15,521 Finished 15 from 16 processes
2026-10-28 08:37:20,525 Finished 15 from 16 processes
2026-10-28 08:37:25,531 Finished 15 from 16 processes
2026-10-28 08:37:30,533 Finished 15 from 16 processes
2026-10-28 08:37:35,539 Finished 15 from 16 processes
2026-10-28 08:37:40,544 Finished 15 from 16 processes
2026-10-28 08:37:45,545 Finished 15 from 16 processes
2026-10-28 08:37:50,551 Finished 15 from 16 processes
2026-10-28 08:37:55,553 Finished 15 from 16 processes
2026-10-28 08:38:00,558 Finished 15 from 16 processes
2026-10-28 08:38:05,561 Finished 15 from 16 processes
2026-10-28 08:38:10,565 Finished 15 from 16 processes
2026-10-28 08:38:15,571 Finished 15 from 16 processes
2026-10-28 08:38:20,573 Finished 15 from 16 processes
2026-10-28 08:38:25,577 Finished 15 from 16 processes
2026-10-28 08:38:30,583 Finished 15 from 16 processes
2026-10-28 08:38:35,588 Finished 15 from 16 processes
2026-10-28 08:38:40,589 Finished 15 from 16 processes
2026-10-28 08:38:45,595 All processes finished
2026-10-28 08:38:45,595 Compressing stress logs
2026-10-28 08:38:45,629 Logs compressed
2026-10-28 08:38:45,630 Will terminate gdb (if any)
Quit
2026-10-28 08:43:51,782 Checking if some queries hung
Using queries from '/usr/share/clickhouse-test/queries' directory
Connecting to ClickHouse server... OK
Running 1 stateless tests (MainProcess).
00001_select_1: [ OK ]
1 tests passed. 0 tests skipped. 0.54 s elapsed (MainProcess).
Won't run stateful tests because test data wasn't loaded.
No queries hung.
All tests have finished.
Top patterns of log messages:
count count_% size size_% uniq_loggers uniq_threads levels background_% message_format_string
UInt64 Float64 String Float64 UInt64 UInt64 Array(String) Float64 LowCardinality(String)
9454 0.047 2.43 MiB 0.088 1 300 ['Debug'] 0 (from {}{}{}){}{} {} (stage: {})
9324 0.046 1.40 MiB 0.05 2 300 ['Trace'] 1 {} Creating query context from {} context, user_id: {}, parent context user: {}
9037 0.045 522.55 KiB 0.018 1 368 ['Trace'] 0.001 Access granted: {}{}
8183 0.041 233.49 KiB 0.008 1 300 ['Debug'] 0 Processed in {} sec.
6842 0.034 572.66 KiB 0.02 1 290 ['Debug'] 0 Read {} rows, {} in {} sec., {} rows/sec., {}/sec.
6030 0.03 677.20 KiB 0.024 3 318 ['Debug'] 0.997 {} Authenticated with global context as user {}
6030 0.03 493.20 KiB 0.017 3 318 ['Debug'] 0.997 {} Authenticating user \'{}\' from {}
6016 0.03 528.75 KiB 0.019 3 318 ['Debug'] 0.997 {} Logout, user_id: {}
6012 0.03 657.56 KiB 0.023 2 300 ['Debug'] 1 {} Creating session context with user_id: {}
5769 0.029 257.86 KiB 0.009 1 1 ['Trace'] 1 Processing requests batch, size: {}, bytes: {}
5758 0.029 247.03 KiB 0.009 1 303 ['Debug'] 0.096 Peak memory usage{}: {}.
5582 0.028 424.28 KiB 0.015 1 420 ['Debug'] 0.25 Remove from cache. Key: {}, offset: {}, size: {}
5424 0.027 323.11 KiB 0.011 1 87 ['Debug'] 0.962 Key {} is removed from metadata
4890 0.024 455.65 KiB 0.016 1 300 ['Debug'] 1 Connected {} version {}.{}.{}, revision: {}{}{}.
4890 0.024 158.67 KiB 0.006 1 300 ['Trace'] 1 TCP Request. Address: {}
4809 0.024 115.32 KiB 0.004 1 337 ['Trace'] 0.004 {} -> {}
4653 0.023 122.69 KiB 0.004 1 300 ['Debug'] 1 Done processing connection.
3880 0.019 223.55 KiB 0.008 1 318 ['Debug'] 0.008 Submitting key {} for removal
3019 0.015 357.08 KiB 0.013 187 208 ['Trace'] 0.599 Renaming temporary part {} to {} with tid {}.
2896 0.014 200.82 KiB 0.007 185 323 ['Trace'] 0.771 Trying to reserve {} using storage policy from min volume index {}
2875 0.014 137.00 KiB 0.005 1 199 ['Trace'] 0.588 filled checksums {}
2856 0.014 267.17 KiB 0.009 1 1305 ['Trace'] 0 Aggregated. {} to {} rows (from {}) in {} sec. ({:.3f} rows/sec., {}/sec.)
2472 0.012 1.57 MiB 0.057 1 305 ['Debug'] 0.897 Objects with paths [{}] were removed from S3
2312 0.011 217.39 KiB 0.008 1 23 ['Debug'] 0 Reading {} marks from part {}, total {} rows starting from the beginning of the part
2279 0.011 64.25 KiB 0.002 1 1219 ['Trace'] 0 Aggregation method: {}
2241 0.011 3.44 MiB 0.124 1 281 ['Debug'] 0.89 metadata and objects were removed for [{}], only metadata were removed for [{}].
2095 0.01 22.50 KiB 0.001 1 1168 ['Trace'] 0 Aggregating
1971 0.01 228.99 KiB 0.008 1 17 ['Debug'] 0 Reading {} marks from part {}, total {} rows starting from the beginning of the part, column {}
1844 0.009 40.07 KiB 0.001 206 136 ['Trace'] 1 Execution took {} ms.
1688 0.008 97.19 KiB 0.003 11 11 ['Trace'] 1 Flushing system log, {} entries to flush up to offset {}
1688 0.008 60.30 KiB 0.002 11 11 ['Trace'] 1 Flushed system log up to offset {}
1506 0.007 101.91 KiB 0.004 22 691 ['Trace'] 0 Running binary search on index range for part {} ({} marks)
1506 0.007 43.95 KiB 0.002 22 691 ['Trace'] 0 Found (LEFT) boundary mark: {}
1506 0.007 45.44 KiB 0.002 22 691 ['Trace'] 0 Found (RIGHT) boundary mark: {}
1506 0.007 42.56 KiB 0.001 22 691 ['Trace'] 0 Found {} range in {} steps
1432 0.007 451.28 KiB 0.016 873 533 ['Information'] 0.001 Setting download as failed: {}
1412 0.007 161.33 KiB 0.006 203 651 ['Trace'] 0 Bypassing cache because file segment state is `PARTIALLY_DOWNLOADED_NO_CONTINUATION` and downloaded part already used
1246 0.006 244.69 KiB 0.009 2 93 ['Trace'] 1 HTTP Request for {}. Method: {}, Address: {}, User-Agent: {}{}, Content Type: {}, Transfer Encoding: {}, X-Forwarded-For: {}
1246 0.006 1.08 MiB 0.039 2 93 ['Trace'] 1 Request URI: {}
1182 0.006 24.24 KiB 0.001 2 93 ['Debug'] 0.101 Done processing query
948 0.005 73.14 KiB 0.003 1 236 ['Trace'] 0 Query span trace_id for opentelemetry log: {}
940 0.005 78.57 KiB 0.003 1 717 ['Trace'] 0 An entry for key={} found in cache: sum_of_sizes={}, median_size={}
915 0.005 173.27 KiB 0.006 35 37 ['Trace'] 0 ZooKeeperWithFaultInjection call SUCCEEDED: seed={} func={} path={}
872 0.004 71.26 KiB 0.003 477 403 ['Trace'] 0 No space left in cache to reserve {} bytes, will continue without cache download
823 0.004 121.24 KiB 0.004 1 86 ['Debug'] 0 Merged partially aggregated blocks for bucket #{}. Got {} rows, {} from {} source rows in {} sec. ({:.3f} rows/sec., {}/sec.)
823 0.004 40.61 KiB 0.001 1 86 ['Trace'] 0 Merging partially aggregated blocks (bucket = {}).
794 0.004 65.61 KiB 0.002 1 58 ['Trace'] 0 Reading {} ranges in order from part {}, approx. {} rows starting from {}
774 0.004 42.58 KiB 0.001 1 274 ['Trace'] 0.221 Created HTTP(S) session with {}:{} ({}:{})
749 0.004 101.94 KiB 0.004 1 30 ['Information'] 0.96 Change cancellation status from {} to {}. Log message: {}
677 0.003 32.92 KiB 0.001 56 126 ['Trace'] 1 Scheduling next merge selecting task after {}ms
675 0.003 173.62 KiB 0.006 1 10 ['Information'] 0.007 WriteBufferFromS3 is not finalized in destructor. The file might not be written to S3. {}.
618 0.003 20.67 KiB 0.001 115 93 ['Debug'] 0.008 Key condition: {}
608 0.003 70.44 KiB 0.002 114 92 ['Debug'] 0.008 Selected {}/{} parts by partition key, {} parts by primary key, {}/{} marks by primary key, {} marks to read from {} ranges
565 0.003 57.00 KiB 0.002 1 41 ['Trace'] 0 PREWHERE condition was split into {} steps: {}
564 0.003 52.17 KiB 0.002 1 226 ['Debug'] 0.018 Will evict {} file segments (while reserving {} bytes for {}:{})
539 0.003 28.78 KiB 0.001 45 134 ['Debug'] 0.922 Selected {} parts from {} to {}
530 0.003 18.10 KiB 0.001 1 23 ['Debug'] 0 Selected MergeAlgorithm: {}
530 0.003 43.98 KiB 0.002 1 23 ['Debug'] 0 Merging {} parts: from {} to {} into {} with storage {}
524 0.003 68.55 KiB 0.002 1 23 ['Debug'] 0 Merge sorted {} rows, containing {} columns ({} merged, {} gathered) in {} sec., {} rows/sec., {}/sec.
523 0.003 34.33 KiB 0.001 42 23 ['Trace'] 0 Merged {} parts: [{}, {}] -> {}
521 0.003 26.97 KiB 0.001 98 86 ['Trace'] 0.01 Spreading mark ranges among streams (default reading)
509 0.003 57.28 KiB 0.002 1 58 ['Trace'] 0 No entry found for query {}
505 0.003 20.22 KiB 0.001 1 417 ['Trace'] 0 Converting aggregation data to two-level.
504 0.002 105.88 KiB 0.004 38 15 ['Information'] 1 {} is in use (by merge/mutation/INSERT) (consider increasing temporary_directories_lifetime setting)
503 0.002 11.30 KiB 0 1 422 ['Trace'] 0 Merging aggregated data
464 0.002 56.07 KiB 0.002 179 110 ['Debug'] 0.963 Removing {} parts from filesystem (serially): Parts: [{}]
430 0.002 66.49 KiB 0.002 1 116 ['Debug'] 0.963 Recursively remove path {}: metadata and objects were removed for [{}], only metadata were removed for [{}].
419 0.002 51.92 KiB 0.002 1 2 ['Trace'] 1 MemoryTracking: was {}, peak {}, free memory in arenas {}, will set to {} (RSS), difference: {}
414 0.002 31.33 KiB 0.001 10 263 ['Trace'] 0 Used generic exclusion search over index for part {} with {} steps
407 0.002 55.77 KiB 0.002 53 121 ['Trace'] 1 Checked {} partitions, found {} partitions with parts that may be merged: [{}](max_total_size_to_merge={}, merge_with_ttl_allowed{})
404 0.002 36.02 KiB 0.001 1 70 ['Trace'] 0.619 Close WriteBufferFromS3. {}.
404 0.002 99.13 KiB 0.003 1 69 ['Trace'] 0.616 Create WriteBufferFromS3, {}
402 0.002 50.89 KiB 0.002 1 127 ['Information'] 1 Have {} tables in drop queue ({} of them are in use), will try drop {}
402 0.002 79.37 KiB 0.003 1 127 ['Information'] 1 Removing metadata {} of dropped table {}
402 0.002 29.84 KiB 0.001 1 61 ['Debug'] 0 Waiting for table {} to be finally dropped
401 0.002 42.12 KiB 0.001 1 78 ['Trace'] 0.623 Single part upload has completed. {}, size {}
387 0.002 37.00 KiB 0.001 1 69 ['Trace'] 0.643 finalizeImpl WriteBufferFromS3. {}.
376 0.002 3.30 KiB 0 2 58 ['Trace'] 0.005 No tables
362 0.002 12.95 KiB 0 37 68 ['Debug'] 0 MinMax index condition: {}
356 0.002 32.16 KiB 0.001 56 120 ['Trace'] 1 Insert entry {} to queue with type {}
356 0.002 9.04 KiB 0 56 120 ['Debug'] 1 Pulled {} entries to queue.
356 0.002 20.51 KiB 0.001 56 120 ['Debug'] 1 Pulling {} entries to queue: {} - {}
341 0.002 10.72 KiB 0 16 19 ['Debug'] 0 Requested flush up to offset {}
328 0.002 27.85 KiB 0.001 54 155 ['Trace'] 0.689 Part {} local references is zero, will check blobs can be removed in zookeeper
326 0.002 53.10 KiB 0.002 54 153 ['Trace'] 0.693 Remove zookeeper lock {} for part {}
325 0.002 9.52 KiB 0 56 118 ['Debug'] 0.994 Updating strategy picker state
324 0.002 23.52 KiB 0.001 1 50 ['Trace'] 0 The min valid primary key position for moving to the tail of PREWHERE is {}
314 0.002 39.54 KiB 0.001 16 23 ['Debug'] 0 Part: {}, sum_marks: {}, approx mark size: {}, prefetch_step_bytes: {}, prefetch_step_marks: {}, (ranges: {})
301 0.001 35.69 KiB 0.001 30 23 ['Debug'] 0.944 Removing {} parts from memory: Parts: [{}]
301 0.001 35.40 KiB 0.001 30 23 ['Trace'] 0.944 Found {} old parts to remove. Parts: [{}]
296 0.001 1.11 MiB 0.04 2 25 ['Error'] 0 Table {}.{} does not exist
290 0.001 26.98 KiB 0.001 1 43 ['Trace'] 0 Entry found for query {}
289 0.001 29.44 KiB 0.001 108 207 ['Trace'] 0 Predownload failed because of space limit. Will read from remote filesystem starting from offset: {}
270 0.001 21.88 KiB 0.001 1 16 ['Information'] 0 Write-through cache is stopped as cache limit is reached and nothing can be evicted
270 0.001 108.05 KiB 0.004 1 16 ['Debug'] 0 Failed to reserve space in cache (size: {}, file segment info: {}
255 0.001 4.48 KiB 0 238 70 ['Debug'] 0.075 Loading data parts
239 0.001 5.37 KiB 0 235 67 ['Debug'] 0.067 There are no data parts
234 0.001 20.81 KiB 0.001 1 40 ['Debug'] 0 MergeTreeWhereOptimizer: condition "{}" moved to PREWHERE
226 0.001 431.37 KiB 0.015 3 112 ['Error'] 0.947 Database {} does not exist
220 0.001 20.07 KiB 0.001 1 196 ['Debug'] 0 Merge sorted {} blocks, {} rows in {} sec., {} rows/sec., {}/sec
Top messages without format string (fmt::runtime):
count pattern runtime_message line
UInt64 String String Tuple(String, UInt64)
5 PocoExceptionCodeecodeIOerrorBro Poco::Exception. Code: 1000, e.code() = 32, I/O error: Broken pipe, Stack trace (when copying this message, always include the lines below):\n\n0. ./build_docker/./contrib/llvm-project/libcxx/include/exception:134: Poco::Exception::Exception(String const&, i ('/Exception.cpp',235)
3 Connectiontomysqlfailedtimes Connection to mysql failed 1 times ('',0)
3 mysqlxxConnectionFailed mysqlxx::ConnectionFailed ('',0)
3 Connectingtomysqldbasusermysqlus Connecting to mysql_db@127.123.0.1:3306 as user mysql_user ('',0)
3 CreatinganewMySQLconnectiontomys Creating a new MySQL connection to mysql_db@127.123.0.1:3306 as user mysql_user with settings: connect_timeout=10, read_write_timeout=300 ('',0)
3 Connectiontomysqldbasusermysqlus Connection to mysql_db@127.123.0.1:3306 as user mysql_user failed: mysqlxx::ConnectionFailed: Can\'t connect to MySQL server on \'127.123.0.1\' (115) ((nullptr):0) ('',0)
3 configatindexiscommittedprevconf config at index 1 is committed, prev config log idx 22 ('/LoggerWrapper.h',42)
2 CodeDBExceptionSyntaxerrorfailed Code: 62. DB::Exception: Syntax error: failed at position 1048577 (\'-\'): -. Max query size exceeded: \'-\'. (SYNTAX_ERROR) (version 23.8.16.43.altinitystable (altinity build)) (from [::ffff:127.0.0.1]:51978) (in query: select 1 in (1, 1, ... (truncated 94862 ('/executeQuery.cpp',207)
2 CreatedMySQLPoolwithsettingsconn Created MySQL Pool with settings: connect_timeout=10, read_write_timeout=300, default_connections_number=1, max_connections_number=16 ('',0)
2 skippedconfiglatestconfig skipped config 1, latest config 22 ('/LoggerWrapper.h',42)
2 CodeDBExceptionCouldnotlistobjec Code: 499. DB::Exception: Could not list objects in bucket \'datasets-documentation\' with prefix \'MyPrefix/BU - UNIT - 1/\', S3 exception: `InvalidAccessKeyId`, message: \'The AWS Access Key Id you provided does not exist in our records.\'. (S3_ERROR) (version ('/executeQuery.cpp',207)
2 CodeDBErrnoExceptionCannotrename Code: 521. DB::ErrnoException: Cannot rename /var/lib/clickhouse/metadata/test.sql.tmp to /var/lib/clickhouse/metadata/test.sql because the second path already exists, errno: 17, strerror: File exists. (ATOMIC_RENAME_FAIL) (version 23.8.16.43.altinitystabl ('/executeQuery.cpp',207)
1 Electiontimeoutinitiateleaderele Election timeout, initiate leader election ('/LoggerWrapper.h',42)
1 Thesettingmergetreemetadatacache The setting \'merge_tree_metadata_cache\' is enabled. But the feature of \'metadata cache in RocksDB\' is experimental and is not ready for production. The usage of this feature can lead to data corruption and loss. The setting should be disabled in production ('',0)
1 TablesystemsessionlogisenabledIt Table system.session_log is enabled. It\'s unreliable and may contain garbage. Do not use it for any kind of security monitoring. ('',0)
1 bgappendentriesthreadinitiated bg append_entries thread initiated ('/LoggerWrapper.h',42)
1 ThreadFuzzerisenabledApplication ThreadFuzzer is enabled. Application will run slowly and unstable. ('',0)
1 PocoExceptionCodeecodeNetExcepti Poco::Exception. Code: 1000, e.code() = 107, Net Exception: Socket is not connected, Stack trace (when copying this message, always include the lines below):\n\n0. ./build_docker/./contrib/llvm-project/libcxx/include/exception:134: Poco::Exception::Exception ('/Exception.cpp',235)
1 newconfigurationlogidxprevlogidx new configuration: log idx 185, prev log idx 22\npeer 1, DC ID 0, localhost:9234, voting member, 1\nmy id: 1, leader: 1, term: 3 ('/LoggerWrapper.h',42)
1 invalidelectiontimeoutupperbound invalid election timeout upper bound detected, adjusted to 0 ('/LoggerWrapper.h',42)
1 detectaconfigurationchangethatis detect a configuration change that is not committed yet at index 1 ('/LoggerWrapper.h',42)
1 CodeDBExceptionExceptionConnecti Code: 1000. DB::Exception: Exception: Connections to mysql failed: mysql_db@127.123.0.1:3306 as user mysql_user, ERROR 2002 : mysqlxx::ConnectionFailed: Can\'t connect to MySQL server on \'127.123.0.1\' (115) ((nullptr):0). (POCO_EXCEPTION), Stack trace (when ('/TCPHandler.cpp',680)
1 statemachinecommitindexprecommit state machine commit index 0, precommit index 184, last log index 184 ('/LoggerWrapper.h',42)
1 Thesettingallowremotefszerocopyr The setting \'allow_remote_fs_zero_copy_replication\' is enabled for MergeTree tables. But the feature of \'zero-copy replication\' is under development and is not ready for production. The usage of this feature can lead to data corruption and loss. The settin ('',0)
1 Forkedachildprocesstowatch Forked a child process to watch ('',0)
1 IfthesignaturecheckfailedThiscou If the signature check failed. This could be because of a time skew. Attempting to adjust the signer. ('/AWSLogger.cpp',71)
1 waitforHBforms wait for HB, for 50 + [0, 0] ms ('/LoggerWrapper.h',42)
1 INITRAFTSERVERcommitindextermele === INIT RAFT SERVER ===\ncommit index 0\nterm 2\nelection timer allowed\nlog store start 1, end 184\nconfig log idx 22, prev log idx 1 ('/LoggerWrapper.h',42)
1 PocoExceptionCodeecodeExceptionC Poco::Exception. Code: 1000, e.code() = 0, Exception: Connections to mysql failed: mysql_db@127.123.0.1:3306 as user mysql_user, ERROR 2002 : mysqlxx::ConnectionFailed: Can\'t connect to MySQL server on \'127.123.0.1\' (115) ((nullptr):0) (version 23.8.16.43. ('/executeQuery.cpp',207)
1 BECOMELEADERappendednewconfigat [BECOME LEADER] appended new config at 185 ('/LoggerWrapper.h',42)
Top messages that does not match its format string:
message_format_string count() any_message
LowCardinality(String) UInt64 String
{} is in use (by merge/mutation/INSERT) (consider increasing temporary_directories_lifetime setting) 279 /var/lib/clickhouse/disks/s3_disk/store/d76/d7673ef3-5070-4984-8e46-3fdac5556260/tmp_merge_201403_1_8_1/ is in use (by merge/mutation/INSERT) (consider increasing temporary_directories_lifetime setting) (skipped 1 similar messages)
59 Forked a child process to watch
(from {}{}{}){}{} {} (stage: {}) 1 (from [::1]:54144) (comment: 01957_heredoc_more.sql) SELECT hex($$����$$); (stage: Complete)
Top short messages:
c message_format_string substring(any(message), 1, 120) min_length_without_exception_boilerplate
UInt64 LowCardinality(String) String Int64
1 Found {} on {} Found changelog_1_100000.bin.zstd on LocalLogDisk 23
Top messages by level:
(0.0014656730459755886,'Table {}.{} does not exist') Error
(0.00021291871951672402,'Client has gone away.') Warning
(0.00709068851971974,'Setting download as failed: {}') Information
(0.0468272634992944,'(from {}{}{}){}{} {} (stage: {})') Debug
(0.04618355574261593,'{} Creating query context from {} context, user_id: {}, parent context user: {}') Trace
2026-10-28 08:44:00,386 Stress test finished
+ echo -e 'Test script exit code\tOK\t\N\t'
+ rg -Fa 'No queries hung' /test_output/test_results.tsv
+ grep -Fa OK
No queries hung OK \N
+ stop
+ local max_tries=90
+ local check_hang=true
+ local pid
++ cat /var/run/clickhouse-server/clickhouse-server.pid
+ pid=1872
+ clickhouse stop --max-tries 90 --do-not-kill
/var/run/clickhouse-server/clickhouse-server.pid file exists and contains pid = 1872.
The process with pid = 1872 is running.
Sent terminate signal to process with pid 1872.
Waiting for server to stop
/var/run/clickhouse-server/clickhouse-server.pid file exists and contains pid = 1872.
The process with pid = 1872 is running.
Waiting for server to stop
/var/run/clickhouse-server/clickhouse-server.pid file exists and contains pid = 1872.
The process with pid = 1872 is running.
Waiting for server to stop
/var/run/clickhouse-server/clickhouse-server.pid file exists and contains pid = 1872.
The process with pid = 1872 is running.
Waiting for server to stop
/var/run/clickhouse-server/clickhouse-server.pid file exists and contains pid = 1872.
The process with pid = 1872 is running.
Waiting for server to stop
/var/run/clickhouse-server/clickhouse-server.pid file exists and contains pid = 1872.
The process with pid = 1872 is running.
Waiting for server to stop
/var/run/clickhouse-server/clickhouse-server.pid file exists and contains pid = 1872.
The process with pid = 1872 is running.
Waiting for server to stop
/var/run/clickhouse-server/clickhouse-server.pid file exists and contains pid = 1872.
The process with pid = 1872 is running.
Waiting for server to stop
/var/run/clickhouse-server/clickhouse-server.pid file exists and contains pid = 1872.
The process with pid = 1872 is running.
Waiting for server to stop
/var/run/clickhouse-server/clickhouse-server.pid file exists and contains pid = 1872.
The process with pid = 1872 is running.
Waiting for server to stop
/var/run/clickhouse-server/clickhouse-server.pid file exists and contains pid = 1872.
The process with pid = 1872 is running.
Waiting for server to stop
/var/run/clickhouse-server/clickhouse-server.pid file exists and contains pid = 1872.
The process with pid = 1872 is running.
Waiting for server to stop
/var/run/clickhouse-server/clickhouse-server.pid file exists and contains pid = 1872.
The process with pid = 1872 is running.
Waiting for server to stop
/var/run/clickhouse-server/clickhouse-server.pid file exists and contains pid = 1872.
The process with pid = 1872 is running.
Waiting for server to stop
/var/run/clickhouse-server/clickhouse-server.pid file exists and contains pid = 1872.
The process with pid = 1872 is running.
Waiting for server to stop
/var/run/clickhouse-server/clickhouse-server.pid file exists and contains pid = 1872.
The process with pid = 1872 is running.
Waiting for server to stop
/var/run/clickhouse-server/clickhouse-server.pid file exists and contains pid = 1872.
The process with pid = 1872 is running.
Waiting for server to stop
/var/run/clickhouse-server/clickhouse-server.pid file exists and contains pid = 1872.
The process with pid = 1872 does not exist.
Server stopped
+ return
+ mv /var/log/clickhouse-server/clickhouse-server.log /var/log/clickhouse-server/clickhouse-server.stress.log
+ unset THREAD_FUZZER_CPU_TIME_PERIOD_US THREAD_FUZZER_EXPLICIT_MEMORY_EXCEPTION_PROBABILITY THREAD_FUZZER_EXPLICIT_SLEEP_PROBABILITY THREAD_FUZZER_SLEEP_PROBABILITY THREAD_FUZZER_SLEEP_TIME_US THREAD_FUZZER_pthread_mutex_lock_AFTER_MIGRATE_PROBABILITY THREAD_FUZZER_pthread_mutex_lock_AFTER_SLEEP_PROBABILITY THREAD_FUZZER_pthread_mutex_lock_AFTER_SLEEP_TIME_US THREAD_FUZZER_pthread_mutex_lock_BEFORE_MIGRATE_PROBABILITY THREAD_FUZZER_pthread_mutex_lock_BEFORE_SLEEP_PROBABILITY THREAD_FUZZER_pthread_mutex_lock_BEFORE_SLEEP_TIME_US THREAD_FUZZER_pthread_mutex_unlock_AFTER_MIGRATE_PROBABILITY THREAD_FUZZER_pthread_mutex_unlock_AFTER_SLEEP_PROBABILITY THREAD_FUZZER_pthread_mutex_unlock_AFTER_SLEEP_TIME_US THREAD_FUZZER_pthread_mutex_unlock_BEFORE_MIGRATE_PROBABILITY THREAD_FUZZER_pthread_mutex_unlock_BEFORE_SLEEP_PROBABILITY THREAD_FUZZER_pthread_mutex_unlock_BEFORE_SLEEP_TIME_US
+ start
+ counter=0
+ clickhouse-client --query 'SELECT 1'
Code: 210. DB::NetException: Connection refused (localhost:9000). (NETWORK_ERROR)
+ '[' 0 -gt 120 ']'
+ clickhouse start --user root
+ sleep 0.5
+ counter=1
+ clickhouse-client --query 'SELECT 1'
Code: 210. DB::NetException: Connection refused (localhost:9000). (NETWORK_ERROR)
+ '[' 1 -gt 120 ']'
+ clickhouse start --user root
+ sleep 0.5
+ counter=2
+ clickhouse-client --query 'SELECT 1'
Code: 210. DB::NetException: Connection refused (localhost:9000). (NETWORK_ERROR)
+ '[' 2 -gt 120 ']'
+ clickhouse start --user root
+ sleep 0.5
+ counter=3
+ clickhouse-client --query 'SELECT 1'
Code: 210. DB::NetException: Connection refused (localhost:9000). (NETWORK_ERROR)
+ '[' 3 -gt 120 ']'
+ clickhouse start --user root
+ sleep 0.5
+ counter=4
+ clickhouse-client --query 'SELECT 1'
Code: 210. DB::NetException: Connection refused (localhost:9000). (NETWORK_ERROR)
+ '[' 4 -gt 120 ']'
+ clickhouse start --user root
+ sleep 0.5
+ counter=5
+ clickhouse-client --query 'SELECT 1'
127.0.0.1 - - [28/Oct/2026:07:44:21 +0000] "PUT /devstoreaccount1/cont?restype=container HTTP/1.1" 409 -
127.0.0.1 - - [28/Oct/2026:07:44:21 +0000] "PUT /devstoreaccount1/cont/dfeuaoojuzwzrteqzlvrwjcwcdteohal?blockid=svsigxumpibhqtfvuuddekgjbvnmiiulgakzmncjkuhytiffzgbchditvnjmtagj&comp=block HTTP/1.1" 201 -
Code: 210. DB::NetException: Connection refused (localhost:9000). (NETWORK_ERROR)
127.0.0.1 - - [28/Oct/2026:07:44:21 +0000] "PUT /devstoreaccount1/cont/dfeuaoojuzwzrteqzlvrwjcwcdteohal?comp=blocklist HTTP/1.1" 201 -
127.0.0.1 - - [28/Oct/2026:07:44:21 +0000] "GET /devstoreaccount1/cont/dfeuaoojuzwzrteqzlvrwjcwcdteohal HTTP/1.1" 206 4
127.0.0.1 - - [28/Oct/2026:07:44:21 +0000] "GET /devstoreaccount1/cont/dfeuaoojuzwzrteqzlvrwjcwcdteohal HTTP/1.1" 206 2
127.0.0.1 - - [28/Oct/2026:07:44:21 +0000] "DELETE /devstoreaccount1/cont/dfeuaoojuzwzrteqzlvrwjcwcdteohal HTTP/1.1" 202 -
+ '[' 5 -gt 120 ']'
+ clickhouse start --user root
+ sleep 0.5
+ counter=6
+ clickhouse-client --query 'SELECT 1'
Code: 210. DB::NetException: Connection refused (localhost:9000). (NETWORK_ERROR)
+ '[' 6 -gt 120 ']'
+ clickhouse start --user root
+ sleep 0.5
+ counter=7
+ clickhouse-client --query 'SELECT 1'
Code: 210. DB::NetException: Connection refused (localhost:9000). (NETWORK_ERROR)
+ '[' 7 -gt 120 ']'
+ clickhouse start --user root
+ sleep 0.5
+ counter=8
+ clickhouse-client --query 'SELECT 1'
Code: 210. DB::NetException: Connection refused (localhost:9000). (NETWORK_ERROR)
+ '[' 8 -gt 120 ']'
+ clickhouse start --user root
+ sleep 0.5
+ counter=9
+ clickhouse-client --query 'SELECT 1'
1
+ attach_gdb_to_clickhouse
++ kill -l SIGRTMIN
+ RTMIN=34
+ echo '
set follow-fork-mode parent
handle SIGHUP nostop noprint pass
handle SIGINT nostop noprint pass
handle SIGQUIT nostop noprint pass
handle SIGPIPE nostop noprint pass
handle SIGTERM nostop noprint pass
handle SIGUSR1 nostop noprint pass
handle SIGUSR2 nostop noprint pass
handle SIG34 nostop noprint pass
info signals
continue
backtrace full
thread apply all backtrace full
info registers
disassemble /s
up
disassemble /s
up
disassemble /s
p "done"
detach
quit
'
+ sleep 5
+ ts '%Y-%m-%d %H:%M:%S'
++ cat /var/run/clickhouse-server/clickhouse-server.pid
+ gdb -batch -command script.gdb -p 117495
+ run_with_retry 60 clickhouse-client --query 'SELECT '\''Connected to clickhouse-server after attaching gdb'\'''
+ [[ hxB =~ e ]]
+ set_e=false
+ set +e
+ local total_retries=60
+ shift
+ local retry=0
+ '[' 0 -ge 60 ']'
+ clickhouse-client --query 'SELECT '\''Connected to clickhouse-server after attaching gdb'\'''
Connected to clickhouse-server after attaching gdb
+ false
+ return
+ check_server_start
+ clickhouse-client --query 'SELECT '\''Server successfully started'\'', '\''OK'\'', NULL, '\'''\'''
+ '[' -s /test_output/application_errors.txt ']'
+ rm /test_output/application_errors.txt
rm: cannot remove '/test_output/application_errors.txt': No such file or directory
+ stop
+ local max_tries=90
+ local check_hang=true
+ local pid
++ cat /var/run/clickhouse-server/clickhouse-server.pid
+ pid=117495
+ clickhouse stop --max-tries 90 --do-not-kill
script.gdb:13: Error in sourced command file:
No stack.
/var/run/clickhouse-server/clickhouse-server.pid file exists and contains pid = 117495.
The process with pid = 117495 is running.
Sent terminate signal to process with pid 117495.
Waiting for server to stop
/var/run/clickhouse-server/clickhouse-server.pid file exists and contains pid = 117495.
The process with pid = 117495 is running.
Waiting for server to stop
/var/run/clickhouse-server/clickhouse-server.pid file exists and contains pid = 117495.
The process with pid = 117495 is running.
Waiting for server to stop
/var/run/clickhouse-server/clickhouse-server.pid file exists and contains pid = 117495.
The process with pid = 117495 is running.
Waiting for server to stop
/var/run/clickhouse-server/clickhouse-server.pid file exists and contains pid = 117495.
The process with pid = 117495 is running.
Waiting for server to stop
Found pid = 117495 in the list of running processes.
The process with pid = 117495 is running.
Waiting for server to stop
Found pid = 117495 in the list of running processes.
The process with pid = 117495 is running.
Waiting for server to stop
Found pid = 117495 in the list of running processes.
The process with pid = 117495 is running.
Waiting for server to stop
Found pid = 117495 in the list of running processes.
The process with pid = 117495 is running.
Waiting for server to stop
Found pid = 117495 in the list of running processes.
The process with pid = 117495 is running.
Waiting for server to stop
Found pid = 117495 in the list of running processes.
The process with pid = 117495 is running.
Waiting for server to stop
Found pid = 117495 in the list of running processes.
The process with pid = 117495 is running.
Waiting for server to stop
Found pid = 117495 in the list of running processes.
The process with pid = 117495 is running.
Waiting for server to stop
Found pid = 117495 in the list of running processes.
The process with pid = 117495 is running.
Waiting for server to stop
Found pid = 117495 in the list of running processes.
The process with pid = 117495 is running.
Waiting for server to stop
Found pid = 117495 in the list of running processes.
The process with pid = 117495 is running.
Waiting for server to stop
Found pid = 117495 in the list of running processes.
The process with pid = 117495 is running.
Waiting for server to stop
Found pid = 117495 in the list of running processes.
The process with pid = 117495 is running.
Waiting for server to stop
Found pid = 117495 in the list of running processes.
The process with pid = 117495 is running.
Waiting for server to stop
Found pid = 117495 in the list of running processes.
The process with pid = 117495 is running.
Waiting for server to stop
Found pid = 117495 in the list of running processes.
The process with pid = 117495 is running.
Waiting for server to stop
Found pid = 117495 in the list of running processes.
The process with pid = 117495 is running.
Waiting for server to stop
Found pid = 117495 in the list of running processes.
The process with pid = 117495 is running.
Waiting for server to stop
Found pid = 117495 in the list of running processes.
The process with pid = 117495 is running.
Waiting for server to stop
Found pid = 117495 in the list of running processes.
The process with pid = 117495 is running.
Waiting for server to stop
Now there is no clickhouse-server process.
Server stopped
+ return
+ '[' -f /var/log/clickhouse-server/clickhouse-server.log ']'
+ '[' -f /var/log/clickhouse-server/stderr.log ']'
+ mv /var/log/clickhouse-server/clickhouse-server.log /var/log/clickhouse-server/clickhouse-server.final.log
+ check_logs_for_critical_errors
+ rg -Fa ================== /var/log/clickhouse-server/stderr.log
+ rg -v 'in query:'
+ rg -Fa WARNING /var/log/clickhouse-server/stderr.log
+ rg -Fav -e 'ASan doesn'\''t fully support makecontext/swapcontext functions' -e DB::Exception /test_output/tmp
+ echo -e 'No sanitizer asserts\tOK\t\N\t'
+ rm -f /test_output/tmp
+ rg -Fa ' Application: Child process was terminated by signal 9' /var/log/clickhouse-server/clickhouse-server.err.log /var/log/clickhouse-server/clickhouse-server.final.log /var/log/clickhouse-server/clickhouse-server.initial.log /var/log/clickhouse-server/clickhouse-server.stress.log
+ echo -e 'No OOM messages in clickhouse-server.log\tOK\t\N\t'
+ rg -Fa 'Code: 49. DB::Exception: ' /var/log/clickhouse-server/clickhouse-server.err.log /var/log/clickhouse-server/clickhouse-server.final.log /var/log/clickhouse-server/clickhouse-server.initial.log /var/log/clickhouse-server/clickhouse-server.stress.log
+ echo -e 'No logical errors\tOK\t\N\t'
+ '[' -s /test_output/logical_errors.txt ']'
+ rm /test_output/logical_errors.txt
+ rg --text 'Code: 499.*The specified key does not exist' /var/log/clickhouse-server/clickhouse-server.err.log /var/log/clickhouse-server/clickhouse-server.final.log /var/log/clickhouse-server/clickhouse-server.initial.log /var/log/clickhouse-server/clickhouse-server.stress.log
+ echo -e 'No lost s3 keys\tOK\t\N\t'
+ '[' -s /test_output/no_such_key_errors.txt ']'
+ rm /test_output/no_such_key_errors.txt
+ rg -Fa '########################################' /var/log/clickhouse-server/clickhouse-server.err.log /var/log/clickhouse-server/clickhouse-server.final.log /var/log/clickhouse-server/clickhouse-server.initial.log /var/log/clickhouse-server/clickhouse-server.stress.log
+ echo -e 'Not crashed\tOK\t\N\t'
+ rg -Fa ' ' /var/log/clickhouse-server/clickhouse-server.err.log /var/log/clickhouse-server/clickhouse-server.final.log /var/log/clickhouse-server/clickhouse-server.initial.log /var/log/clickhouse-server/clickhouse-server.stress.log
+ echo -e 'No fatal messages in clickhouse-server.log\tOK\t\N\t'
+ '[' -s /test_output/fatal_messages.txt ']'
+ rm /test_output/fatal_messages.txt
+ rg -Faz '########################################' /test_output/gdb.log /test_output/stress_run_logs.tar.zst /test_output/test_results.tsv
+ rg -Fa ' received signal ' /test_output/gdb.log
+ dmesg -T
+ grep -q -F -e 'Out of memory: Killed process' -e 'oom_reaper: reaped process' -e oom-kill:constraint=CONSTRAINT_NONE /test_output/dmesg.log
+ echo -e 'No OOM in dmesg\tOK\t\N\t'
+ tar -chf /test_output/coordination.tar /var/lib/clickhouse/coordination
tar: Removing leading `/' from member names
tar: Removing leading `/' from hard link targets
+ collect_query_and_trace_logs
+ for table in query_log trace_log
+ clickhouse-local --path /var/lib/clickhouse/ --only-system-tables -q 'select * from system.query_log format TSVWithNamesAndTypes'
+ zstd --threads=0
+ for table in query_log trace_log
+ clickhouse-local --path /var/lib/clickhouse/ --only-system-tables -q 'select * from system.trace_log format TSVWithNamesAndTypes'
+ zstd --threads=0
+ mv /var/log/clickhouse-server/stderr.log /test_output/
+ clickhouse-local --structure 'test String, res String, time Nullable(Float32), desc String' -q 'SELECT '\''failure'\'', test FROM table WHERE res != '\''OK'\'' order by
(test like '\''%Sanitizer%'\'') DESC,
(test like '\''%Killed by signal%'\'') DESC,
(test like '\''%gdb.log%'\'') DESC,
(test ilike '\''%possible deadlock%'\'') DESC,
(test like '\''%start%'\'') DESC,
(test like '\''%dmesg%'\'') DESC,
(test like '\''%OOM%'\'') DESC,
(test like '\''%Signal 9%'\'') DESC,
(test like '\''%Fatal message%'\'') DESC,
rowNumberInAllBlocks()
LIMIT 1'
+ '[' -s /test_output/check_status.tsv ']'
+ echo -e 'success\tNo errors found'
+ rg 'OOM in dmesg|Signal 9' /test_output/check_status.tsv
+ collect_core_dumps
+ find . -type f -maxdepth 1 -name 'core.*'
+ read core