+ ln -s /usr/share/clickhouse-test/ci/stress.py /usr/bin/stress + ln -s /usr/share/clickhouse-test/clickhouse-test /usr/bin/clickhouse-test + source /usr/share/clickhouse-test/ci/attach_gdb.lib ++ source /usr/share/clickhouse-test/ci/utils.lib + source /usr/share/clickhouse-test/ci/stress_tests.lib ++ sysctl kernel.core_pattern=core.%e.%p-%P kernel.core_pattern = core.%e.%p-%P ++ OK='\tOK\t\N\t' ++ FAIL='\tFAIL\t\N\t' ++ FAILURE_CONTEXT_LINES=100 ++ FAILURE_CONTEXT_MAX_LINE_WIDTH=300 + install_packages package_folder + dpkg -i package_folder/clickhouse-common-static_23.8.16.43.altinitystable+ubsan_amd64.deb Selecting previously unselected package clickhouse-common-static. (Reading database ... 58864 files and directories currently installed.) Preparing to unpack .../clickhouse-common-static_23.8.16.43.altinitystable+ubsan_amd64.deb ... Unpacking clickhouse-common-static (23.8.16.43.altinitystable+ubsan) ... Setting up clickhouse-common-static (23.8.16.43.altinitystable+ubsan) ... + dpkg -i package_folder/clickhouse-common-static-dbg_23.8.16.43.altinitystable+ubsan_amd64.deb Selecting previously unselected package clickhouse-common-static-dbg. (Reading database ... 58878 files and directories currently installed.) Preparing to unpack .../clickhouse-common-static-dbg_23.8.16.43.altinitystable+ubsan_amd64.deb ... Unpacking clickhouse-common-static-dbg (23.8.16.43.altinitystable+ubsan) ... Setting up clickhouse-common-static-dbg (23.8.16.43.altinitystable+ubsan) ... + dpkg -i package_folder/clickhouse-server_23.8.16.43.altinitystable+ubsan_amd64.deb Selecting previously unselected package clickhouse-server. (Reading database ... 58887 files and directories currently installed.) Preparing to unpack .../clickhouse-server_23.8.16.43.altinitystable+ubsan_amd64.deb ... Unpacking clickhouse-server (23.8.16.43.altinitystable+ubsan) ... Setting up clickhouse-server (23.8.16.43.altinitystable+ubsan) ... ClickHouse binary is already located at /usr/bin/clickhouse Symlink /usr/bin/clickhouse-server already exists but it points to /clickhouse. Will replace the old symlink to /usr/bin/clickhouse. Creating symlink /usr/bin/clickhouse-server to /usr/bin/clickhouse. Creating symlink /usr/bin/clickhouse-client to /usr/bin/clickhouse. Creating symlink /usr/bin/clickhouse-local to /usr/bin/clickhouse. Creating symlink /usr/bin/clickhouse-benchmark to /usr/bin/clickhouse. Symlink /usr/bin/clickhouse-copier already exists but it points to /clickhouse. Will replace the old symlink to /usr/bin/clickhouse. Creating symlink /usr/bin/clickhouse-copier to /usr/bin/clickhouse. Creating symlink /usr/bin/clickhouse-obfuscator to /usr/bin/clickhouse. Creating symlink /usr/bin/clickhouse-git-import to /usr/bin/clickhouse. Creating symlink /usr/bin/clickhouse-compressor to /usr/bin/clickhouse. Creating symlink /usr/bin/clickhouse-format to /usr/bin/clickhouse. Symlink /usr/bin/clickhouse-extract-from-config already exists but it points to /clickhouse. Will replace the old symlink to /usr/bin/clickhouse. Creating symlink /usr/bin/clickhouse-extract-from-config to /usr/bin/clickhouse. Symlink /usr/bin/clickhouse-keeper already exists but it points to /clickhouse. Will replace the old symlink to /usr/bin/clickhouse. Creating symlink /usr/bin/clickhouse-keeper to /usr/bin/clickhouse. Symlink /usr/bin/clickhouse-keeper-converter already exists but it points to /clickhouse. Will replace the old symlink to /usr/bin/clickhouse. Creating symlink /usr/bin/clickhouse-keeper-converter to /usr/bin/clickhouse. Creating symlink /usr/bin/clickhouse-disks to /usr/bin/clickhouse. Creating clickhouse group if it does not exist. groupadd -r clickhouse Creating clickhouse user if it does not exist. useradd -r --shell /bin/false --home-dir /nonexistent -g clickhouse clickhouse Will set ulimits for clickhouse user in /etc/security/limits.d/clickhouse.conf. Creating config directory /etc/clickhouse-server/config.d that is used for tweaks of main server configuration. Creating config directory /etc/clickhouse-server/users.d that is used for tweaks of users configuration. Config file /etc/clickhouse-server/config.xml already exists, will keep it and extract path info from it. /etc/clickhouse-server/config.xml has /var/lib/clickhouse/ as data path. /etc/clickhouse-server/config.xml has /var/log/clickhouse-server/ as log path. Users config file /etc/clickhouse-server/users.xml already exists, will keep it and extract users info from it. Log directory /var/log/clickhouse-server/ already exists. Creating data directory /var/lib/clickhouse/. Creating pid directory /var/run/clickhouse-server. chown -R clickhouse:clickhouse '/var/log/clickhouse-server/' chown -R clickhouse:clickhouse '/var/run/clickhouse-server' chown clickhouse:clickhouse '/var/lib/clickhouse/' groupadd -r clickhouse-bridge useradd -r --shell /bin/false --home-dir /nonexistent -g clickhouse-bridge clickhouse-bridge chown -R clickhouse-bridge:clickhouse-bridge '/usr/bin/clickhouse-odbc-bridge' chown -R clickhouse-bridge:clickhouse-bridge '/usr/bin/clickhouse-library-bridge' Password for default user is empty string. See /etc/clickhouse-server/users.xml and /etc/clickhouse-server/users.d to change it. Setting capabilities for clickhouse binary. This is optional. chown -R clickhouse:clickhouse '/etc/clickhouse-server' ClickHouse has been successfully installed. Start clickhouse-server with: sudo clickhouse start Start clickhouse-client with: clickhouse-client + dpkg -i package_folder/clickhouse-client_23.8.16.43.altinitystable+ubsan_amd64.deb Selecting previously unselected package clickhouse-client. (Reading database ... 58906 files and directories currently installed.) Preparing to unpack .../clickhouse-client_23.8.16.43.altinitystable+ubsan_amd64.deb ... Unpacking clickhouse-client (23.8.16.43.altinitystable+ubsan) ... Setting up clickhouse-client (23.8.16.43.altinitystable+ubsan) ... + export THREAD_FUZZER_CPU_TIME_PERIOD_US=1000 + THREAD_FUZZER_CPU_TIME_PERIOD_US=1000 + export THREAD_FUZZER_SLEEP_PROBABILITY=0.1 + THREAD_FUZZER_SLEEP_PROBABILITY=0.1 + export THREAD_FUZZER_SLEEP_TIME_US=100000 + THREAD_FUZZER_SLEEP_TIME_US=100000 + export THREAD_FUZZER_pthread_mutex_lock_BEFORE_MIGRATE_PROBABILITY=1 + THREAD_FUZZER_pthread_mutex_lock_BEFORE_MIGRATE_PROBABILITY=1 + export THREAD_FUZZER_pthread_mutex_lock_AFTER_MIGRATE_PROBABILITY=1 + THREAD_FUZZER_pthread_mutex_lock_AFTER_MIGRATE_PROBABILITY=1 + export THREAD_FUZZER_pthread_mutex_unlock_BEFORE_MIGRATE_PROBABILITY=1 + THREAD_FUZZER_pthread_mutex_unlock_BEFORE_MIGRATE_PROBABILITY=1 + export THREAD_FUZZER_pthread_mutex_unlock_AFTER_MIGRATE_PROBABILITY=1 + THREAD_FUZZER_pthread_mutex_unlock_AFTER_MIGRATE_PROBABILITY=1 + export THREAD_FUZZER_pthread_mutex_lock_BEFORE_SLEEP_PROBABILITY=0.001 + THREAD_FUZZER_pthread_mutex_lock_BEFORE_SLEEP_PROBABILITY=0.001 + export THREAD_FUZZER_pthread_mutex_lock_AFTER_SLEEP_PROBABILITY=0.001 + THREAD_FUZZER_pthread_mutex_lock_AFTER_SLEEP_PROBABILITY=0.001 + export THREAD_FUZZER_pthread_mutex_unlock_BEFORE_SLEEP_PROBABILITY=0.001 + THREAD_FUZZER_pthread_mutex_unlock_BEFORE_SLEEP_PROBABILITY=0.001 + export THREAD_FUZZER_pthread_mutex_unlock_AFTER_SLEEP_PROBABILITY=0.001 + THREAD_FUZZER_pthread_mutex_unlock_AFTER_SLEEP_PROBABILITY=0.001 + export THREAD_FUZZER_pthread_mutex_lock_BEFORE_SLEEP_TIME_US=10000 + THREAD_FUZZER_pthread_mutex_lock_BEFORE_SLEEP_TIME_US=10000 + export THREAD_FUZZER_pthread_mutex_lock_AFTER_SLEEP_TIME_US=10000 + THREAD_FUZZER_pthread_mutex_lock_AFTER_SLEEP_TIME_US=10000 + export THREAD_FUZZER_pthread_mutex_unlock_BEFORE_SLEEP_TIME_US=10000 + THREAD_FUZZER_pthread_mutex_unlock_BEFORE_SLEEP_TIME_US=10000 + export THREAD_FUZZER_pthread_mutex_unlock_AFTER_SLEEP_TIME_US=10000 + THREAD_FUZZER_pthread_mutex_unlock_AFTER_SLEEP_TIME_US=10000 + export THREAD_FUZZER_EXPLICIT_SLEEP_PROBABILITY=0.01 + THREAD_FUZZER_EXPLICIT_SLEEP_PROBABILITY=0.01 + export THREAD_FUZZER_EXPLICIT_MEMORY_EXCEPTION_PROBABILITY=0.01 + THREAD_FUZZER_EXPLICIT_MEMORY_EXCEPTION_PROBABILITY=0.01 + export ZOOKEEPER_FAULT_INJECTION=1 + ZOOKEEPER_FAULT_INJECTION=1 + configure + export USE_DATABASE_ORDINARY=1 + USE_DATABASE_ORDINARY=1 + export EXPORT_S3_STORAGE_POLICIES=1 + EXPORT_S3_STORAGE_POLICIES=1 + /usr/share/clickhouse-test/config/install.sh + DEST_SERVER_PATH=/etc/clickhouse-server + DEST_CLIENT_PATH=/etc/clickhouse-client +++ dirname /usr/share/clickhouse-test/config/install.sh ++ cd /usr/share/clickhouse-test/config ++ pwd -P + SRC_PATH=/usr/share/clickhouse-test/config + echo 'Going to install test configs from /usr/share/clickhouse-test/config into /etc/clickhouse-server' + mkdir -p /etc/clickhouse-server/config.d/ Going to install test configs from /usr/share/clickhouse-test/config into /etc/clickhouse-server + mkdir -p /etc/clickhouse-server/users.d/ + mkdir -p /etc/clickhouse-client + ln -sf /usr/share/clickhouse-test/config/config.d/zookeeper_write.xml /etc/clickhouse-server/config.d/ + ln -sf /usr/share/clickhouse-test/config/config.d/listen.xml /etc/clickhouse-server/config.d/ + ln -sf /usr/share/clickhouse-test/config/config.d/text_log.xml /etc/clickhouse-server/config.d/ + ln -sf /usr/share/clickhouse-test/config/config.d/custom_settings_prefixes.xml /etc/clickhouse-server/config.d/ + ln -sf /usr/share/clickhouse-test/config/config.d/enable_access_control_improvements.xml /etc/clickhouse-server/config.d/ + ln -sf /usr/share/clickhouse-test/config/config.d/macros.xml /etc/clickhouse-server/config.d/ + ln -sf /usr/share/clickhouse-test/config/config.d/disks.xml /etc/clickhouse-server/config.d/ + ln -sf /usr/share/clickhouse-test/config/config.d/secure_ports.xml /etc/clickhouse-server/config.d/ + ln -sf /usr/share/clickhouse-test/config/config.d/clusters.xml /etc/clickhouse-server/config.d/ + ln -sf /usr/share/clickhouse-test/config/config.d/graphite.xml /etc/clickhouse-server/config.d/ + ln -sf /usr/share/clickhouse-test/config/config.d/database_atomic.xml /etc/clickhouse-server/config.d/ + ln -sf /usr/share/clickhouse-test/config/config.d/max_concurrent_queries.xml /etc/clickhouse-server/config.d/ + ln -sf /usr/share/clickhouse-test/config/config.d/merge_tree_settings.xml /etc/clickhouse-server/config.d/ + ln -sf /usr/share/clickhouse-test/config/config.d/merge_tree_old_dirs_cleanup.xml /etc/clickhouse-server/config.d/ + ln -sf /usr/share/clickhouse-test/config/config.d/test_cluster_with_incorrect_pw.xml /etc/clickhouse-server/config.d/ + ln -sf /usr/share/clickhouse-test/config/config.d/keeper_port.xml /etc/clickhouse-server/config.d/ + ln -sf /usr/share/clickhouse-test/config/config.d/logging_no_rotate.xml /etc/clickhouse-server/config.d/ + ln -sf /usr/share/clickhouse-test/config/config.d/merge_tree.xml /etc/clickhouse-server/config.d/ + ln -sf /usr/share/clickhouse-test/config/config.d/lost_forever_check.xml /etc/clickhouse-server/config.d/ + ln -sf /usr/share/clickhouse-test/config/config.d/metadata_cache.xml /etc/clickhouse-server/config.d/ + ln -sf /usr/share/clickhouse-test/config/config.d/tcp_with_proxy.xml /etc/clickhouse-server/config.d/ + ln -sf /usr/share/clickhouse-test/config/config.d/prometheus.xml /etc/clickhouse-server/config.d/ + ln -sf /usr/share/clickhouse-test/config/config.d/top_level_domains_lists.xml /etc/clickhouse-server/config.d/ + ln -sf /usr/share/clickhouse-test/config/config.d/top_level_domains_path.xml /etc/clickhouse-server/config.d/ + ln -sf /usr/share/clickhouse-test/config/config.d/transactions.xml /etc/clickhouse-server/config.d/ + ln -sf /usr/share/clickhouse-test/config/config.d/encryption.xml /etc/clickhouse-server/config.d/ + ln -sf /usr/share/clickhouse-test/config/config.d/CORS.xml /etc/clickhouse-server/config.d/ + ln -sf /usr/share/clickhouse-test/config/config.d/zookeeper_log.xml /etc/clickhouse-server/config.d/ + ln -sf /usr/share/clickhouse-test/config/config.d/logger_trace.xml /etc/clickhouse-server/config.d/ + ln -sf /usr/share/clickhouse-test/config/config.d/named_collection.xml /etc/clickhouse-server/config.d/ + ln -sf /usr/share/clickhouse-test/config/config.d/ssl_certs.xml /etc/clickhouse-server/config.d/ + ln -sf /usr/share/clickhouse-test/config/config.d/filesystem_cache_log.xml /etc/clickhouse-server/config.d/ + ln -sf /usr/share/clickhouse-test/config/config.d/session_log.xml /etc/clickhouse-server/config.d/ + ln -sf /usr/share/clickhouse-test/config/config.d/system_unfreeze.xml /etc/clickhouse-server/config.d/ + ln -sf /usr/share/clickhouse-test/config/config.d/enable_zero_copy_replication.xml /etc/clickhouse-server/config.d/ + ln -sf /usr/share/clickhouse-test/config/config.d/nlp.xml /etc/clickhouse-server/config.d/ + ln -sf /usr/share/clickhouse-test/config/config.d/forbidden_headers.xml /etc/clickhouse-server/config.d/ + ln -sf /usr/share/clickhouse-test/config/config.d/enable_keeper_map.xml /etc/clickhouse-server/config.d/ + ln -sf /usr/share/clickhouse-test/config/config.d/custom_disks_base_path.xml /etc/clickhouse-server/config.d/ + ln -sf /usr/share/clickhouse-test/config/config.d/display_name.xml /etc/clickhouse-server/config.d/ + ln -sf /usr/share/clickhouse-test/config/config.d/reverse_dns_query_function.xml /etc/clickhouse-server/config.d/ + ln -sf /usr/share/clickhouse-test/config/config.d/compressed_marks_and_index.xml /etc/clickhouse-server/config.d/ + ln -sf /usr/share/clickhouse-test/config/config.d/disable_s3_env_credentials.xml /etc/clickhouse-server/config.d/ + ln -sf /usr/share/clickhouse-test/config/config.d/enable_wait_for_shutdown_replicated_tables.xml /etc/clickhouse-server/config.d/ + ln -sf /usr/share/clickhouse-test/config/config.d/backups.xml /etc/clickhouse-server/config.d/ + ln -sf /usr/share/clickhouse-test/config/config.d/filesystem_caches_path.xml /etc/clickhouse-server/config.d/ + ln -sf /usr/share/clickhouse-test/config/config.d/validate_tcp_client_information.xml /etc/clickhouse-server/config.d/ + '[' /etc/clickhouse-server = /etc/clickhouse-server ']' + ln -sf /usr/share/clickhouse-test/config/config.d/legacy_geobase.xml /etc/clickhouse-server/config.d/ + ln -sf /usr/share/clickhouse-test/config/users.d/log_queries.xml /etc/clickhouse-server/users.d/ + ln -sf /usr/share/clickhouse-test/config/users.d/readonly.xml /etc/clickhouse-server/users.d/ + ln -sf /usr/share/clickhouse-test/config/users.d/access_management.xml /etc/clickhouse-server/users.d/ + ln -sf /usr/share/clickhouse-test/config/users.d/database_atomic_drop_detach_sync.xml /etc/clickhouse-server/users.d/ + ln -sf /usr/share/clickhouse-test/config/users.d/opentelemetry.xml /etc/clickhouse-server/users.d/ + ln -sf /usr/share/clickhouse-test/config/users.d/remote_queries.xml /etc/clickhouse-server/users.d/ + ln -sf /usr/share/clickhouse-test/config/users.d/session_log_test.xml /etc/clickhouse-server/users.d/ + ln -sf /usr/share/clickhouse-test/config/users.d/memory_profiler.xml /etc/clickhouse-server/users.d/ + ln -sf /usr/share/clickhouse-test/config/users.d/no_fsync_metadata.xml /etc/clickhouse-server/users.d/ + ln -sf /usr/share/clickhouse-test/config/users.d/filelog.xml /etc/clickhouse-server/users.d/ + ln -sf /usr/share/clickhouse-test/config/users.d/enable_blobs_check.xml /etc/clickhouse-server/users.d/ + ln -sf /usr/share/clickhouse-test/config/users.d/marks.xml /etc/clickhouse-server/users.d/ + ln -sf /usr/share/clickhouse-test/config/users.d/insert_keeper_retries.xml /etc/clickhouse-server/users.d/ + ln -sf /usr/share/clickhouse-test/config/users.d/prefetch_settings.xml /etc/clickhouse-server/users.d/ + ln -sf /usr/share/clickhouse-test/config/users.d/nonconst_timezone.xml /etc/clickhouse-server/users.d/ + [[ -n '' ]] + ln -sf /usr/share/clickhouse-test/config/users.d/timeouts.xml /etc/clickhouse-server/users.d/ + ln -sf /usr/share/clickhouse-test/config/ints_dictionary.xml /etc/clickhouse-server/ + ln -sf /usr/share/clickhouse-test/config/strings_dictionary.xml /etc/clickhouse-server/ + ln -sf /usr/share/clickhouse-test/config/decimals_dictionary.xml /etc/clickhouse-server/ + ln -sf /usr/share/clickhouse-test/config/executable_dictionary.xml /etc/clickhouse-server/ + ln -sf /usr/share/clickhouse-test/config/executable_pool_dictionary.xml /etc/clickhouse-server/ + ln -sf /usr/share/clickhouse-test/config/test_function.xml /etc/clickhouse-server/ + ln -sf /usr/share/clickhouse-test/config/top_level_domains /etc/clickhouse-server/ + ln -sf /usr/share/clickhouse-test/config/regions_hierarchy.txt /etc/clickhouse-server/config.d/ + ln -sf /usr/share/clickhouse-test/config/regions_names_en.txt /etc/clickhouse-server/config.d/ + ln -sf /usr/share/clickhouse-test/config/ext-en.txt /etc/clickhouse-server/config.d/ + ln -sf /usr/share/clickhouse-test/config/ext-ru.txt /etc/clickhouse-server/config.d/ + ln -sf /usr/share/clickhouse-test/config/lem-en.bin /etc/clickhouse-server/config.d/ + ln -sf /usr/share/clickhouse-test/config/server.key /etc/clickhouse-server/ + ln -sf /usr/share/clickhouse-test/config/server.crt /etc/clickhouse-server/ + ln -sf /usr/share/clickhouse-test/config/dhparam.pem /etc/clickhouse-server/ + ln -sf --backup=simple --suffix=_original.xml /usr/share/clickhouse-test/config/config.d/query_masking_rules.xml /etc/clickhouse-server/config.d/ + [[ -n 1 ]] + [[ 1 -eq 1 ]] + rm -f /etc/clickhouse-server/config.d/zookeeper.xml + ln -sf /usr/share/clickhouse-test/config/config.d/zookeeper_fault_injection.xml /etc/clickhouse-server/config.d/ + create_snapshot_on_exit=1 + sed --follow-symlinks -i 's|true|1|' /etc/clickhouse-server/config.d/keeper_port.xml + [[ -n '' ]] + [[ -n 1 ]] + [[ 1 -eq 1 ]] + ln -sf /usr/share/clickhouse-test/config/users.d/database_ordinary.xml /etc/clickhouse-server/users.d/ + [[ -n '' ]] + ARM=aarch64 ++ uname -m + OS=x86_64 x86_64 Adding azure configuration + [[ -n 1 ]] + echo x86_64 + [[ '' -eq 1 ]] + [[ x86_64 == \a\a\r\c\h\6\4 ]] + echo 'Adding azure configuration' + ln -sf /usr/share/clickhouse-test/config/config.d/azure_storage_conf.xml /etc/clickhouse-server/config.d/ + ln -sf /usr/share/clickhouse-test/config/config.d/storage_conf.xml /etc/clickhouse-server/config.d/ + ln -sf /usr/share/clickhouse-test/config/users.d/s3_cache.xml /etc/clickhouse-server/users.d/ + [[ -n '' ]] + ln -sf /usr/share/clickhouse-test/config/client_config.xml /etc/clickhouse-client/config.xml + sed 's|100000|10000|' + sudo cat /etc/clickhouse-server/config.d/keeper_port.xml + sudo mv /etc/clickhouse-server/config.d/keeper_port.xml.tmp /etc/clickhouse-server/config.d/keeper_port.xml + sudo chown clickhouse /etc/clickhouse-server/config.d/keeper_port.xml + sudo chgrp clickhouse /etc/clickhouse-server/config.d/keeper_port.xml + echo 'ASAN_OPTIONS='\''malloc_context_size=10 verbosity=1 allocator_release_to_os_interval_ms=10000'\''' + export 'ASAN_OPTIONS=malloc_context_size=10 allocator_release_to_os_interval_ms=10000' + ASAN_OPTIONS='malloc_context_size=10 allocator_release_to_os_interval_ms=10000' + sudo chown root: /var/lib/clickhouse + echo '1' + local total_mem ++ awk '/MemTotal/ { print $(NF-1) }' /proc/meminfo + total_mem=32080792 + total_mem=32850731008 + max_server_memory_usage_to_ram_ratio=0.5 + echo 'Setting max_server_memory_usage_to_ram_ratio to 0.5' + cat Setting max_server_memory_usage_to_ram_ratio to 0.5 + local max_users_mem + max_users_mem=9855219302 Setting max_memory_usage_for_user=9855219302 and max_memory_usage for queries to 10G + echo 'Setting max_memory_usage_for_user=9855219302 and max_memory_usage for queries to 10G' + cat + cat + cat + ./setup_minio.sh stateless + azurite-blob --blobHost 0.0.0.0 --blobPort 10000 --debug /azurite_log + export MINIO_ROOT_USER=clickhouse + MINIO_ROOT_USER=clickhouse + export MINIO_ROOT_PASSWORD=clickhouse + MINIO_ROOT_PASSWORD=clickhouse + main stateless + local query_dir ++ check_arg stateless ++ local query_dir ++ '[' '!' 1 -eq 1 ']' ++ case "$1" in ++ query_dir=0_stateless ++ echo 0_stateless + query_dir=0_stateless + '[' '!' -f ./minio ']' + start_minio + mkdir -p ./minio_data + ./minio --version minio version RELEASE.2024-07-31T05-46-26Z (commit-id=a9dc061d847277e30c5c6918d6de6f0606f9d285) Runtime: go1.22.5 linux/amd64 License: GNU AGPLv3 - https://www.gnu.org/licenses/agpl-3.0.html Copyright: 2015-2024 MinIO, Inc. + wait_for_it + local counter=0 + local max_counter=60 + local url=http://localhost:11111 + params=('--silent' '--verbose') + ./minio server --address :11111 ./minio_data + local params + curl --silent --verbose http://localhost:11111 + grep AccessDenied trying to connect to minio + [[ 0 == \6\0 ]] + echo 'trying to connect to minio' + sleep 1 Azurite Blob service is starting on 0.0.0.0:10000 Azurite Blob service successfully listens on http://0.0.0.0:10000 INFO: Formatting 1st pool, 1 set(s), 1 drives per set. INFO: WARNING: Host local has more than 0 drives of set. A host failure will result in data becoming unavailable. MinIO Object Storage Server Copyright: 2015-2026 MinIO, Inc. License: GNU AGPLv3 - https://www.gnu.org/licenses/agpl-3.0.html Version: RELEASE.2024-07-31T05-46-26Z (go1.22.5 linux/amd64) API: http://172.17.0.2:11111 http://127.0.0.1:11111 WebUI: http://172.17.0.2:37481 http://127.0.0.1:37481 Docs: https://min.io/docs/minio/linux/index.html + counter=1 + curl --silent --verbose http://localhost:11111 + grep AccessDenied AccessDeniedAccess Denied./18E2B5C2626CBF317dc7eb22d3288ec80374614e9088e31d3668a6922ead55932dd2a8e56373820f + lsof -i :11111 COMMAND PID USER FD TYPE DEVICE SIZE/OFF NODE NAME minio 239 root 8u IPv6 36132 0t0 TCP *:11111 (LISTEN) minio 239 root 9u IPv4 36131 0t0 TCP localhost:11111 (LISTEN) minio 239 root 10u IPv6 36133 0t0 TCP localhost:11111 (LISTEN) + sleep 5 + setup_minio stateless + local test_type=stateless + ./mc alias set clickminio http://localhost:11111 clickhouse clickhouse Added `clickminio` successfully. + ./mc admin user add clickminio test testtest Added user `test` successfully. + ./mc admin policy attach clickminio readwrite --user=test Attached Policies: [readwrite] To User: test + ./mc mb clickminio/test Bucket created successfully `clickminio/test`. + '[' stateless = stateless ']' + ./mc anonymous set public clickminio/test Access permission for `clickminio/test` is set to `public` + upload_data 0_stateless /usr/share/clickhouse-test + local query_dir=0_stateless + local test_path=/usr/share/clickhouse-test + local data_path=/usr/share/clickhouse-test/queries/0_stateless/data_minio ++ ls /usr/share/clickhouse-test/queries/0_stateless/data_minio 02366_data.jsonl + for file in $(ls "${data_path}") + echo 02366_data.jsonl + ./mc cp /usr/share/clickhouse-test/queries/0_stateless/data_minio/02366_data.jsonl clickminio/test/02366_data.jsonl `/usr/share/clickhouse-test/queries/0_stateless/data_minio/02366_data.jsonl` -> `clickminio/test/02366_data.jsonl` Total: 0 B, Transferred: 0 B, Speed: 0 B/s 02731.arrow + for file in $(ls "${data_path}") + echo 02731.arrow + ./mc cp /usr/share/clickhouse-test/queries/0_stateless/data_minio/02731.arrow clickminio/test/02731.arrow `/usr/share/clickhouse-test/queries/0_stateless/data_minio/02731.arrow` -> `clickminio/test/02731.arrow` Total: 3.82 MiB, Transferred: 3.82 MiB, Speed: 86.24 MiB/s 02731.parquet + for file in $(ls "${data_path}") + echo 02731.parquet + ./mc cp /usr/share/clickhouse-test/queries/0_stateless/data_minio/02731.parquet clickminio/test/02731.parquet `/usr/share/clickhouse-test/queries/0_stateless/data_minio/02731.parquet` -> `clickminio/test/02731.parquet` Total: 1.57 MiB, Transferred: 1.57 MiB, Speed: 53.05 MiB/s + for file in $(ls "${data_path}") + echo a.tsv + ./mc cp /usr/share/clickhouse-test/queries/0_stateless/data_minio/a.tsv clickminio/test/a.tsv a.tsv `/usr/share/clickhouse-test/queries/0_stateless/data_minio/a.tsv` -> `clickminio/test/a.tsv` Total: 24 B, Transferred: 24 B, Speed: 1.72 KiB/s + for file in $(ls "${data_path}") + echo b.tsv + ./mc cp /usr/share/clickhouse-test/queries/0_stateless/data_minio/b.tsv clickminio/test/b.tsv b.tsv `/usr/share/clickhouse-test/queries/0_stateless/data_minio/b.tsv` -> `clickminio/test/b.tsv` Total: 33 B, Transferred: 33 B, Speed: 2.46 KiB/s c.tsv + for file in $(ls "${data_path}") + echo c.tsv + ./mc cp /usr/share/clickhouse-test/queries/0_stateless/data_minio/c.tsv clickminio/test/c.tsv `/usr/share/clickhouse-test/queries/0_stateless/data_minio/c.tsv` -> `clickminio/test/c.tsv` Total: 33 B, Transferred: 33 B, Speed: 2.37 KiB/s + for file in $(ls "${data_path}") + echo tsv_with_header.tsv + ./mc cp /usr/share/clickhouse-test/queries/0_stateless/data_minio/tsv_with_header.tsv clickminio/test/tsv_with_header.tsv tsv_with_header.tsv `/usr/share/clickhouse-test/queries/0_stateless/data_minio/tsv_with_header.tsv` -> `clickminio/test/tsv_with_header.tsv` Total: 44 B, Transferred: 44 B, Speed: 3.35 KiB/s + setup_aws_credentials + local minio_root_user=clickhouse + local minio_root_password=clickhouse + mkdir -p /root/.aws + cat + config_logs_export_cluster /etc/clickhouse-server/config.d/system_logs_export.yaml + set +x File /tmp/export-logs-config.sh does not exist, do not setup + start + counter=0 + clickhouse-client --query 'SELECT 1' Code: 210. DB::NetException: Connection refused (localhost:9000). (NETWORK_ERROR) + '[' 0 -gt 120 ']' + clickhouse start --user root + sleep 0.5 + counter=1 + clickhouse-client --query 'SELECT 1' Code: 210. DB::NetException: Connection refused (localhost:9000). (NETWORK_ERROR) + '[' 1 -gt 120 ']' + clickhouse start --user root + sleep 0.5 + counter=2 + clickhouse-client --query 'SELECT 1' Code: 210. DB::NetException: Connection refused (localhost:9000). (NETWORK_ERROR) + '[' 2 -gt 120 ']' + clickhouse start --user root + sleep 0.5 + counter=3 + clickhouse-client --query 'SELECT 1' Code: 210. DB::NetException: Connection refused (localhost:9000). (NETWORK_ERROR) + '[' 3 -gt 120 ']' + clickhouse start --user root + sleep 0.5 + counter=4 + clickhouse-client --query 'SELECT 1' Code: 210. DB::NetException: Connection refused (localhost:9000). (NETWORK_ERROR) + '[' 4 -gt 120 ']' + clickhouse start --user root + sleep 0.5 + counter=5 + clickhouse-client --query 'SELECT 1' Code: 210. DB::NetException: Connection refused (localhost:9000). (NETWORK_ERROR) + '[' 5 -gt 120 ']' + clickhouse start --user root + sleep 0.5 + counter=6 + clickhouse-client --query 'SELECT 1' Code: 210. DB::NetException: Connection refused (localhost:9000). (NETWORK_ERROR) + '[' 6 -gt 120 ']' + clickhouse start --user root + sleep 0.5 + counter=7 + clickhouse-client --query 'SELECT 1' Code: 210. DB::NetException: Connection refused (localhost:9000). (NETWORK_ERROR) + '[' 7 -gt 120 ']' + clickhouse start --user root + sleep 0.5 + counter=8 + clickhouse-client --query 'SELECT 1' Code: 210. DB::NetException: Connection refused (localhost:9000). (NETWORK_ERROR) + '[' 8 -gt 120 ']' + clickhouse start --user root + sleep 0.5 + counter=9 + clickhouse-client --query 'SELECT 1' Code: 210. DB::NetException: Connection refused (localhost:9000). (NETWORK_ERROR) + '[' 9 -gt 120 ']' + clickhouse start --user root + sleep 0.5 + counter=10 + clickhouse-client --query 'SELECT 1' Code: 210. DB::NetException: Connection refused (localhost:9000). (NETWORK_ERROR) + '[' 10 -gt 120 ']' + clickhouse start --user root + sleep 0.5 127.0.0.1 - - [28/Oct/2026:13:51:06 +0000] "PUT /devstoreaccount1/cont?restype=container HTTP/1.1" 201 - 127.0.0.1 - - [28/Oct/2026:13:51:06 +0000] "PUT /devstoreaccount1/cont/rgzlqpugtegtoutvvczjseghppkizeev?blockid=rxfltsxbchkufbafyymedacicxxbcmvxchukhdnsojmpnbycchdyrmmyqhjhlmpm&comp=block HTTP/1.1" 201 - 127.0.0.1 - - [28/Oct/2026:13:51:06 +0000] "PUT /devstoreaccount1/cont/rgzlqpugtegtoutvvczjseghppkizeev?comp=blocklist HTTP/1.1" 201 - 127.0.0.1 - - [28/Oct/2026:13:51:06 +0000] "GET /devstoreaccount1/cont/rgzlqpugtegtoutvvczjseghppkizeev HTTP/1.1" 206 4 127.0.0.1 - - [28/Oct/2026:13:51:06 +0000] "GET /devstoreaccount1/cont/rgzlqpugtegtoutvvczjseghppkizeev HTTP/1.1" 206 2 127.0.0.1 - - [28/Oct/2026:13:51:06 +0000] "DELETE /devstoreaccount1/cont/rgzlqpugtegtoutvvczjseghppkizeev HTTP/1.1" 202 - + counter=11 + clickhouse-client --query 'SELECT 1' 1 + attach_gdb_to_clickhouse ++ kill -l SIGRTMIN + RTMIN=34 + echo ' set follow-fork-mode parent handle SIGHUP nostop noprint pass handle SIGINT nostop noprint pass handle SIGQUIT nostop noprint pass handle SIGPIPE nostop noprint pass handle SIGTERM nostop noprint pass handle SIGUSR1 nostop noprint pass handle SIGUSR2 nostop noprint pass handle SIG34 nostop noprint pass info signals continue backtrace full thread apply all backtrace full info registers disassemble /s up disassemble /s up disassemble /s p "done" detach quit ' + sleep 5 + ts '%Y-%m-%d %H:%M:%S' ++ cat /var/run/clickhouse-server/clickhouse-server.pid + gdb -batch -command script.gdb -p 452 + run_with_retry 60 clickhouse-client --query 'SELECT '\''Connected to clickhouse-server after attaching gdb'\''' + [[ hxB =~ e ]] + set_e=false + set +e + local total_retries=60 + shift + local retry=0 + '[' 0 -ge 60 ']' + clickhouse-client --query 'SELECT '\''Connected to clickhouse-server after attaching gdb'\''' Connected to clickhouse-server after attaching gdb + false + return + setup_logs_replication + set +x File /tmp/export-logs-config.sh does not exist, do not setup + /s3downloader --url-prefix https://s3.amazonaws.com/clickhouse-datasets --dataset-names hits visits INFO:root:Will fetch following datasets: hits, visits INFO:root:Processing hits INFO:root:Downloading from https://s3.amazonaws.com/clickhouse-datasets/hits/partitions/hits_v1.tar to temp path /tmp/zh1dik2m INFO:root:Content length is 1271623680 bytes INFO:root:Downloading finished INFO:root:Will unpack data from temp path /tmp/zh1dik2m to clickhouse db /var/lib/clickhouse/ INFO:root:Unpack finished INFO:root:Will remove downloaded file /tmp/zh1dik2m from filesystem if it exists INFO:root:Processing of hits finished INFO:root:Processing visits INFO:root:Downloading from https://s3.amazonaws.com/clickhouse-datasets/visits/partitions/visits_v1.tar to temp path /tmp/ytn5ons3 INFO:root:Content length is 563968000 bytes INFO:root:Downloading finished INFO:root:Will unpack data from temp path /tmp/ytn5ons3 to clickhouse db /var/lib/clickhouse/ INFO:root:Unpack finished INFO:root:Will remove downloaded file /tmp/ytn5ons3 from filesystem if it exists INFO:root:Processing of visits finished INFO:root:Fetch finished, enjoy your tables! + chmod 777 -R /var/lib/clickhouse + clickhouse-client --query 'ATTACH DATABASE IF NOT EXISTS datasets ENGINE = Ordinary' + clickhouse-client --query 'CREATE DATABASE IF NOT EXISTS test' + stop + local max_tries=90 + local check_hang=true + local pid ++ cat /var/run/clickhouse-server/clickhouse-server.pid + pid=452 + clickhouse stop --max-tries 90 --do-not-kill script.gdb:13: Error in sourced command file: No stack. /var/run/clickhouse-server/clickhouse-server.pid file exists and contains pid = 452. The process with pid = 452 is running. Sent terminate signal to process with pid 452. Waiting for server to stop /var/run/clickhouse-server/clickhouse-server.pid file exists and contains pid = 452. The process with pid = 452 is running. Waiting for server to stop /var/run/clickhouse-server/clickhouse-server.pid file exists and contains pid = 452. The process with pid = 452 is running. Waiting for server to stop /var/run/clickhouse-server/clickhouse-server.pid file exists and contains pid = 452. The process with pid = 452 is running. Waiting for server to stop /var/run/clickhouse-server/clickhouse-server.pid file exists and contains pid = 452. The process with pid = 452 is running. Waiting for server to stop /var/run/clickhouse-server/clickhouse-server.pid file exists and contains pid = 452. The process with pid = 452 is running. Waiting for server to stop /var/run/clickhouse-server/clickhouse-server.pid file exists and contains pid = 452. The process with pid = 452 is running. Waiting for server to stop Now there is no clickhouse-server process. Server stopped + return + mv /var/log/clickhouse-server/clickhouse-server.log /var/log/clickhouse-server/clickhouse-server.initial.log + start + counter=0 + clickhouse-client --query 'SELECT 1' Code: 210. DB::NetException: Connection refused (localhost:9000). (NETWORK_ERROR) + '[' 0 -gt 120 ']' + clickhouse start --user root + sleep 0.5 + counter=1 + clickhouse-client --query 'SELECT 1' Code: 210. DB::NetException: Connection refused (localhost:9000). (NETWORK_ERROR) + '[' 1 -gt 120 ']' + clickhouse start --user root + sleep 0.5 + counter=2 + clickhouse-client --query 'SELECT 1' Code: 210. DB::NetException: Connection refused (localhost:9000). (NETWORK_ERROR) + '[' 2 -gt 120 ']' + clickhouse start --user root + sleep 0.5 + counter=3 + clickhouse-client --query 'SELECT 1' Code: 210. DB::NetException: Connection refused (localhost:9000). (NETWORK_ERROR) + '[' 3 -gt 120 ']' + clickhouse start --user root + sleep 0.5 + counter=4 + clickhouse-client --query 'SELECT 1' Code: 210. DB::NetException: Connection refused (localhost:9000). (NETWORK_ERROR) + '[' 4 -gt 120 ']' + clickhouse start --user root + sleep 0.5 + counter=5 + clickhouse-client --query 'SELECT 1' Code: 210. DB::NetException: Connection refused (localhost:9000). (NETWORK_ERROR) + '[' 5 -gt 120 ']' + clickhouse start --user root + sleep 0.5 + counter=6 + clickhouse-client --query 'SELECT 1' Code: 210. DB::NetException: Connection refused (localhost:9000). (NETWORK_ERROR) + '[' 6 -gt 120 ']' + clickhouse start --user root + sleep 0.5 + counter=7 + clickhouse-client --query 'SELECT 1' Code: 210. DB::NetException: Connection refused (localhost:9000). (NETWORK_ERROR) + '[' 7 -gt 120 ']' + clickhouse start --user root + sleep 0.5 + counter=8 + clickhouse-client --query 'SELECT 1' Code: 210. DB::NetException: Connection refused (localhost:9000). (NETWORK_ERROR) + '[' 8 -gt 120 ']' + clickhouse start --user root + sleep 0.5 127.0.0.1 - - [28/Oct/2026:13:54:03 +0000] "PUT /devstoreaccount1/cont?restype=container HTTP/1.1" 409 - + counter=9 + clickhouse-client --query 'SELECT 1' 127.0.0.1 - - [28/Oct/2026:13:54:03 +0000] "PUT /devstoreaccount1/cont/yfuxngtymierfemqoaxonktxjcxbpenf?blockid=syhqipsqanuewzdzvythgylywbcvprstoerpkkhflslpbpgkqaifxekabfpheumz&comp=block HTTP/1.1" 201 - 127.0.0.1 - - [28/Oct/2026:13:54:03 +0000] "PUT /devstoreaccount1/cont/yfuxngtymierfemqoaxonktxjcxbpenf?comp=blocklist HTTP/1.1" 201 - 127.0.0.1 - - [28/Oct/2026:13:54:03 +0000] "GET /devstoreaccount1/cont/yfuxngtymierfemqoaxonktxjcxbpenf HTTP/1.1" 206 4 127.0.0.1 - - [28/Oct/2026:13:54:03 +0000] "GET /devstoreaccount1/cont/yfuxngtymierfemqoaxonktxjcxbpenf HTTP/1.1" 206 2 127.0.0.1 - - [28/Oct/2026:13:54:04 +0000] "DELETE /devstoreaccount1/cont/yfuxngtymierfemqoaxonktxjcxbpenf HTTP/1.1" 202 - Code: 210. DB::NetException: Connection refused (localhost:9000). (NETWORK_ERROR) + '[' 9 -gt 120 ']' + clickhouse start --user root + sleep 0.5 + counter=10 + clickhouse-client --query 'SELECT 1' Code: 210. DB::NetException: Connection refused (localhost:9000). (NETWORK_ERROR) + '[' 10 -gt 120 ']' + clickhouse start --user root + sleep 0.5 + counter=11 + clickhouse-client --query 'SELECT 1' Code: 210. DB::NetException: Connection refused (localhost:9000). (NETWORK_ERROR) + '[' 11 -gt 120 ']' + clickhouse start --user root + sleep 0.5 + counter=12 + clickhouse-client --query 'SELECT 1' 1 + attach_gdb_to_clickhouse ++ kill -l SIGRTMIN + RTMIN=34 + echo ' set follow-fork-mode parent handle SIGHUP nostop noprint pass handle SIGINT nostop noprint pass handle SIGQUIT nostop noprint pass handle SIGPIPE nostop noprint pass handle SIGTERM nostop noprint pass handle SIGUSR1 nostop noprint pass handle SIGUSR2 nostop noprint pass handle SIG34 nostop noprint pass info signals continue backtrace full thread apply all backtrace full info registers disassemble /s up disassemble /s up disassemble /s p "done" detach quit ' + sleep 5 + ts '%Y-%m-%d %H:%M:%S' ++ cat /var/run/clickhouse-server/clickhouse-server.pid + gdb -batch -command script.gdb -p 889 + run_with_retry 60 clickhouse-client --query 'SELECT '\''Connected to clickhouse-server after attaching gdb'\''' + [[ hxB =~ e ]] + set_e=false + set +e + local total_retries=60 + shift + local retry=0 + '[' 0 -ge 60 ']' + clickhouse-client --query 'SELECT '\''Connected to clickhouse-server after attaching gdb'\''' Connected to clickhouse-server after attaching gdb + false + return + clickhouse-client --query 'SHOW TABLES FROM datasets' hits_v1 visits_v1 + clickhouse-client --query 'SHOW TABLES FROM test' + clickhouse-client --query 'CREATE TABLE test.hits_s3 (WatchID UInt64, JavaEnable UInt8, Title String, GoodEvent Int16, EventTime DateTime, EventDate Date, CounterID UInt32, ClientIP UInt32, ClientIP6 FixedString(16), RegionID UInt32, UserID UInt64, CounterClass Int8, OS UInt8, UserAgent UInt8, URL String, Referer String, URLDomain String, RefererDomain String, Refresh UInt8, IsRobot UInt8, RefererCategories Array(UInt16), URLCategories Array(UInt16), URLRegions Array(UInt32), RefererRegions Array(UInt32), ResolutionWidth UInt16, ResolutionHeight UInt16, ResolutionDepth UInt8, FlashMajor UInt8, FlashMinor UInt8, FlashMinor2 String, NetMajor UInt8, NetMinor UInt8, UserAgentMajor UInt16, UserAgentMinor FixedString(2), CookieEnable UInt8, JavascriptEnable UInt8, IsMobile UInt8, MobilePhone UInt8, MobilePhoneModel String, Params String, IPNetworkID UInt32, TraficSourceID Int8, SearchEngineID UInt16, SearchPhrase String, AdvEngineID UInt8, IsArtifical UInt8, WindowClientWidth UInt16, WindowClientHeight UInt16, ClientTimeZone Int16, ClientEventTime DateTime, SilverlightVersion1 UInt8, SilverlightVersion2 UInt8, SilverlightVersion3 UInt32, SilverlightVersion4 UInt16, PageCharset String, CodeVersion UInt32, IsLink UInt8, IsDownload UInt8, IsNotBounce UInt8, FUniqID UInt64, HID UInt32, IsOldCounter UInt8, IsEvent UInt8, IsParameter UInt8, DontCountHits UInt8, WithHash UInt8, HitColor FixedString(1), UTCEventTime DateTime, Age UInt8, Sex UInt8, Income UInt8, Interests UInt16, Robotness UInt8, GeneralInterests Array(UInt16), RemoteIP UInt32, RemoteIP6 FixedString(16), WindowName Int32, OpenerName Int32, HistoryLength Int16, BrowserLanguage FixedString(2), BrowserCountry FixedString(2), SocialNetwork String, SocialAction String, HTTPError UInt16, SendTiming Int32, DNSTiming Int32, ConnectTiming Int32, ResponseStartTiming Int32, ResponseEndTiming Int32, FetchTiming Int32, RedirectTiming Int32, DOMInteractiveTiming Int32, DOMContentLoadedTiming Int32, DOMCompleteTiming Int32, LoadEventStartTiming Int32, LoadEventEndTiming Int32, NSToDOMContentLoadedTiming Int32, FirstPaintTiming Int32, RedirectCount Int8, SocialSourceNetworkID UInt8, SocialSourcePage String, ParamPrice Int64, ParamOrderID String, ParamCurrency FixedString(3), ParamCurrencyID UInt16, GoalsReached Array(UInt32), OpenstatServiceName String, OpenstatCampaignID String, OpenstatAdID String, OpenstatSourceID String, UTMSource String, UTMMedium String, UTMCampaign String, UTMContent String, UTMTerm String, FromTag String, HasGCLID UInt8, RefererHash UInt64, URLHash UInt64, CLID UInt32, YCLID UInt64, ShareService String, ShareURL String, ShareTitle String, ParsedParams Nested(Key1 String, Key2 String, Key3 String, Key4 String, Key5 String, ValueDouble Float64), IslandID FixedString(16), RequestNum UInt32, RequestTry UInt8) ENGINE = MergeTree() PARTITION BY toYYYYMM(EventDate) ORDER BY (CounterID, EventDate, intHash32(UserID)) SAMPLE BY intHash32(UserID) SETTINGS index_granularity = 8192, storage_policy='\''s3_cache'\''' + clickhouse-client --query 'CREATE TABLE test.hits (WatchID UInt64, JavaEnable UInt8, Title String, GoodEvent Int16, EventTime DateTime, EventDate Date, CounterID UInt32, ClientIP UInt32, ClientIP6 FixedString(16), RegionID UInt32, UserID UInt64, CounterClass Int8, OS UInt8, UserAgent UInt8, URL String, Referer String, URLDomain String, RefererDomain String, Refresh UInt8, IsRobot UInt8, RefererCategories Array(UInt16), URLCategories Array(UInt16), URLRegions Array(UInt32), RefererRegions Array(UInt32), ResolutionWidth UInt16, ResolutionHeight UInt16, ResolutionDepth UInt8, FlashMajor UInt8, FlashMinor UInt8, FlashMinor2 String, NetMajor UInt8, NetMinor UInt8, UserAgentMajor UInt16, UserAgentMinor FixedString(2), CookieEnable UInt8, JavascriptEnable UInt8, IsMobile UInt8, MobilePhone UInt8, MobilePhoneModel String, Params String, IPNetworkID UInt32, TraficSourceID Int8, SearchEngineID UInt16, SearchPhrase String, AdvEngineID UInt8, IsArtifical UInt8, WindowClientWidth UInt16, WindowClientHeight UInt16, ClientTimeZone Int16, ClientEventTime DateTime, SilverlightVersion1 UInt8, SilverlightVersion2 UInt8, SilverlightVersion3 UInt32, SilverlightVersion4 UInt16, PageCharset String, CodeVersion UInt32, IsLink UInt8, IsDownload UInt8, IsNotBounce UInt8, FUniqID UInt64, HID UInt32, IsOldCounter UInt8, IsEvent UInt8, IsParameter UInt8, DontCountHits UInt8, WithHash UInt8, HitColor FixedString(1), UTCEventTime DateTime, Age UInt8, Sex UInt8, Income UInt8, Interests UInt16, Robotness UInt8, GeneralInterests Array(UInt16), RemoteIP UInt32, RemoteIP6 FixedString(16), WindowName Int32, OpenerName Int32, HistoryLength Int16, BrowserLanguage FixedString(2), BrowserCountry FixedString(2), SocialNetwork String, SocialAction String, HTTPError UInt16, SendTiming Int32, DNSTiming Int32, ConnectTiming Int32, ResponseStartTiming Int32, ResponseEndTiming Int32, FetchTiming Int32, RedirectTiming Int32, DOMInteractiveTiming Int32, DOMContentLoadedTiming Int32, DOMCompleteTiming Int32, LoadEventStartTiming Int32, LoadEventEndTiming Int32, NSToDOMContentLoadedTiming Int32, FirstPaintTiming Int32, RedirectCount Int8, SocialSourceNetworkID UInt8, SocialSourcePage String, ParamPrice Int64, ParamOrderID String, ParamCurrency FixedString(3), ParamCurrencyID UInt16, GoalsReached Array(UInt32), OpenstatServiceName String, OpenstatCampaignID String, OpenstatAdID String, OpenstatSourceID String, UTMSource String, UTMMedium String, UTMCampaign String, UTMContent String, UTMTerm String, FromTag String, HasGCLID UInt8, RefererHash UInt64, URLHash UInt64, CLID UInt32, YCLID UInt64, ShareService String, ShareURL String, ShareTitle String, ParsedParams Nested(Key1 String, Key2 String, Key3 String, Key4 String, Key5 String, ValueDouble Float64), IslandID FixedString(16), RequestNum UInt32, RequestTry UInt8) ENGINE = MergeTree() PARTITION BY toYYYYMM(EventDate) ORDER BY (CounterID, EventDate, intHash32(UserID)) SAMPLE BY intHash32(UserID) SETTINGS index_granularity = 8192, storage_policy='\''s3_cache'\''' + clickhouse-client --query 'CREATE TABLE test.visits (CounterID UInt32, StartDate Date, Sign Int8, IsNew UInt8, VisitID UInt64, UserID UInt64, StartTime DateTime, Duration UInt32, UTCStartTime DateTime, PageViews Int32, Hits Int32, IsBounce UInt8, Referer String, StartURL String, RefererDomain String, StartURLDomain String, EndURL String, LinkURL String, IsDownload UInt8, TraficSourceID Int8, SearchEngineID UInt16, SearchPhrase String, AdvEngineID UInt8, PlaceID Int32, RefererCategories Array(UInt16), URLCategories Array(UInt16), URLRegions Array(UInt32), RefererRegions Array(UInt32), IsYandex UInt8, GoalReachesDepth Int32, GoalReachesURL Int32, GoalReachesAny Int32, SocialSourceNetworkID UInt8, SocialSourcePage String, MobilePhoneModel String, ClientEventTime DateTime, RegionID UInt32, ClientIP UInt32, ClientIP6 FixedString(16), RemoteIP UInt32, RemoteIP6 FixedString(16), IPNetworkID UInt32, SilverlightVersion3 UInt32, CodeVersion UInt32, ResolutionWidth UInt16, ResolutionHeight UInt16, UserAgentMajor UInt16, UserAgentMinor UInt16, WindowClientWidth UInt16, WindowClientHeight UInt16, SilverlightVersion2 UInt8, SilverlightVersion4 UInt16, FlashVersion3 UInt16, FlashVersion4 UInt16, ClientTimeZone Int16, OS UInt8, UserAgent UInt8, ResolutionDepth UInt8, FlashMajor UInt8, FlashMinor UInt8, NetMajor UInt8, NetMinor UInt8, MobilePhone UInt8, SilverlightVersion1 UInt8, Age UInt8, Sex UInt8, Income UInt8, JavaEnable UInt8, CookieEnable UInt8, JavascriptEnable UInt8, IsMobile UInt8, BrowserLanguage UInt16, BrowserCountry UInt16, Interests UInt16, Robotness UInt8, GeneralInterests Array(UInt16), Params Array(String), Goals Nested(ID UInt32, Serial UInt32, EventTime DateTime, Price Int64, OrderID String, CurrencyID UInt32), WatchIDs Array(UInt64), ParamSumPrice Int64, ParamCurrency FixedString(3), ParamCurrencyID UInt16, ClickLogID UInt64, ClickEventID Int32, ClickGoodEvent Int32, ClickEventTime DateTime, ClickPriorityID Int32, ClickPhraseID Int32, ClickPageID Int32, ClickPlaceID Int32, ClickTypeID Int32, ClickResourceID Int32, ClickCost UInt32, ClickClientIP UInt32, ClickDomainID UInt32, ClickURL String, ClickAttempt UInt8, ClickOrderID UInt32, ClickBannerID UInt32, ClickMarketCategoryID UInt32, ClickMarketPP UInt32, ClickMarketCategoryName String, ClickMarketPPName String, ClickAWAPSCampaignName String, ClickPageName String, ClickTargetType UInt16, ClickTargetPhraseID UInt64, ClickContextType UInt8, ClickSelectType Int8, ClickOptions String, ClickGroupBannerID Int32, OpenstatServiceName String, OpenstatCampaignID String, OpenstatAdID String, OpenstatSourceID String, UTMSource String, UTMMedium String, UTMCampaign String, UTMContent String, UTMTerm String, FromTag String, HasGCLID UInt8, FirstVisit DateTime, PredLastVisit Date, LastVisit Date, TotalVisits UInt32, TraficSource Nested(ID Int8, SearchEngineID UInt16, AdvEngineID UInt8, PlaceID UInt16, SocialSourceNetworkID UInt8, Domain String, SearchPhrase String, SocialSourcePage String), Attendance FixedString(16), CLID UInt32, YCLID UInt64, NormalizedRefererHash UInt64, SearchPhraseHash UInt64, RefererDomainHash UInt64, NormalizedStartURLHash UInt64, StartURLDomainHash UInt64, NormalizedEndURLHash UInt64, TopLevelDomain UInt64, URLScheme UInt64, OpenstatServiceNameHash UInt64, OpenstatCampaignIDHash UInt64, OpenstatAdIDHash UInt64, OpenstatSourceIDHash UInt64, UTMSourceHash UInt64, UTMMediumHash UInt64, UTMCampaignHash UInt64, UTMContentHash UInt64, UTMTermHash UInt64, FromHash UInt64, WebVisorEnabled UInt8, WebVisorActivity UInt32, ParsedParams Nested(Key1 String, Key2 String, Key3 String, Key4 String, Key5 String, ValueDouble Float64), Market Nested(Type UInt8, GoalID UInt32, OrderID String, OrderPrice Int64, PP UInt32, DirectPlaceID UInt32, DirectOrderID UInt32, DirectBannerID UInt32, GoodID String, GoodName String, GoodQuantity Int32, GoodPrice Int64), IslandID FixedString(16)) ENGINE = CollapsingMergeTree(Sign) PARTITION BY toYYYYMM(StartDate) ORDER BY (CounterID, StartDate, intHash32(UserID), VisitID) SAMPLE BY intHash32(UserID) SETTINGS index_granularity = 8192, storage_policy='\''s3_cache'\''' + clickhouse-client --query 'INSERT INTO test.hits_s3 SELECT * FROM datasets.hits_v1 SETTINGS enable_filesystem_cache_on_write_operations=0' + clickhouse-client --query 'INSERT INTO test.hits SELECT * FROM datasets.hits_v1 SETTINGS enable_filesystem_cache_on_write_operations=0' + clickhouse-client --query 'INSERT INTO test.visits SELECT * FROM datasets.visits_v1 SETTINGS enable_filesystem_cache_on_write_operations=0' + clickhouse-client --query 'DROP TABLE datasets.visits_v1 SYNC' + clickhouse-client --query 'DROP TABLE datasets.hits_v1 SYNC' + clickhouse-client --query 'SHOW TABLES FROM test' hits hits_s3 visits + clickhouse-client --query 'SYSTEM STOP THREAD FUZZER' + stop + local max_tries=90 + local check_hang=true + local pid ++ cat /var/run/clickhouse-server/clickhouse-server.pid + pid=889 + clickhouse stop --max-tries 90 --do-not-kill script.gdb:13: Error in sourced command file: No stack. /var/run/clickhouse-server/clickhouse-server.pid file exists and contains pid = 889. The process with pid = 889 is running. Sent terminate signal to process with pid 889. Waiting for server to stop /var/run/clickhouse-server/clickhouse-server.pid file exists and contains pid = 889. The process with pid = 889 is running. Waiting for server to stop /var/run/clickhouse-server/clickhouse-server.pid file exists and contains pid = 889. The process with pid = 889 is running. Waiting for server to stop /var/run/clickhouse-server/clickhouse-server.pid file exists and contains pid = 889. The process with pid = 889 is running. Waiting for server to stop Found pid = 889 in the list of running processes. The process with pid = 889 is running. Waiting for server to stop Now there is no clickhouse-server process. Server stopped + return + export USE_S3_STORAGE_FOR_MERGE_TREE=1 + USE_S3_STORAGE_FOR_MERGE_TREE=1 + export ZOOKEEPER_FAULT_INJECTION=1 + ZOOKEEPER_FAULT_INJECTION=1 + configure + export USE_DATABASE_ORDINARY=1 + USE_DATABASE_ORDINARY=1 + export EXPORT_S3_STORAGE_POLICIES=1 + EXPORT_S3_STORAGE_POLICIES=1 + /usr/share/clickhouse-test/config/install.sh + DEST_SERVER_PATH=/etc/clickhouse-server + DEST_CLIENT_PATH=/etc/clickhouse-client +++ dirname /usr/share/clickhouse-test/config/install.sh ++ cd /usr/share/clickhouse-test/config ++ pwd -P + SRC_PATH=/usr/share/clickhouse-test/config + echo 'Going to install test configs from /usr/share/clickhouse-test/config into /etc/clickhouse-server' Going to install test configs from /usr/share/clickhouse-test/config into /etc/clickhouse-server + mkdir -p /etc/clickhouse-server/config.d/ + mkdir -p /etc/clickhouse-server/users.d/ + mkdir -p /etc/clickhouse-client + ln -sf /usr/share/clickhouse-test/config/config.d/zookeeper_write.xml /etc/clickhouse-server/config.d/ + ln -sf /usr/share/clickhouse-test/config/config.d/listen.xml /etc/clickhouse-server/config.d/ + ln -sf /usr/share/clickhouse-test/config/config.d/text_log.xml /etc/clickhouse-server/config.d/ + ln -sf /usr/share/clickhouse-test/config/config.d/custom_settings_prefixes.xml /etc/clickhouse-server/config.d/ + ln -sf /usr/share/clickhouse-test/config/config.d/enable_access_control_improvements.xml /etc/clickhouse-server/config.d/ + ln -sf /usr/share/clickhouse-test/config/config.d/macros.xml /etc/clickhouse-server/config.d/ + ln -sf /usr/share/clickhouse-test/config/config.d/disks.xml /etc/clickhouse-server/config.d/ + ln -sf /usr/share/clickhouse-test/config/config.d/secure_ports.xml /etc/clickhouse-server/config.d/ + ln -sf /usr/share/clickhouse-test/config/config.d/clusters.xml /etc/clickhouse-server/config.d/ + ln -sf /usr/share/clickhouse-test/config/config.d/graphite.xml /etc/clickhouse-server/config.d/ + ln -sf /usr/share/clickhouse-test/config/config.d/database_atomic.xml /etc/clickhouse-server/config.d/ + ln -sf /usr/share/clickhouse-test/config/config.d/max_concurrent_queries.xml /etc/clickhouse-server/config.d/ + ln -sf /usr/share/clickhouse-test/config/config.d/merge_tree_settings.xml /etc/clickhouse-server/config.d/ + ln -sf /usr/share/clickhouse-test/config/config.d/merge_tree_old_dirs_cleanup.xml /etc/clickhouse-server/config.d/ + ln -sf /usr/share/clickhouse-test/config/config.d/test_cluster_with_incorrect_pw.xml /etc/clickhouse-server/config.d/ + ln -sf /usr/share/clickhouse-test/config/config.d/keeper_port.xml /etc/clickhouse-server/config.d/ + ln -sf /usr/share/clickhouse-test/config/config.d/logging_no_rotate.xml /etc/clickhouse-server/config.d/ + ln -sf /usr/share/clickhouse-test/config/config.d/merge_tree.xml /etc/clickhouse-server/config.d/ + ln -sf /usr/share/clickhouse-test/config/config.d/lost_forever_check.xml /etc/clickhouse-server/config.d/ + ln -sf /usr/share/clickhouse-test/config/config.d/metadata_cache.xml /etc/clickhouse-server/config.d/ + ln -sf /usr/share/clickhouse-test/config/config.d/tcp_with_proxy.xml /etc/clickhouse-server/config.d/ + ln -sf /usr/share/clickhouse-test/config/config.d/prometheus.xml /etc/clickhouse-server/config.d/ + ln -sf /usr/share/clickhouse-test/config/config.d/top_level_domains_lists.xml /etc/clickhouse-server/config.d/ + ln -sf /usr/share/clickhouse-test/config/config.d/top_level_domains_path.xml /etc/clickhouse-server/config.d/ + ln -sf /usr/share/clickhouse-test/config/config.d/transactions.xml /etc/clickhouse-server/config.d/ + ln -sf /usr/share/clickhouse-test/config/config.d/encryption.xml /etc/clickhouse-server/config.d/ + ln -sf /usr/share/clickhouse-test/config/config.d/CORS.xml /etc/clickhouse-server/config.d/ + ln -sf /usr/share/clickhouse-test/config/config.d/zookeeper_log.xml /etc/clickhouse-server/config.d/ + ln -sf /usr/share/clickhouse-test/config/config.d/logger_trace.xml /etc/clickhouse-server/config.d/ + ln -sf /usr/share/clickhouse-test/config/config.d/named_collection.xml /etc/clickhouse-server/config.d/ + ln -sf /usr/share/clickhouse-test/config/config.d/ssl_certs.xml /etc/clickhouse-server/config.d/ + ln -sf /usr/share/clickhouse-test/config/config.d/filesystem_cache_log.xml /etc/clickhouse-server/config.d/ + ln -sf /usr/share/clickhouse-test/config/config.d/session_log.xml /etc/clickhouse-server/config.d/ + ln -sf /usr/share/clickhouse-test/config/config.d/system_unfreeze.xml /etc/clickhouse-server/config.d/ + ln -sf /usr/share/clickhouse-test/config/config.d/enable_zero_copy_replication.xml /etc/clickhouse-server/config.d/ + ln -sf /usr/share/clickhouse-test/config/config.d/nlp.xml /etc/clickhouse-server/config.d/ + ln -sf /usr/share/clickhouse-test/config/config.d/forbidden_headers.xml /etc/clickhouse-server/config.d/ + ln -sf /usr/share/clickhouse-test/config/config.d/enable_keeper_map.xml /etc/clickhouse-server/config.d/ + ln -sf /usr/share/clickhouse-test/config/config.d/custom_disks_base_path.xml /etc/clickhouse-server/config.d/ + ln -sf /usr/share/clickhouse-test/config/config.d/display_name.xml /etc/clickhouse-server/config.d/ + ln -sf /usr/share/clickhouse-test/config/config.d/reverse_dns_query_function.xml /etc/clickhouse-server/config.d/ + ln -sf /usr/share/clickhouse-test/config/config.d/compressed_marks_and_index.xml /etc/clickhouse-server/config.d/ + ln -sf /usr/share/clickhouse-test/config/config.d/disable_s3_env_credentials.xml /etc/clickhouse-server/config.d/ + ln -sf /usr/share/clickhouse-test/config/config.d/enable_wait_for_shutdown_replicated_tables.xml /etc/clickhouse-server/config.d/ + ln -sf /usr/share/clickhouse-test/config/config.d/backups.xml /etc/clickhouse-server/config.d/ + ln -sf /usr/share/clickhouse-test/config/config.d/filesystem_caches_path.xml /etc/clickhouse-server/config.d/ + ln -sf /usr/share/clickhouse-test/config/config.d/validate_tcp_client_information.xml /etc/clickhouse-server/config.d/ + '[' /etc/clickhouse-server = /etc/clickhouse-server ']' + ln -sf /usr/share/clickhouse-test/config/config.d/legacy_geobase.xml /etc/clickhouse-server/config.d/ + ln -sf /usr/share/clickhouse-test/config/users.d/log_queries.xml /etc/clickhouse-server/users.d/ + ln -sf /usr/share/clickhouse-test/config/users.d/readonly.xml /etc/clickhouse-server/users.d/ + ln -sf /usr/share/clickhouse-test/config/users.d/access_management.xml /etc/clickhouse-server/users.d/ + ln -sf /usr/share/clickhouse-test/config/users.d/database_atomic_drop_detach_sync.xml /etc/clickhouse-server/users.d/ + ln -sf /usr/share/clickhouse-test/config/users.d/opentelemetry.xml /etc/clickhouse-server/users.d/ + ln -sf /usr/share/clickhouse-test/config/users.d/remote_queries.xml /etc/clickhouse-server/users.d/ + ln -sf /usr/share/clickhouse-test/config/users.d/session_log_test.xml /etc/clickhouse-server/users.d/ + ln -sf /usr/share/clickhouse-test/config/users.d/memory_profiler.xml /etc/clickhouse-server/users.d/ + ln -sf /usr/share/clickhouse-test/config/users.d/no_fsync_metadata.xml /etc/clickhouse-server/users.d/ + ln -sf /usr/share/clickhouse-test/config/users.d/filelog.xml /etc/clickhouse-server/users.d/ + ln -sf /usr/share/clickhouse-test/config/users.d/enable_blobs_check.xml /etc/clickhouse-server/users.d/ + ln -sf /usr/share/clickhouse-test/config/users.d/marks.xml /etc/clickhouse-server/users.d/ + ln -sf /usr/share/clickhouse-test/config/users.d/insert_keeper_retries.xml /etc/clickhouse-server/users.d/ + ln -sf /usr/share/clickhouse-test/config/users.d/prefetch_settings.xml /etc/clickhouse-server/users.d/ + ln -sf /usr/share/clickhouse-test/config/users.d/nonconst_timezone.xml /etc/clickhouse-server/users.d/ + [[ -n '' ]] + ln -sf /usr/share/clickhouse-test/config/users.d/timeouts.xml /etc/clickhouse-server/users.d/ + ln -sf /usr/share/clickhouse-test/config/ints_dictionary.xml /etc/clickhouse-server/ + ln -sf /usr/share/clickhouse-test/config/strings_dictionary.xml /etc/clickhouse-server/ + ln -sf /usr/share/clickhouse-test/config/decimals_dictionary.xml /etc/clickhouse-server/ + ln -sf /usr/share/clickhouse-test/config/executable_dictionary.xml /etc/clickhouse-server/ + ln -sf /usr/share/clickhouse-test/config/executable_pool_dictionary.xml /etc/clickhouse-server/ + ln -sf /usr/share/clickhouse-test/config/test_function.xml /etc/clickhouse-server/ + ln -sf /usr/share/clickhouse-test/config/top_level_domains /etc/clickhouse-server/ + ln -sf /usr/share/clickhouse-test/config/regions_hierarchy.txt /etc/clickhouse-server/config.d/ + ln -sf /usr/share/clickhouse-test/config/regions_names_en.txt /etc/clickhouse-server/config.d/ + ln -sf /usr/share/clickhouse-test/config/ext-en.txt /etc/clickhouse-server/config.d/ + ln -sf /usr/share/clickhouse-test/config/ext-ru.txt /etc/clickhouse-server/config.d/ + ln -sf /usr/share/clickhouse-test/config/lem-en.bin /etc/clickhouse-server/config.d/ + ln -sf /usr/share/clickhouse-test/config/server.key /etc/clickhouse-server/ + ln -sf /usr/share/clickhouse-test/config/server.crt /etc/clickhouse-server/ + ln -sf /usr/share/clickhouse-test/config/dhparam.pem /etc/clickhouse-server/ + ln -sf --backup=simple --suffix=_original.xml /usr/share/clickhouse-test/config/config.d/query_masking_rules.xml /etc/clickhouse-server/config.d/ + [[ -n 1 ]] + [[ 1 -eq 1 ]] + rm -f /etc/clickhouse-server/config.d/zookeeper.xml + ln -sf /usr/share/clickhouse-test/config/config.d/zookeeper_fault_injection.xml /etc/clickhouse-server/config.d/ + create_snapshot_on_exit=0 + sed --follow-symlinks -i 's|true|0|' /etc/clickhouse-server/config.d/keeper_port.xml + [[ -n '' ]] + [[ -n 1 ]] + [[ 1 -eq 1 ]] + ln -sf /usr/share/clickhouse-test/config/users.d/database_ordinary.xml /etc/clickhouse-server/users.d/ + [[ -n 1 ]] + [[ 1 -eq 1 ]] + ln -sf /usr/share/clickhouse-test/config/config.d/s3_storage_policy_by_default.xml /etc/clickhouse-server/config.d/ + ARM=aarch64 ++ uname -m + OS=x86_64 + [[ -n 1 ]] + echo x86_64 + [[ '' -eq 1 ]] + [[ x86_64 == \a\a\r\c\h\6\4 ]] + echo 'Adding azure configuration' + ln -sf /usr/share/clickhouse-test/config/config.d/azure_storage_conf.xml /etc/clickhouse-server/config.d/ x86_64 Adding azure configuration + ln -sf /usr/share/clickhouse-test/config/config.d/storage_conf.xml /etc/clickhouse-server/config.d/ + ln -sf /usr/share/clickhouse-test/config/users.d/s3_cache.xml /etc/clickhouse-server/users.d/ + [[ -n '' ]] + ln -sf /usr/share/clickhouse-test/config/client_config.xml /etc/clickhouse-client/config.xml + sudo cat /etc/clickhouse-server/config.d/keeper_port.xml + sed 's|100000|10000|' + sudo mv /etc/clickhouse-server/config.d/keeper_port.xml.tmp /etc/clickhouse-server/config.d/keeper_port.xml + sudo chown clickhouse /etc/clickhouse-server/config.d/keeper_port.xml + sudo chgrp clickhouse /etc/clickhouse-server/config.d/keeper_port.xml + echo 'ASAN_OPTIONS='\''malloc_context_size=10 verbosity=1 allocator_release_to_os_interval_ms=10000'\''' + export 'ASAN_OPTIONS=malloc_context_size=10 allocator_release_to_os_interval_ms=10000' + ASAN_OPTIONS='malloc_context_size=10 allocator_release_to_os_interval_ms=10000' + sudo chown root: /var/lib/clickhouse + echo '1' + local total_mem ++ awk '/MemTotal/ { print $(NF-1) }' /proc/meminfo Setting max_server_memory_usage_to_ram_ratio to 0.5 + total_mem=32080792 + total_mem=32850731008 + max_server_memory_usage_to_ram_ratio=0.5 + echo 'Setting max_server_memory_usage_to_ram_ratio to 0.5' + cat Setting max_memory_usage_for_user=9855219302 and max_memory_usage for queries to 10G + local max_users_mem + max_users_mem=9855219302 + echo 'Setting max_memory_usage_for_user=9855219302 and max_memory_usage for queries to 10G' + cat + cat + cat + sudo cat /etc/clickhouse-server/config.d/s3_storage_policy_by_default.xml + sed 's|
s3
|
s3
default|' + mv /etc/clickhouse-server/config.d/s3_storage_policy_by_default.xml.tmp /etc/clickhouse-server/config.d/s3_storage_policy_by_default.xml + sudo chown clickhouse /etc/clickhouse-server/config.d/s3_storage_policy_by_default.xml + sudo chgrp clickhouse /etc/clickhouse-server/config.d/s3_storage_policy_by_default.xml + sudo cat /etc/clickhouse-server/config.d/logger_trace.xml + sed 's|trace|test|' + mv /etc/clickhouse-server/config.d/logger_trace.xml.tmp /etc/clickhouse-server/config.d/logger_trace.xml + start + counter=0 + clickhouse-client --query 'SELECT 1' Code: 210. DB::NetException: Connection refused (localhost:9000). (NETWORK_ERROR) + '[' 0 -gt 120 ']' + clickhouse start --user root + sleep 0.5 + counter=1 + clickhouse-client --query 'SELECT 1' Code: 210. DB::NetException: Connection refused (localhost:9000). (NETWORK_ERROR) + '[' 1 -gt 120 ']' + clickhouse start --user root + sleep 0.5 + counter=2 + clickhouse-client --query 'SELECT 1' Code: 210. DB::NetException: Connection refused (localhost:9000). (NETWORK_ERROR) + '[' 2 -gt 120 ']' + clickhouse start --user root + sleep 0.5 + counter=3 + clickhouse-client --query 'SELECT 1' Code: 210. DB::NetException: Connection refused (localhost:9000). (NETWORK_ERROR) + '[' 3 -gt 120 ']' + clickhouse start --user root + sleep 0.5 + counter=4 + clickhouse-client --query 'SELECT 1' Code: 210. DB::NetException: Connection refused (localhost:9000). (NETWORK_ERROR) + '[' 4 -gt 120 ']' + clickhouse start --user root + sleep 0.5 + counter=5 + clickhouse-client --query 'SELECT 1' Code: 210. DB::NetException: Connection refused (localhost:9000). (NETWORK_ERROR) + '[' 5 -gt 120 ']' + clickhouse start --user root + sleep 0.5 + counter=6 + clickhouse-client --query 'SELECT 1' Code: 210. DB::NetException: Connection refused (localhost:9000). (NETWORK_ERROR) + '[' 6 -gt 120 ']' + clickhouse start --user root + sleep 0.5 + counter=7 + clickhouse-client --query 'SELECT 1' Code: 210. DB::NetException: Connection refused (localhost:9000). (NETWORK_ERROR) + '[' 7 -gt 120 ']' + clickhouse start --user root + sleep 0.5 127.0.0.1 - - [28/Oct/2026:14:12:41 +0000] "PUT /devstoreaccount1/cont?restype=container HTTP/1.1" 409 - 127.0.0.1 - - [28/Oct/2026:14:12:41 +0000] "PUT /devstoreaccount1/cont/fgapyfkvgecmpaosxnpbsuvybaqctxft?blockid=tnolebnfhkcxslndzvzhsetfgfijmdbmquhhecvfjwqwhytemwhnecnlneqlfrrg&comp=block HTTP/1.1" 201 - 127.0.0.1 - - [28/Oct/2026:14:12:41 +0000] "PUT /devstoreaccount1/cont/fgapyfkvgecmpaosxnpbsuvybaqctxft?comp=blocklist HTTP/1.1" 201 - 127.0.0.1 - - [28/Oct/2026:14:12:41 +0000] "GET /devstoreaccount1/cont/fgapyfkvgecmpaosxnpbsuvybaqctxft HTTP/1.1" 206 4 127.0.0.1 - - [28/Oct/2026:14:12:41 +0000] "GET /devstoreaccount1/cont/fgapyfkvgecmpaosxnpbsuvybaqctxft HTTP/1.1" 206 2 127.0.0.1 - - [28/Oct/2026:14:12:41 +0000] "DELETE /devstoreaccount1/cont/fgapyfkvgecmpaosxnpbsuvybaqctxft HTTP/1.1" 202 - + counter=8 + clickhouse-client --query 'SELECT 1' Code: 210. DB::NetException: Connection refused (localhost:9000). (NETWORK_ERROR) + '[' 8 -gt 120 ']' + clickhouse start --user root + sleep 0.5 + counter=9 + clickhouse-client --query 'SELECT 1' Code: 210. DB::NetException: Connection refused (localhost:9000). (NETWORK_ERROR) + '[' 9 -gt 120 ']' + clickhouse start --user root + sleep 0.5 + counter=10 + clickhouse-client --query 'SELECT 1' Code: 210. DB::NetException: Connection refused (localhost:9000). (NETWORK_ERROR) + '[' 10 -gt 120 ']' + clickhouse start --user root + sleep 0.5 + counter=11 + clickhouse-client --query 'SELECT 1' Code: 210. DB::NetException: Connection refused (localhost:9000). (NETWORK_ERROR) + '[' 11 -gt 120 ']' + clickhouse start --user root + sleep 0.5 + counter=12 + clickhouse-client --query 'SELECT 1' Code: 210. DB::NetException: Connection refused (localhost:9000). (NETWORK_ERROR) + '[' 12 -gt 120 ']' + clickhouse start --user root + sleep 0.5 + counter=13 + clickhouse-client --query 'SELECT 1' Code: 210. DB::NetException: Connection refused (localhost:9000). (NETWORK_ERROR) + '[' 13 -gt 120 ']' + clickhouse start --user root + sleep 0.5 + counter=14 + clickhouse-client --query 'SELECT 1' Code: 210. DB::NetException: Connection refused (localhost:9000). (NETWORK_ERROR) + '[' 14 -gt 120 ']' + clickhouse start --user root + sleep 0.5 + counter=15 + clickhouse-client --query 'SELECT 1' Code: 210. DB::NetException: Connection refused (localhost:9000). (NETWORK_ERROR) + '[' 15 -gt 120 ']' + clickhouse start --user root + sleep 0.5 + counter=16 + clickhouse-client --query 'SELECT 1' Code: 210. DB::NetException: Connection refused (localhost:9000). (NETWORK_ERROR) + '[' 16 -gt 120 ']' + clickhouse start --user root + sleep 0.5 + counter=17 + clickhouse-client --query 'SELECT 1' 1 + attach_gdb_to_clickhouse ++ kill -l SIGRTMIN + RTMIN=34 + echo ' set follow-fork-mode parent handle SIGHUP nostop noprint pass handle SIGINT nostop noprint pass handle SIGQUIT nostop noprint pass handle SIGPIPE nostop noprint pass handle SIGTERM nostop noprint pass handle SIGUSR1 nostop noprint pass handle SIGUSR2 nostop noprint pass handle SIG34 nostop noprint pass info signals continue backtrace full thread apply all backtrace full info registers disassemble /s up disassemble /s up disassemble /s p "done" detach quit ' + sleep 5 + ts '%Y-%m-%d %H:%M:%S' ++ cat /var/run/clickhouse-server/clickhouse-server.pid + gdb -batch -command script.gdb -p 1695 + run_with_retry 60 clickhouse-client --query 'SELECT '\''Connected to clickhouse-server after attaching gdb'\''' + [[ hxB =~ e ]] + set_e=false + set +e + local total_retries=60 + shift + local retry=0 + '[' 0 -ge 60 ']' + clickhouse-client --query 'SELECT '\''Connected to clickhouse-server after attaching gdb'\''' Connected to clickhouse-server after attaching gdb + false + return + stress --hung-check --drop-databases --output-folder test_output --skip-func-tests '' --global-time-limit 1200 2026-10-28 15:13:34,437 Run func tests '/usr/bin/clickhouse-test --global_time_limit=1200 ' 2026-10-28 15:13:34,939 Run func tests '/usr/bin/clickhouse-test --order=random --database=test_1 --client-option join_use_nulls=1 join_algorithm='parallel_hash' memory_tracker_fault_probability=0.001 group_by_use_nulls=1 --global_time_limit=1200 ' 2026-10-28 15:13:35,439 Run func tests '/usr/bin/clickhouse-test --order=random --db-engine="Replicated('/test/db/test_2', 's1', 'r1')" --client-option allow_experimental_database_replicated=1 enable_deflate_qpl_codec=1 --global_time_limit=1200 ' 2026-10-28 15:13:35,941 Run func tests '/usr/bin/clickhouse-test --order=random --database=test_3 --client-option join_algorithm='partial_merge' group_by_use_nulls=1 --global_time_limit=1200 ' 2026-10-28 15:13:36,442 Run func tests '/usr/bin/clickhouse-test --order=random --client-option join_use_nulls=1 --global_time_limit=1200 ' 2026-10-28 15:13:36,944 Run func tests '/usr/bin/clickhouse-test --order=random --db-engine="Replicated('/test/db/test_5', 's1', 'r1')" --database=test_5 --client-option allow_experimental_database_replicated=1 enable_deflate_qpl_codec=1 join_algorithm='full_sorting_merge' use_query_cache=1 group_by_use_nulls=1 --global_time_limit=1200 ' 2026-10-28 15:13:37,445 Run func tests '/usr/bin/clickhouse-test --order=random --client-option use_query_cache=1 memory_tracker_fault_probability=0.001 --global_time_limit=1200 ' 2026-10-28 15:13:37,947 Run func tests '/usr/bin/clickhouse-test --order=random --database=test_7 --client-option join_use_nulls=1 join_algorithm='grace_hash' use_query_cache=1 group_by_use_nulls=1 --global_time_limit=1200 ' 2026-10-28 15:13:38,448 Run func tests '/usr/bin/clickhouse-test --order=random --db-engine="Replicated('/test/db/test_8', 's1', 'r1')" --client-option allow_experimental_database_replicated=1 enable_deflate_qpl_codec=1 --global_time_limit=1200 ' 2026-10-28 15:13:38,950 Run func tests '/usr/bin/clickhouse-test --order=random --database=test_9 --client-option join_algorithm='auto' max_rows_in_join=1000 use_query_cache=1 group_by_use_nulls=1 --global_time_limit=1200 ' 2026-10-28 15:13:39,451 Run func tests '/usr/bin/clickhouse-test --order=random --client-option join_use_nulls=1 use_query_cache=1 --global_time_limit=1200 ' 2026-10-28 15:13:39,953 Run func tests '/usr/bin/clickhouse-test --order=random --db-engine="Replicated('/test/db/test_11', 's1', 'r1')" --database=test_11 --client-option allow_experimental_database_replicated=1 enable_deflate_qpl_codec=1 join_algorithm='parallel_hash' memory_tracker_fault_probability=0.001 group_by_use_nulls=1 --global_time_limit=1200 ' 2026-10-28 15:13:40,454 Run func tests '/usr/bin/clickhouse-test --order=random --client-option use_query_cache=1 implicit_transaction=1 throw_on_unsupported_query_inside_transaction=0 --global_time_limit=1200 ' 2026-10-28 15:13:40,955 Run func tests '/usr/bin/clickhouse-test --order=random --database=test_13 --client-option join_use_nulls=1 join_algorithm='partial_merge' use_query_cache=1 group_by_use_nulls=1 --global_time_limit=1200 ' 2026-10-28 15:13:41,457 Run func tests '/usr/bin/clickhouse-test --order=random --db-engine="Replicated('/test/db/test_14', 's1', 'r1')" --client-option allow_experimental_database_replicated=1 enable_deflate_qpl_codec=1 --global_time_limit=1200 ' 2026-10-28 15:13:41,958 Run func tests '/usr/bin/clickhouse-test --order=random --database=test_15 --client-option join_algorithm='full_sorting_merge' use_query_cache=1 group_by_use_nulls=1 --global_time_limit=1200 ' 2026-10-28 15:13:42,460 Will wait functests to finish 2026-10-28 15:13:42,460 Finished 0 from 16 processes 2026-10-28 15:13:47,464 Finished 0 from 16 processes 2026-10-28 15:13:52,469 Finished 0 from 16 processes 2026-10-28 15:13:57,474 Finished 0 from 16 processes 2026-10-28 15:14:02,478 Finished 0 from 16 processes 2026-10-28 15:14:07,482 Finished 0 from 16 processes 2026-10-28 15:14:12,483 Finished 0 from 16 processes 2026-10-28 15:14:17,488 Finished 0 from 16 processes 2026-10-28 15:14:22,491 Finished 0 from 16 processes 2026-10-28 15:14:27,495 Finished 0 from 16 processes 2026-10-28 15:14:32,499 Finished 0 from 16 processes 2026-10-28 15:14:37,504 Finished 0 from 16 processes 2026-10-28 15:14:42,507 Finished 0 from 16 processes 2026-10-28 15:14:47,511 Finished 0 from 16 processes 2026-10-28 15:14:52,515 Finished 0 from 16 processes 2026-10-28 15:14:57,519 Finished 0 from 16 processes 2026-10-28 15:15:02,524 Finished 0 from 16 processes 2026-10-28 15:15:07,527 Finished 0 from 16 processes 2026-10-28 15:15:12,531 Finished 0 from 16 processes 2026-10-28 15:15:17,537 Finished 0 from 16 processes 2026-10-28 15:15:22,540 Finished 0 from 16 processes 2026-10-28 15:15:27,544 Finished 0 from 16 processes 2026-10-28 15:15:32,547 Finished 0 from 16 processes 2026-10-28 15:15:37,553 Finished 0 from 16 processes 2026-10-28 15:15:42,555 Finished 0 from 16 processes 2026-10-28 15:15:47,559 Finished 0 from 16 processes 2026-10-28 15:15:52,564 Finished 0 from 16 processes 2026-10-28 15:15:57,569 Finished 0 from 16 processes 2026-10-28 15:16:02,574 Finished 0 from 16 processes 2026-10-28 15:16:07,575 Finished 0 from 16 processes 2026-10-28 15:16:12,579 Finished 0 from 16 processes 2026-10-28 15:16:17,583 Finished 0 from 16 processes 2026-10-28 15:16:22,588 Finished 0 from 16 processes 2026-10-28 15:16:27,594 Finished 0 from 16 processes 2026-10-28 15:16:32,599 Finished 0 from 16 processes 2026-10-28 15:16:37,603 Finished 0 from 16 processes 2026-10-28 15:16:42,607 Finished 0 from 16 processes 2026-10-28 15:16:47,611 Finished 0 from 16 processes 2026-10-28 15:16:52,615 Finished 0 from 16 processes 2026-10-28 15:16:57,620 Finished 0 from 16 processes 2026-10-28 15:17:02,623 Finished 0 from 16 processes 2026-10-28 15:17:07,627 Finished 0 from 16 processes 2026-10-28 15:17:12,632 Finished 0 from 16 processes 2026-10-28 15:17:17,636 Finished 0 from 16 processes 2026-10-28 15:17:22,639 Finished 0 from 16 processes 2026-10-28 15:17:27,644 Finished 0 from 16 processes 2026-10-28 15:17:32,647 Finished 0 from 16 processes 2026-10-28 15:17:37,651 Finished 0 from 16 processes 2026-10-28 15:17:42,655 Finished 0 from 16 processes 2026-10-28 15:17:47,661 Finished 0 from 16 processes 2026-10-28 15:17:52,663 Finished 0 from 16 processes 2026-10-28 15:17:57,669 Finished 0 from 16 processes 2026-10-28 15:18:02,674 Finished 0 from 16 processes 2026-10-28 15:18:07,675 Finished 0 from 16 processes 2026-10-28 15:18:12,681 Finished 0 from 16 processes 2026-10-28 15:18:17,684 Finished 0 from 16 processes 2026-10-28 15:18:22,689 Finished 0 from 16 processes 2026-10-28 15:18:27,691 Finished 0 from 16 processes 2026-10-28 15:18:32,695 Finished 0 from 16 processes 2026-10-28 15:18:37,699 Finished 0 from 16 processes 2026-10-28 15:18:42,705 Finished 0 from 16 processes 2026-10-28 15:18:47,707 Finished 0 from 16 processes 2026-10-28 15:18:52,711 Finished 0 from 16 processes 2026-10-28 15:18:57,715 Finished 0 from 16 processes 2026-10-28 15:19:02,721 Finished 0 from 16 processes 2026-10-28 15:19:07,723 Finished 0 from 16 processes 2026-10-28 15:19:12,727 Finished 0 from 16 processes 2026-10-28 15:19:17,731 Finished 0 from 16 processes 2026-10-28 15:19:22,735 Finished 0 from 16 processes 2026-10-28 15:19:27,739 Finished 0 from 16 processes 2026-10-28 15:19:32,740 Finished 0 from 16 processes 2026-10-28 15:19:37,743 Finished 0 from 16 processes 2026-10-28 15:19:42,747 Finished 0 from 16 processes 2026-10-28 15:19:47,751 Finished 0 from 16 processes 2026-10-28 15:19:52,755 Finished 0 from 16 processes 2026-10-28 15:19:57,760 Finished 0 from 16 processes 2026-10-28 15:20:02,765 Finished 0 from 16 processes 2026-10-28 15:20:07,770 Finished 0 from 16 processes 2026-10-28 15:20:12,775 Finished 0 from 16 processes 2026-10-28 15:20:17,779 Finished 0 from 16 processes 2026-10-28 15:20:22,783 Finished 0 from 16 processes 2026-10-28 15:20:27,787 Finished 0 from 16 processes 2026-10-28 15:20:32,791 Finished 0 from 16 processes 2026-10-28 15:20:37,795 Finished 0 from 16 processes 2026-10-28 15:20:42,801 Finished 0 from 16 processes 2026-10-28 15:20:47,806 Finished 0 from 16 processes 2026-10-28 15:20:52,811 Finished 0 from 16 processes 2026-10-28 15:20:57,815 Finished 0 from 16 processes 2026-10-28 15:21:02,820 Finished 0 from 16 processes 2026-10-28 15:21:07,823 Finished 0 from 16 processes 2026-10-28 15:21:12,827 Finished 0 from 16 processes 2026-10-28 15:21:17,831 Finished 0 from 16 processes 2026-10-28 15:21:22,835 Finished 0 from 16 processes 2026-10-28 15:21:27,841 Finished 0 from 16 processes 2026-10-28 15:21:32,846 Finished 0 from 16 processes 2026-10-28 15:21:37,851 Finished 0 from 16 processes 2026-10-28 15:21:42,856 Finished 0 from 16 processes 2026-10-28 15:21:47,859 Finished 0 from 16 processes 2026-10-28 15:21:52,863 Finished 0 from 16 processes 2026-10-28 15:21:57,867 Finished 0 from 16 processes 2026-10-28 15:22:02,871 Finished 0 from 16 processes 2026-10-28 15:22:07,876 Finished 0 from 16 processes 2026-10-28 15:22:12,882 Finished 0 from 16 processes 2026-10-28 15:22:17,887 Finished 0 from 16 processes 2026-10-28 15:22:22,891 Finished 0 from 16 processes 2026-10-28 15:22:27,895 Finished 0 from 16 processes 2026-10-28 15:22:32,899 Finished 0 from 16 processes 2026-10-28 15:22:37,900 Finished 0 from 16 processes 2026-10-28 15:22:42,903 Finished 0 from 16 processes 2026-10-28 15:22:47,905 Finished 0 from 16 processes 2026-10-28 15:22:52,907 Finished 0 from 16 processes 2026-10-28 15:22:57,911 Finished 0 from 16 processes 2026-10-28 15:23:02,915 Finished 0 from 16 processes 2026-10-28 15:23:07,920 Finished 0 from 16 processes 2026-10-28 15:23:12,923 Finished 0 from 16 processes 2026-10-28 15:23:17,927 Finished 0 from 16 processes 2026-10-28 15:23:22,931 Finished 0 from 16 processes 2026-10-28 15:23:27,935 Finished 0 from 16 processes 2026-10-28 15:23:32,939 Finished 0 from 16 processes 2026-10-28 15:23:37,943 Finished 0 from 16 processes 2026-10-28 15:23:42,947 Finished 0 from 16 processes 2026-10-28 15:23:47,951 Finished 0 from 16 processes 2026-10-28 15:23:52,956 Finished 0 from 16 processes 2026-10-28 15:23:57,956 Finished 0 from 16 processes 2026-10-28 15:24:02,960 Finished 0 from 16 processes 2026-10-28 15:24:07,963 Finished 0 from 16 processes 2026-10-28 15:24:12,967 Finished 0 from 16 processes 2026-10-28 15:24:17,971 Finished 0 from 16 processes 2026-10-28 15:24:22,975 Finished 0 from 16 processes 2026-10-28 15:24:27,979 Finished 0 from 16 processes 2026-10-28 15:24:32,983 Finished 0 from 16 processes 2026-10-28 15:24:37,987 Finished 0 from 16 processes 2026-10-28 15:24:42,991 Finished 0 from 16 processes 2026-10-28 15:24:47,994 Finished 0 from 16 processes 2026-10-28 15:24:52,997 Finished 0 from 16 processes 2026-10-28 15:24:57,999 Finished 0 from 16 processes 2026-10-28 15:25:03,003 Finished 0 from 16 processes 2026-10-28 15:25:08,007 Finished 0 from 16 processes 2026-10-28 15:25:13,011 Finished 0 from 16 processes 2026-10-28 15:25:18,015 Finished 0 from 16 processes 2026-10-28 15:25:23,019 Finished 0 from 16 processes 2026-10-28 15:25:28,023 Finished 0 from 16 processes 2026-10-28 15:25:33,027 Finished 0 from 16 processes 2026-10-28 15:25:38,031 Finished 0 from 16 processes 2026-10-28 15:25:43,035 Finished 0 from 16 processes 2026-10-28 15:25:48,039 Finished 0 from 16 processes 2026-10-28 15:25:53,043 Finished 0 from 16 processes 2026-10-28 15:25:58,047 Finished 0 from 16 processes 2026-10-28 15:26:03,052 Finished 0 from 16 processes 2026-10-28 15:26:08,056 Finished 0 from 16 processes 2026-10-28 15:26:13,060 Finished 0 from 16 processes 2026-10-28 15:26:18,063 Finished 0 from 16 processes 2026-10-28 15:26:23,067 Finished 0 from 16 processes 2026-10-28 15:26:28,071 Finished 0 from 16 processes 2026-10-28 15:26:33,075 Finished 0 from 16 processes 2026-10-28 15:26:38,079 Finished 0 from 16 processes 2026-10-28 15:26:43,083 Finished 0 from 16 processes 2026-10-28 15:26:48,087 Finished 0 from 16 processes 2026-10-28 15:26:53,092 Finished 0 from 16 processes 2026-10-28 15:26:58,095 Finished 0 from 16 processes 2026-10-28 15:27:03,097 Finished 0 from 16 processes 2026-10-28 15:27:08,099 Finished 0 from 16 processes 2026-10-28 15:27:13,104 Finished 0 from 16 processes 2026-10-28 15:27:18,109 Finished 0 from 16 processes 2026-10-28 15:27:23,112 Finished 0 from 16 processes 2026-10-28 15:27:28,115 Finished 0 from 16 processes 2026-10-28 15:27:33,120 Finished 0 from 16 processes 2026-10-28 15:27:38,123 Finished 0 from 16 processes 2026-10-28 15:27:43,127 Finished 0 from 16 processes 2026-10-28 15:27:48,132 Finished 0 from 16 processes 2026-10-28 15:27:53,136 Finished 0 from 16 processes 2026-10-28 15:27:58,139 Finished 0 from 16 processes 2026-10-28 15:28:03,144 Finished 0 from 16 processes 2026-10-28 15:28:08,147 Finished 0 from 16 processes 2026-10-28 15:28:13,152 Finished 0 from 16 processes 2026-10-28 15:28:18,155 Finished 0 from 16 processes 2026-10-28 15:28:23,159 Finished 0 from 16 processes 2026-10-28 15:28:28,163 Finished 0 from 16 processes 2026-10-28 15:28:33,167 Finished 0 from 16 processes 2026-10-28 15:28:38,171 Finished 0 from 16 processes 2026-10-28 15:28:43,175 Finished 0 from 16 processes 2026-10-28 15:28:48,179 Finished 0 from 16 processes 2026-10-28 15:28:53,183 Finished 0 from 16 processes 2026-10-28 15:28:58,187 Finished 0 from 16 processes 2026-10-28 15:29:03,191 Finished 0 from 16 processes 2026-10-28 15:29:08,195 Finished 0 from 16 processes 2026-10-28 15:29:13,199 Finished 0 from 16 processes 2026-10-28 15:29:18,203 Finished 0 from 16 processes 2026-10-28 15:29:23,207 Finished 0 from 16 processes 2026-10-28 15:29:28,211 Finished 0 from 16 processes 2026-10-28 15:29:33,215 Finished 0 from 16 processes 2026-10-28 15:29:38,219 Finished 0 from 16 processes 2026-10-28 15:29:43,223 Finished 0 from 16 processes 2026-10-28 15:29:48,227 Finished 0 from 16 processes 2026-10-28 15:29:53,232 Finished 0 from 16 processes 2026-10-28 15:29:58,235 Finished 0 from 16 processes 2026-10-28 15:30:03,239 Finished 0 from 16 processes 2026-10-28 15:30:08,244 Finished 0 from 16 processes 2026-10-28 15:30:13,247 Finished 0 from 16 processes 2026-10-28 15:30:18,251 Finished 0 from 16 processes 2026-10-28 15:30:23,255 Finished 0 from 16 processes 2026-10-28 15:30:28,260 Finished 0 from 16 processes 2026-10-28 15:30:33,263 Finished 0 from 16 processes 2026-10-28 15:30:38,267 Finished 0 from 16 processes 2026-10-28 15:30:43,271 Finished 0 from 16 processes 2026-10-28 15:30:48,275 Finished 0 from 16 processes 2026-10-28 15:30:53,279 Finished 0 from 16 processes 2026-10-28 15:30:58,283 Finished 0 from 16 processes 2026-10-28 15:31:03,287 Finished 1 from 16 processes 2026-10-28 15:31:08,292 Finished 1 from 16 processes 2026-10-28 15:31:13,295 Finished 1 from 16 processes 2026-10-28 15:31:18,300 Finished 1 from 16 processes 2026-10-28 15:31:23,303 Finished 1 from 16 processes 2026-10-28 15:31:28,307 Finished 1 from 16 processes 2026-10-28 15:31:33,311 Finished 1 from 16 processes 2026-10-28 15:31:38,315 Finished 1 from 16 processes 2026-10-28 15:31:43,319 Finished 1 from 16 processes 2026-10-28 15:31:48,323 Finished 1 from 16 processes 2026-10-28 15:31:53,327 Finished 1 from 16 processes 2026-10-28 15:31:58,331 Finished 1 from 16 processes 2026-10-28 15:32:03,335 Finished 1 from 16 processes 2026-10-28 15:32:08,339 Finished 1 from 16 processes 2026-10-28 15:32:13,343 Finished 1 from 16 processes 2026-10-28 15:32:18,347 Finished 1 from 16 processes 2026-10-28 15:32:23,351 Finished 1 from 16 processes 2026-10-28 15:32:28,355 Finished 1 from 16 processes 2026-10-28 15:32:33,359 Finished 1 from 16 processes 2026-10-28 15:32:38,363 Finished 1 from 16 processes 2026-10-28 15:32:43,367 Finished 1 from 16 processes 2026-10-28 15:32:48,371 Finished 1 from 16 processes 2026-10-28 15:32:53,375 Finished 1 from 16 processes 2026-10-28 15:32:58,379 Finished 1 from 16 processes 2026-10-28 15:33:03,383 Finished 1 from 16 processes 2026-10-28 15:33:08,387 Finished 1 from 16 processes 2026-10-28 15:33:13,391 Finished 1 from 16 processes 2026-10-28 15:33:18,395 Finished 1 from 16 processes 2026-10-28 15:33:23,399 Finished 1 from 16 processes 2026-10-28 15:33:28,403 Finished 1 from 16 processes 2026-10-28 15:33:33,407 Finished 1 from 16 processes 2026-10-28 15:33:38,411 Finished 1 from 16 processes 2026-10-28 15:33:43,416 Finished 1 from 16 processes 2026-10-28 15:33:48,421 Finished 2 from 16 processes 2026-10-28 15:33:53,423 Finished 2 from 16 processes 2026-10-28 15:33:58,427 Finished 4 from 16 processes 2026-10-28 15:34:03,432 Finished 4 from 16 processes 2026-10-28 15:34:08,435 Finished 4 from 16 processes 2026-10-28 15:34:13,439 Finished 4 from 16 processes 2026-10-28 15:34:18,443 Finished 4 from 16 processes 2026-10-28 15:34:23,447 Finished 4 from 16 processes 2026-10-28 15:34:28,451 Finished 5 from 16 processes 2026-10-28 15:34:33,455 Finished 6 from 16 processes 2026-10-28 15:34:38,459 Finished 6 from 16 processes 2026-10-28 15:34:43,463 Finished 7 from 16 processes 2026-10-28 15:34:48,467 Finished 7 from 16 processes 2026-10-28 15:34:53,471 Finished 9 from 16 processes 2026-10-28 15:34:58,475 Finished 9 from 16 processes 2026-10-28 15:35:03,478 Finished 9 from 16 processes 2026-10-28 15:35:08,480 Finished 9 from 16 processes 2026-10-28 15:35:13,483 Finished 9 from 16 processes 2026-10-28 15:35:18,489 Finished 9 from 16 processes 2026-10-28 15:35:23,491 Finished 9 from 16 processes 2026-10-28 15:35:28,496 Finished 9 from 16 processes 2026-10-28 15:35:33,502 Finished 10 from 16 processes 2026-10-28 15:35:38,503 Finished 10 from 16 processes 2026-10-28 15:35:43,508 Finished 10 from 16 processes 2026-10-28 15:35:48,514 Finished 10 from 16 processes 2026-10-28 15:35:53,515 Finished 10 from 16 processes 2026-10-28 15:35:58,519 Finished 10 from 16 processes 2026-10-28 15:36:03,524 Finished 10 from 16 processes 2026-10-28 15:36:08,529 Finished 10 from 16 processes 2026-10-28 15:36:13,531 Finished 10 from 16 processes 2026-10-28 15:36:18,537 Finished 10 from 16 processes 2026-10-28 15:36:23,540 Finished 10 from 16 processes 2026-10-28 15:36:28,545 Finished 11 from 16 processes 2026-10-28 15:36:33,547 Finished 11 from 16 processes 2026-10-28 15:36:38,552 Finished 11 from 16 processes 2026-10-28 15:36:43,555 Finished 11 from 16 processes 2026-10-28 15:36:48,561 Finished 12 from 16 processes 2026-10-28 15:36:53,563 Finished 12 from 16 processes 2026-10-28 15:36:58,567 Finished 12 from 16 processes 2026-10-28 15:37:03,573 Finished 12 from 16 processes 2026-10-28 15:37:08,576 Finished 12 from 16 processes 2026-10-28 15:37:13,579 Finished 13 from 16 processes 2026-10-28 15:37:18,583 Finished 13 from 16 processes 2026-10-28 15:37:23,587 Finished 13 from 16 processes 2026-10-28 15:37:28,591 Finished 13 from 16 processes 2026-10-28 15:37:33,595 Finished 13 from 16 processes 2026-10-28 15:37:38,600 Finished 13 from 16 processes 2026-10-28 15:37:43,606 Finished 13 from 16 processes 2026-10-28 15:37:48,611 Finished 13 from 16 processes 2026-10-28 15:37:53,615 Finished 13 from 16 processes 2026-10-28 15:37:58,620 Finished 13 from 16 processes 2026-10-28 15:38:03,623 Finished 13 from 16 processes 2026-10-28 15:38:08,629 Finished 13 from 16 processes 2026-10-28 15:38:13,632 Finished 13 from 16 processes 2026-10-28 15:38:18,635 Finished 13 from 16 processes 2026-10-28 15:38:23,639 Finished 13 from 16 processes 2026-10-28 15:38:28,643 Finished 13 from 16 processes 2026-10-28 15:38:33,649 Finished 13 from 16 processes 2026-10-28 15:38:38,651 Finished 13 from 16 processes 2026-10-28 15:38:43,656 Finished 13 from 16 processes 2026-10-28 15:38:48,659 Finished 13 from 16 processes 2026-10-28 15:38:53,664 Finished 13 from 16 processes 2026-10-28 15:38:58,667 Finished 13 from 16 processes 2026-10-28 15:39:03,673 Finished 13 from 16 processes 2026-10-28 15:39:08,678 Finished 14 from 16 processes 2026-10-28 15:39:13,679 Finished 14 from 16 processes 2026-10-28 15:39:18,683 Finished 14 from 16 processes 2026-10-28 15:39:23,688 Finished 14 from 16 processes 2026-10-28 15:39:28,694 Finished 14 from 16 processes 2026-10-28 15:39:33,695 Finished 14 from 16 processes 2026-10-28 15:39:38,696 Finished 14 from 16 processes 2026-10-28 15:39:43,699 Finished 14 from 16 processes 2026-10-28 15:39:48,703 Finished 14 from 16 processes 2026-10-28 15:39:53,707 Finished 14 from 16 processes 2026-10-28 15:39:58,711 Finished 14 from 16 processes 2026-10-28 15:40:03,715 Finished 14 from 16 processes 2026-10-28 15:40:08,720 Finished 14 from 16 processes 2026-10-28 15:40:13,723 Finished 14 from 16 processes 2026-10-28 15:40:18,724 Finished 14 from 16 processes 2026-10-28 15:40:23,727 Finished 14 from 16 processes 2026-10-28 15:40:28,729 Finished 14 from 16 processes 2026-10-28 15:40:33,732 Finished 14 from 16 processes 2026-10-28 15:40:38,736 Finished 14 from 16 processes 2026-10-28 15:40:43,741 Finished 14 from 16 processes 2026-10-28 15:40:48,744 Finished 14 from 16 processes 2026-10-28 15:40:53,749 Finished 14 from 16 processes 2026-10-28 15:40:58,751 Finished 14 from 16 processes 2026-10-28 15:41:03,757 Finished 14 from 16 processes 2026-10-28 15:41:08,760 Finished 14 from 16 processes 2026-10-28 15:41:13,763 Finished 14 from 16 processes 2026-10-28 15:41:18,770 Finished 14 from 16 processes 2026-10-28 15:41:23,771 Finished 14 from 16 processes 2026-10-28 15:41:28,775 Finished 14 from 16 processes 2026-10-28 15:41:33,780 Finished 14 from 16 processes 2026-10-28 15:41:38,786 Finished 14 from 16 processes 2026-10-28 15:41:43,788 Finished 14 from 16 processes 2026-10-28 15:41:48,792 Finished 14 from 16 processes 2026-10-28 15:41:53,795 Finished 14 from 16 processes 2026-10-28 15:41:58,800 Finished 14 from 16 processes 2026-10-28 15:42:03,804 Finished 14 from 16 processes 2026-10-28 15:42:08,807 Finished 14 from 16 processes 2026-10-28 15:42:13,813 Finished 14 from 16 processes 2026-10-28 15:42:18,818 Finished 14 from 16 processes 2026-10-28 15:42:23,819 Finished 14 from 16 processes 2026-10-28 15:42:28,823 Finished 14 from 16 processes 2026-10-28 15:42:33,829 Finished 15 from 16 processes 2026-10-28 15:42:38,831 Finished 15 from 16 processes 2026-10-28 15:42:43,835 Finished 15 from 16 processes 2026-10-28 15:42:48,839 Finished 15 from 16 processes 2026-10-28 15:42:53,843 Finished 15 from 16 processes 2026-10-28 15:42:58,847 Finished 15 from 16 processes 2026-10-28 15:43:03,852 Finished 15 from 16 processes 2026-10-28 15:43:08,855 Finished 15 from 16 processes 2026-10-28 15:43:13,859 Finished 15 from 16 processes 2026-10-28 15:43:18,863 Finished 15 from 16 processes 2026-10-28 15:43:23,868 Finished 15 from 16 processes 2026-10-28 15:43:28,871 Finished 15 from 16 processes 2026-10-28 15:43:33,875 All processes finished 2026-10-28 15:43:33,875 Compressing stress logs 2026-10-28 15:43:33,903 Logs compressed 2026-10-28 15:43:33,903 Will terminate gdb (if any) Quit 2026-10-28 15:43:40,065 Checking if some queries hung Using queries from '/usr/share/clickhouse-test/queries' directory Connecting to ClickHouse server... OK Running 1 stateless tests (MainProcess). 00001_select_1: [ OK ] 1 tests passed. 0 tests skipped. 0.46 s elapsed (MainProcess). Won't run stateful tests because test data wasn't loaded. No queries hung. All tests have finished. Top patterns of log messages: count count_% size size_% uniq_loggers uniq_threads levels background_% message_format_string UInt64 Float64 String Float64 UInt64 UInt64 Array(String) Float64 LowCardinality(String) 13901 0.05 815.65 KiB 0.013 4 170 ['Trace'] 0 Access granted: {}{} 12122 0.044 2.55 MiB 0.041 1 69 ['Debug'] 0 (from {}{}{}){}{} {} (stage: {}) 11883 0.043 1.78 MiB 0.029 2 68 ['Trace'] 1 {} Creating query context from {} context, user_id: {}, parent context user: {} 10223 0.037 778.72 KiB 0.012 1 638 ['Debug'] 0.205 Remove from cache. Key: {}, offset: {}, size: {} 10154 0.037 604.88 KiB 0.009 1 240 ['Debug'] 0.949 Key {} is removed from metadata 10067 0.036 275.22 KiB 0.004 1 68 ['Debug'] 0.001 Processed in {} sec. 8102 0.029 24.04 MiB 0.386 8 128 ['Error'] 1 Table is in readonly mode (replica path: {}) 8032 0.029 718.53 KiB 0.011 1 763 ['Trace'] 0 Aggregated. {} to {} rows (from {}) in {} sec. ({:.3f} rows/sec., {}/sec.) 7829 0.028 451.08 KiB 0.007 1 452 ['Debug'] 0.036 Submitting key {} for removal 7693 0.028 227.37 KiB 0.004 1 764 ['Trace'] 0 Aggregation method: {} 7279 0.026 576.05 KiB 0.009 1 61 ['Debug'] 0 Read {} rows, {} in {} sec., {} rows/sec., {}/sec. 7256 0.026 323.77 KiB 0.005 1 1 ['Trace'] 1 Processing requests batch, size: {}, bytes: {} 6478 0.023 153.76 KiB 0.002 1 107 ['Trace'] 0 {} -> {} 6194 0.022 511.62 KiB 0.008 3 90 ['Debug'] 0.996 {} Authenticating user \'{}\' from {} 6039 0.022 678.21 KiB 0.011 3 90 ['Debug'] 0.996 {} Authenticated with global context as user {} 6012 0.022 528.40 KiB 0.008 3 90 ['Debug'] 0.996 {} Logout, user_id: {} 6005 0.022 656.80 KiB 0.01 2 68 ['Debug'] 1 {} Creating session context with user_id: {} 4229 0.015 402.89 KiB 0.006 1 68 ['Debug'] 1 Connected {} version {}.{}.{}, revision: {}{}{}. 4229 0.015 137.70 KiB 0.002 1 68 ['Trace'] 1 TCP Request. Address: {} 3986 0.014 105.10 KiB 0.002 1 68 ['Debug'] 1 Done processing connection. 3755 0.014 451.62 KiB 0.007 269 255 ['Trace'] 0.613 Renaming temporary part {} to {} with tid {}. 3731 0.014 258.71 KiB 0.004 266 371 ['Trace'] 0.794 Trying to reserve {} using storage policy from min volume index {} 3641 0.013 176.86 KiB 0.003 1 248 ['Trace'] 0.602 filled checksums {} 3215 0.012 34.54 KiB 0.001 1 742 ['Trace'] 0 Aggregating 3194 0.012 1.78 MiB 0.029 1 267 ['Debug'] 0.991 Objects with paths [{}] were removed from S3 3151 0.011 151.65 KiB 0.002 1 82 ['Debug'] 0.225 Peak memory usage{}: {}. 3112 0.011 296.24 KiB 0.005 1 32 ['Debug'] 0 Reading {} marks from part {}, total {} rows starting from the beginning of the part 3007 0.011 248.09 KiB 0.004 1 72 ['Trace'] 0 Reading {} ranges in order from part {}, approx. {} rows starting from {} 2858 0.01 3.92 MiB 0.063 1 252 ['Debug'] 0.993 metadata and objects were removed for [{}], only metadata were removed for [{}]. 2634 0.01 816.15 KiB 0.013 1617 615 ['Information'] 0.001 Setting download as failed: {} 2252 0.008 261.39 KiB 0.004 1 18 ['Debug'] 0 Reading {} marks from part {}, total {} rows starting from the beginning of the part, column {} 2192 0.008 126.11 KiB 0.002 13 13 ['Trace'] 1 Flushing system log, {} entries to flush up to offset {} 2192 0.008 78.25 KiB 0.001 13 13 ['Trace'] 1 Flushed system log up to offset {} 2058 0.007 382.69 KiB 0.006 2 61 ['Trace'] 1 HTTP Request for {}. Method: {}, Address: {}, User-Agent: {}{}, Content Type: {}, Transfer Encoding: {}, X-Forwarded-For: {} 2054 0.007 1.94 MiB 0.031 2 61 ['Trace'] 1 Request URI: {} 1915 0.007 155.98 KiB 0.002 1 670 ['Trace'] 0 An entry for key={} found in cache: sum_of_sizes={}, median_size={} 1889 0.007 153.86 KiB 0.002 1025 539 ['Trace'] 0 No space left in cache to reserve {} bytes, will continue without cache download 1833 0.007 37.59 KiB 0.001 2 60 ['Debug'] 0.059 Done processing query 1755 0.006 568.33 KiB 0.009 1 60 ['Trace'] 0 No entry found for query {} 1546 0.006 176.64 KiB 0.003 429 511 ['Trace'] 0 Bypassing cache because file segment state is `PARTIALLY_DOWNLOADED_NO_CONTINUATION` and downloaded part already used 1463 0.005 144.82 KiB 0.002 1 45 ['Trace'] 0 PREWHERE condition was split into {} steps: {} 1463 0.005 343.89 KiB 0.005 1 57 ['Trace'] 0 Entry found for query {} 1244 0.005 88.64 KiB 0.001 31 500 ['Trace'] 0 Running binary search on index range for part {} ({} marks) 1244 0.005 35.97 KiB 0.001 31 500 ['Trace'] 0 Found (LEFT) boundary mark: {} 1244 0.005 37.60 KiB 0.001 31 500 ['Trace'] 0 Found (RIGHT) boundary mark: {} 1244 0.005 36.75 KiB 0.001 31 500 ['Trace'] 0 Found {} range in {} steps 1208 0.004 93.20 KiB 0.001 1 59 ['Trace'] 0 Query span trace_id for opentelemetry log: {} 1130 0.004 142.25 KiB 0.002 16 35 ['Debug'] 0 Part: {}, sum_marks: {}, approx mark size: {}, prefetch_step_bytes: {}, prefetch_step_marks: {}, (ranges: {}) 1119 0.004 283.61 KiB 0.004 1 11 ['Information'] 0.337 WriteBufferFromS3 is not finalized in destructor. The file might not be written to S3. {}. 1115 0.004 103.40 KiB 0.002 1 376 ['Debug'] 0.019 Will evict {} file segments (while reserving {} bytes for {}:{}) 1114 0.004 31.17 KiB 0 211 77 ['Debug'] 0 Key condition: {} 1064 0.004 48.55 KiB 0.001 1 585 ['Debug'] 0 Aggregated. {} to {} rows (from {}) 1050 0.004 122.24 KiB 0.002 206 77 ['Debug'] 0 Selected {}/{} parts by partition key, {} parts by primary key, {}/{} marks by primary key, {} marks to read from {} ranges 1037 0.004 20.25 KiB 0 1 595 ['Trace'] 0 Aggregating in order 921 0.003 8.09 KiB 0 2 59 ['Trace'] 0.002 No tables 912 0.003 47.20 KiB 0.001 190 77 ['Trace'] 0 Spreading mark ranges among streams (default reading) 898 0.003 19.56 KiB 0 118 133 ['Trace'] 1 Execution took {} ms. 874 0.003 19.63 KiB 0 1 496 ['Trace'] 0 Merging aggregated data 806 0.003 44.95 KiB 0.001 1 290 ['Trace'] 0.134 Created HTTP(S) session with {}:{} ({}:{}) 799 0.003 44.34 KiB 0.001 58 144 ['Debug'] 0.964 Selected {} parts from {} to {} 758 0.003 23.94 KiB 0 16 22 ['Debug'] 0 Requested flush up to offset {} 727 0.003 69.98 KiB 0.001 18 126 ['Trace'] 1 Scheduling next cleanup after {}ms (points: {}, interval: {}ms, ratio: {}, points per minute: {}) 660 0.002 100.64 KiB 0.002 1 130 ['Debug'] 0.955 Recursively remove path {}: metadata and objects were removed for [{}], only metadata were removed for [{}]. 650 0.002 23.26 KiB 0 65 69 ['Debug'] 0 MinMax index condition: {} 633 0.002 21.63 KiB 0 1 32 ['Debug'] 0 Selected MergeAlgorithm: {} 633 0.002 53.57 KiB 0.001 1 32 ['Debug'] 0 Merging {} parts: from {} to {} into {} with storage {} 624 0.002 81.17 KiB 0.001 1 32 ['Debug'] 0 Merge sorted {} rows, containing {} columns ({} merged, {} gathered) in {} sec., {} rows/sec., {}/sec. 624 0.002 42.04 KiB 0.001 55 32 ['Trace'] 0 Merged {} parts: [{}, {}] -> {} 598 0.002 74.57 KiB 0.001 256 123 ['Debug'] 0.988 Removing {} parts from filesystem (serially): Parts: [{}] 564 0.002 71.41 KiB 0.001 1 127 ['Information'] 1 Have {} tables in drop queue ({} of them are in use), will try drop {} 564 0.002 111.61 KiB 0.002 1 127 ['Information'] 1 Removing metadata {} of dropped table {} 563 0.002 41.79 KiB 0.001 1 57 ['Debug'] 0 Waiting for table {} to be finally dropped 499 0.002 37.51 KiB 0.001 14 155 ['Trace'] 0 Used generic exclusion search over index for part {} with {} steps 492 0.002 39.58 KiB 0.001 1 360 ['Trace'] 0 Statistics updated for key={}: new sum_of_sizes={}, median_size={} 464 0.002 8.61 KiB 0 462 59 ['Information'] 0.009 Starting up tables. 464 0.002 37.96 KiB 0.001 462 59 ['Information'] 0.009 Metadata processed, database {} has {} tables and {} dictionaries in total. 462 0.002 27.05 KiB 0 1 59 ['Information'] 0.004 Parsed metadata of {} tables in {} databases in {} sec 459 0.002 24.11 KiB 0 4 58 ['Trace'] 0.943 List of all grants: {} 459 0.002 36.54 KiB 0.001 4 58 ['Trace'] 0.943 List of all grants including implicit: {} 459 0.002 35.41 KiB 0.001 4 58 ['Trace'] 0.943 Settings: readonly = {}, allow_ddl = {}, allow_introspection_functions = {} 457 0.002 31.71 KiB 0 1 138 ['Trace'] 0.884 Rolling back transaction {}{} 430 0.002 31.36 KiB 0 1 49 ['Trace'] 0 The min valid primary key position for moving to the tail of PREWHERE is {} 424 0.002 6.63 KiB 0 155 141 ['Debug'] 1 Scheduling tasks 414 0.001 91.54 KiB 0.001 155 141 ['Trace'] 1 scheduleTasks: initialized={}, size_before_filtering={}, queue_size={}, entries={}..{}, first_failed_task_name={}, current_tasks_size={}, last_current_task={}, last_skipped_entry_name={} 413 0.001 10.08 KiB 0 155 141 ['Debug'] 1 Waiting for queue updates 402 0.001 20.41 KiB 0 155 141 ['Debug'] 1 Will schedule {} tasks starting from {} 401 0.001 11.75 KiB 0 148 135 ['Trace'] 1 Checking task {} 397 0.001 38.70 KiB 0.001 148 135 ['Debug'] 1 Will not execute task {}: {} 384 0.001 35.33 KiB 0.001 1 292 ['Debug'] 0 Merge sorted {} blocks, {} rows in {} sec., {} rows/sec., {}/sec 373 0.001 144.73 KiB 0.002 1 18 ['Debug'] 0 Failed to reserve space in cache (size: {}, file segment info: {} 373 0.001 30.23 KiB 0 1 18 ['Information'] 0 Write-through cache is stopped as cache limit is reached and nothing can be evicted 372 0.001 83.27 KiB 0.001 1 26 ['Debug'] 0 Before join block: \'{}\' 370 0.001 37.42 KiB 0.001 261 236 ['Trace'] 0 Predownload failed because of space limit. Will read from remote filesystem starting from offset: {} 358 0.001 115.18 KiB 0.002 1 26 ['Debug'] 0 After join block: \'{}\' 357 0.001 45.52 KiB 0.001 21 20 ['Debug'] 0.98 Removing {} parts from memory: Parts: [{}] 357 0.001 45.17 KiB 0.001 21 20 ['Trace'] 0.98 Found {} old parts to remove. Parts: [{}] 356 0.001 31.36 KiB 0 1 67 ['Trace'] 0.579 Close WriteBufferFromS3. {}. 356 0.001 87.38 KiB 0.001 1 67 ['Trace'] 0.562 Create WriteBufferFromS3, {} 355 0.001 37.22 KiB 0.001 1 95 ['Trace'] 0.563 Single part upload has completed. {}, size {} 355 0.001 6.24 KiB 0 349 68 ['Debug'] 0.062 Loading data parts Top messages without format string (fmt::runtime): count pattern runtime_message line UInt64 String String Tuple(String, UInt64) 12 CodeDBExceptionReceivedfromDBExc Code: 158. DB::Exception: Received from 127.0.0.1:9000. DB::Exception: Limit for rows or bytes to read on leaf node exceeded, max rows: 1.00, current rows: 100.00: While executing Numbers. Stack trace:\n\n0. std::exception::capture() @ 0x000000001daf78f5 in ('/executeQuery.cpp',207) 9 PocoExceptionCodeecodeIOerrorBro Poco::Exception. Code: 1000, e.code() = 32, I/O error: Broken pipe, Stack trace (when copying this message, always include the lines below):\n\n0. std::exception::capture() @ 0x000000001daf78f5 in /usr/bin/clickhouse\n1. ./build_docker/./base/poco/Foundation/ ('/Exception.cpp',235) 4 CodeDBExceptionSyntaxerrorfailed Code: 62. DB::Exception: Syntax error: failed at position 1048577 (\'-\'): -. Max query size exceeded: \'-\'. (SYNTAX_ERROR) (version 23.8.16.43.altinitystable (altinity build)) (from [::ffff:127.0.0.1]:47016) (in query: select 1 in (1, 1, ... (truncated 94862 ('/executeQuery.cpp',207) 3 Connectiontomysqlfailedtimes Connection to mysql failed 1 times ('',0) 3 Connectiontomysqldbasusermysqlus Connection to mysql_db@127.123.0.1:3306 as user mysql_user failed: mysqlxx::ConnectionFailed: Can\'t connect to MySQL server on \'127.123.0.1\' (115) ((nullptr):0) ('',0) 3 CreatinganewMySQLconnectiontomys Creating a new MySQL connection to mysql_db@127.123.0.1:3306 as user mysql_user with settings: connect_timeout=10, read_write_timeout=300 ('',0) 3 Gatheringmetadata Gathering metadata (1) ('/BackupEntriesCollector.cpp',141) 3 mysqlxxConnectionFailed mysqlxx::ConnectionFailed ('',0) 3 Connectingtomysqldbasusermysqlus Connecting to mysql_db@127.123.0.1:3306 as user mysql_user ('',0) 3 CreatedMySQLPoolwithsettingsconn Created MySQL Pool with settings: connect_timeout=10, read_write_timeout=300, default_connections_number=1, max_connections_number=16 ('',0) 2 CodeDBErrnoExceptionCannotrename Code: 521. DB::ErrnoException: Cannot rename /var/lib/clickhouse/metadata/test.sql.tmp to /var/lib/clickhouse/metadata/test.sql because the second path already exists, errno: 17, strerror: File exists. (ATOMIC_RENAME_FAIL) (version 23.8.16.43.altinitystabl ('/executeQuery.cpp',207) 2 CodeDBExceptionCannotmodifyallow Code: 392. DB::Exception: Cannot modify \'allow_ddl\' setting when DDL queries are prohibited for the user. (QUERY_IS_PROHIBITED) (version 23.8.16.43.altinitystable (altinity build)) (from [::1]:48652) (comment: 00716_allow_ddl.sql) (in query: SET allow_ddl ('/executeQuery.cpp',207) 2 CodeDBExceptionReceivedfromlocal Code: 47. DB::Exception: Received from localhost:9000. DB::Exception: There\'s no column \'a._shard_num\' in table \'a\': While processing a._shard_num: While processing ALL INNER JOIN ... ON a._shard_num = b.shard_num. Stack trace:\n\n0. std::exception::captur ('/executeQuery.cpp',207) 2 CodeDBExceptionCouldnotlistobjec Code: 499. DB::Exception: Could not list objects in bucket \'datasets-documentation\' with prefix \'MyPrefix/BU - UNIT - 1/\', S3 exception: `InvalidAccessKeyId`, message: \'The AWS Access Key Id you provided does not exist in our records.\'. (S3_ERROR) (version ('/executeQuery.cpp',207) 1 configatindexiscommittedprevconf config at index 139 is committed, prev config log idx 25 ('/LoggerWrapper.h',42) 1 CodeDBExceptionExceptionUnsuppor Code: 1000. DB::Exception: Exception: Unsupported language for region name. Supported languages are: \'ru\', \'en\', \'ua\', \'uk\', \'by\', \'kz\', \'tr\', \'de\', \'uz\', \'lv\', \'lt\', \'et\', \'pt\', \'he\', \'vi\'. (POCO_EXCEPTION), Stack trace (when copying this message, always ('/TCPHandler.cpp',680) 1 PocoExceptionCodeecodeExceptionC Poco::Exception. Code: 1000, e.code() = 0, Exception: Connections to mysql failed: mysql_db@127.123.0.1:3306 as user mysql_user, ERROR 2002 : mysqlxx::ConnectionFailed: Can\'t connect to MySQL server on \'127.123.0.1\' (115) ((nullptr):0) (version 23.8.16.43. ('/executeQuery.cpp',207) 1 IfthesignaturecheckfailedThiscou If the signature check failed. This could be because of a time skew. Attempting to adjust the signer. ('/AWSLogger.cpp',71) 1 INITRAFTSERVERcommitindextermele === INIT RAFT SERVER ===\ncommit index 138\nterm 2\nelection timer allowed\nlog store start 1, end 138\nconfig log idx 25, prev log idx 1 ('/LoggerWrapper.h',42) 1 Forkedachildprocesstowatch Forked a child process to watch ('',0) 1 PocoExceptionCodeecodeExceptionU Poco::Exception. Code: 1000, e.code() = 0, Exception: Unsupported language for region name. Supported languages are: \'ru\', \'en\', \'ua\', \'uk\', \'by\', \'kz\', \'tr\', \'de\', \'uz\', \'lv\', \'lt\', \'et\', \'pt\', \'he\', \'vi\'. (version 23.8.16.43.altinitystable (altinity buil ('/executeQuery.cpp',207) 1 Thesettingallowremotefszerocopyr The setting \'allow_remote_fs_zero_copy_replication\' is enabled for MergeTree tables. But the feature of \'zero-copy replication\' is under development and is not ready for production. The usage of this feature can lead to data corruption and loss. The settin ('',0) 1 Thesettingmergetreemetadatacache The setting \'merge_tree_metadata_cache\' is enabled. But the feature of \'metadata cache in RocksDB\' is experimental and is not ready for production. The usage of this feature can lead to data corruption and loss. The setting should be disabled in production ('',0) 1 TablesystemsessionlogisenabledIt Table system.session_log is enabled. It\'s unreliable and may contain garbage. Do not use it for any kind of security monitoring. ('',0) 1 bgappendentriesthreadinitiated bg append_entries thread initiated ('/LoggerWrapper.h',42) 1 ThreadFuzzerisenabledApplication ThreadFuzzer is enabled. Application will run slowly and unstable. ('',0) 1 Electiontimeoutinitiateleaderele Election timeout, initiate leader election ('/LoggerWrapper.h',42) 1 PocoExceptionCodeecodeNetExcepti Poco::Exception. Code: 1000, e.code() = 107, Net Exception: Socket is not connected, Stack trace (when copying this message, always include the lines below):\n\n0. std::exception::capture() @ 0x000000001daf78f5 in /usr/bin/clickhouse\n1. ./build_docker/./base ('/Exception.cpp',235) 1 statemachinecommitindexprecommit state machine commit index 138, precommit index 138, last log index 138 ('/LoggerWrapper.h',42) 1 newconfigurationlogidxprevlogidx new configuration: log idx 139, prev log idx 25\npeer 1, DC ID 0, localhost:9234, voting member, 1\nmy id: 1, leader: 1, term: 3 ('/LoggerWrapper.h',42) Top messages that does not match its format string: message_format_string count() any_message LowCardinality(String) UInt64 String {} is in use (by merge/mutation/INSERT) (consider increasing temporary_directories_lifetime setting) 152 /var/lib/clickhouse/disks/s3/store/c27/c2761ae4-9b92-4527-bcb5-20731c13957e/tmp_merge_202610_1_61_12/ is in use (by merge/mutation/INSERT) (consider increasing temporary_directories_lifetime setting) (skipped 1 similar messages) 67 Poco::Exception. Code: 1000, e.code() = 32, I/O error: Broken pipe, Stack trace (when copying this message, always include the lines below):\n\n0. std::exception::capture() @ 0x000000001daf78f5 in /usr/bin/clickhouse\n1. ./build_docker/./base/poco/Foundation/src/Exception.cpp:28: Poco::Exception::Exception(String const&, int) @ 0x000000003bbd7b25 in /usr/bin/clickhouse\n2. ./build_docker/./base/poco/Foundation/src/Exception.cpp:164: Poco::IOException::IOException(String const&, int) @ 0x000000003bbe4cdb in /usr/bin/clickhouse\n3. ./build_docker/./base/poco/Net/src/SocketImpl.cpp:0: Poco::Net::SocketImpl::error(int, String const&) @ 0x000000003b9d3d13 in /usr/bin/clickhouse\n4. ./build_docker/./contrib/llvm-project/libcxx/include/string:1499: Poco::Net::SocketImpl::sendBytes(void const*, int, int) @ 0x000000003b9d640a in /usr/bin/clickhouse\n5. ./build_docker/./base/poco/Net/src/StreamSocketImpl.cpp:65: Poco::Net::StreamSocketImpl::sendBytes(void const*, int, int) @ 0x000000003b9e3f2a in /usr/bin/clickhouse\n6. ./build_docker/./base/poco/Net/src/HTTPSession.cpp:144: Poco::Net::HTTPSession::write(char const*, long) @ 0x000000003b99dcc3 in /usr/bin/clickhouse\n7. ./build_docker/./base/poco/Net/src/HTTPChunkedStream.cpp:0: Poco::Net::HTTPChunkedStreamBuf::writeToDevice(char const*, long) @ 0x000000003b974d01 in /usr/bin/clickhouse\n8. ./build_docker/./base/poco/Foundation/include/Poco/BufferedStreamBuf.h:130: Poco::BasicBufferedStreamBuf, Poco::BufferAllocator>::flushBuffer() @ 0x000000003b918d69 in /usr/bin/clickhouse\n9. ./build_docker/./base/poco/Foundation/include/Poco/BufferedStreamBuf.h:111: Poco::BasicBufferedStreamBuf, Poco::BufferAllocator>::sync() @ 0x000000003b917821 in /usr/bin/clickhouse\n10. ./build_docker/./base/poco/Net/src/HTTPChunkedStream.cpp:55: Poco::Net::HTTPChunkedStreamBuf::close() @ 0x000000003b9737d0 in /usr/bin/clickhouse\n11. ./build_docker/./base/poco/Net/src/HTTPChunkedStream.cpp:171: Poco::Net::HTTPChunkedIOS::~HTTPChunkedIOS() @ 0x000000003b975277 in /usr/bin/clickhouse\n12. ./build_docker/./base/poco/Net/src/HTTPChunkedStream.cpp:207: Poco::Net::HTTPChunkedOutputStream::~HTTPChunkedOutputStream() @ 0x000000003b97616b in /usr/bin/clickhouse\n13. std::__shared_count::__release_shared[abi:v15000]() @ 0x000000001dae31c0 in /usr/bin/clickhouse\n14. std::__shared_weak_count::__release_shared[abi:v15000]() @ 0x000000001dae30cf in /usr/bin/clickhouse\n15. ./build_docker/./src/Server/HTTP/HTTPServerResponse.h:16: DB::HTTPServerResponse::~HTTPServerResponse() @ 0x0000000039b5f67d in /usr/bin/clickhouse\n16. ./build_docker/./contrib/llvm-project/libcxx/include/atomic:958: DB::HTTPServerConnection::run() @ 0x0000000039b5e0d4 in /usr/bin/clickhouse\n17. ./build_docker/./base/poco/Net/src/TCPServerConnection.cpp:57: Poco::Net::TCPServerConnection::start() @ 0x000000003b9e705e in /usr/bin/clickhouse\n18. ./build_docker/./contrib/llvm-project/libcxx/include/__memory/unique_ptr.h:302: Poco::Net::TCPServerDispatcher::run() @ 0x000000003b9e819a in /usr/bin/clickhouse\n19. ./build_docker/./base/poco/Foundation/src/ThreadPool.cpp:202: Poco::PooledThread::run() @ 0x000000003bc85890 in /usr/bin/clickhouse\n20. ./build_docker/./base/poco/Foundation/include/Poco/AutoPtr.h:205: Poco::ThreadImpl::runnableEntry(void*) @ 0x000000003bc809b1 in /usr/bin/clickhouse\n21. ? @ 0x00007fa181bf4a83 in ?\n22. ? @ 0x00007fa181c868e0 in ?\n (version 23.8.16.43.altinitystable (altinity build)) Top short messages: c message_format_string substring(any(message), 1, 120) min_length_without_exception_boilerplate UInt64 LowCardinality(String) String Int64 72 Resetting nice Resetting nice -12 9 Session expired void DB::StorageReplicatedMergeTree::mutationsUpdatingTask(): Code: 999. Coordination::Exception: Session expired. (KEEP 27 3 Froze {} parts Froze 10 parts -13 3 Found {} on {} Found snapshot_24.bin.zstd on LocalSnapshotDisk 21 1 {} building file infos -7 1 Creating {}: {} Creating table test_m4xdlc9b.data_native_copy: CREATE TABLE IF NOT EXISTS test_m4xdlc9b.data_native_copy (`key` Int32) E 671 Top messages by level: (0.029345290700201383,'Table is in readonly mode (replica path: {})') Error (0.00003984179186647929,'Client has gone away.') Warning (0.009540298161482405,'Setting download as failed: {}') Information (0.04390565463686018,'(from {}{}{}){}{} {} (stage: {})') Debug (0.050349158975993506,'Access granted: {}{}') Trace 2026-10-28 15:43:49,798 Stress test finished + echo -e 'Test script exit code\tOK\t\N\t' + rg -Fa 'No queries hung' /test_output/test_results.tsv + grep -Fa OK No queries hung OK \N + stop + local max_tries=90 + local check_hang=true + local pid ++ cat /var/run/clickhouse-server/clickhouse-server.pid + pid=1695 + clickhouse stop --max-tries 90 --do-not-kill /var/run/clickhouse-server/clickhouse-server.pid file exists and contains pid = 1695. The process with pid = 1695 is running. Sent terminate signal to process with pid 1695. Waiting for server to stop /var/run/clickhouse-server/clickhouse-server.pid file exists and contains pid = 1695. The process with pid = 1695 is running. Waiting for server to stop /var/run/clickhouse-server/clickhouse-server.pid file exists and contains pid = 1695. The process with pid = 1695 is running. Waiting for server to stop /var/run/clickhouse-server/clickhouse-server.pid file exists and contains pid = 1695. The process with pid = 1695 is running. Waiting for server to stop /var/run/clickhouse-server/clickhouse-server.pid file exists and contains pid = 1695. The process with pid = 1695 is running. Waiting for server to stop /var/run/clickhouse-server/clickhouse-server.pid file exists and contains pid = 1695. The process with pid = 1695 is running. Waiting for server to stop /var/run/clickhouse-server/clickhouse-server.pid file exists and contains pid = 1695. The process with pid = 1695 is running. Waiting for server to stop /var/run/clickhouse-server/clickhouse-server.pid file exists and contains pid = 1695. The process with pid = 1695 is running. Waiting for server to stop /var/run/clickhouse-server/clickhouse-server.pid file exists and contains pid = 1695. The process with pid = 1695 is running. Waiting for server to stop /var/run/clickhouse-server/clickhouse-server.pid file exists and contains pid = 1695. The process with pid = 1695 is running. Waiting for server to stop /var/run/clickhouse-server/clickhouse-server.pid file exists and contains pid = 1695. The process with pid = 1695 does not exist. Server stopped + return + mv /var/log/clickhouse-server/clickhouse-server.log /var/log/clickhouse-server/clickhouse-server.stress.log + unset THREAD_FUZZER_CPU_TIME_PERIOD_US THREAD_FUZZER_EXPLICIT_MEMORY_EXCEPTION_PROBABILITY THREAD_FUZZER_EXPLICIT_SLEEP_PROBABILITY THREAD_FUZZER_SLEEP_PROBABILITY THREAD_FUZZER_SLEEP_TIME_US THREAD_FUZZER_pthread_mutex_lock_AFTER_MIGRATE_PROBABILITY THREAD_FUZZER_pthread_mutex_lock_AFTER_SLEEP_PROBABILITY THREAD_FUZZER_pthread_mutex_lock_AFTER_SLEEP_TIME_US THREAD_FUZZER_pthread_mutex_lock_BEFORE_MIGRATE_PROBABILITY THREAD_FUZZER_pthread_mutex_lock_BEFORE_SLEEP_PROBABILITY THREAD_FUZZER_pthread_mutex_lock_BEFORE_SLEEP_TIME_US THREAD_FUZZER_pthread_mutex_unlock_AFTER_MIGRATE_PROBABILITY THREAD_FUZZER_pthread_mutex_unlock_AFTER_SLEEP_PROBABILITY THREAD_FUZZER_pthread_mutex_unlock_AFTER_SLEEP_TIME_US THREAD_FUZZER_pthread_mutex_unlock_BEFORE_MIGRATE_PROBABILITY THREAD_FUZZER_pthread_mutex_unlock_BEFORE_SLEEP_PROBABILITY THREAD_FUZZER_pthread_mutex_unlock_BEFORE_SLEEP_TIME_US + start + counter=0 + clickhouse-client --query 'SELECT 1' Code: 210. DB::NetException: Connection refused (localhost:9000). (NETWORK_ERROR) + '[' 0 -gt 120 ']' + clickhouse start --user root + sleep 0.5 + counter=1 + clickhouse-client --query 'SELECT 1' Code: 210. DB::NetException: Connection refused (localhost:9000). (NETWORK_ERROR) + '[' 1 -gt 120 ']' + clickhouse start --user root + sleep 0.5 127.0.0.1 - - [28/Oct/2026:14:44:00 +0000] "PUT /devstoreaccount1/cont?restype=container HTTP/1.1" 409 - 127.0.0.1 - - [28/Oct/2026:14:44:00 +0000] "PUT /devstoreaccount1/cont/jmwlzyktjymhnysfvhfiwmdymsduldzh?blockid=vdacyifrkbttrecpkkszubtlzumsyiracqatyvnnrixwuulkpavuxxpympddbjrm&comp=block HTTP/1.1" 201 - 127.0.0.1 - - [28/Oct/2026:14:44:00 +0000] "PUT /devstoreaccount1/cont/jmwlzyktjymhnysfvhfiwmdymsduldzh?comp=blocklist HTTP/1.1" 201 - 127.0.0.1 - - [28/Oct/2026:14:44:00 +0000] "GET /devstoreaccount1/cont/jmwlzyktjymhnysfvhfiwmdymsduldzh HTTP/1.1" 206 4 127.0.0.1 - - [28/Oct/2026:14:44:00 +0000] "GET /devstoreaccount1/cont/jmwlzyktjymhnysfvhfiwmdymsduldzh HTTP/1.1" 206 2 127.0.0.1 - - [28/Oct/2026:14:44:00 +0000] "DELETE /devstoreaccount1/cont/jmwlzyktjymhnysfvhfiwmdymsduldzh HTTP/1.1" 202 - + counter=2 + clickhouse-client --query 'SELECT 1' Code: 210. DB::NetException: Connection refused (localhost:9000). (NETWORK_ERROR) + '[' 2 -gt 120 ']' + clickhouse start --user root + sleep 0.5 + counter=3 + clickhouse-client --query 'SELECT 1' 1 + attach_gdb_to_clickhouse ++ kill -l SIGRTMIN + RTMIN=34 + echo ' set follow-fork-mode parent handle SIGHUP nostop noprint pass handle SIGINT nostop noprint pass handle SIGQUIT nostop noprint pass handle SIGPIPE nostop noprint pass handle SIGTERM nostop noprint pass handle SIGUSR1 nostop noprint pass handle SIGUSR2 nostop noprint pass handle SIG34 nostop noprint pass info signals continue backtrace full thread apply all backtrace full info registers disassemble /s up disassemble /s up disassemble /s p "done" detach quit ' + sleep 5 + ts '%Y-%m-%d %H:%M:%S' ++ cat /var/run/clickhouse-server/clickhouse-server.pid + gdb -batch -command script.gdb -p 25745 + run_with_retry 60 clickhouse-client --query 'SELECT '\''Connected to clickhouse-server after attaching gdb'\''' + [[ hxB =~ e ]] + set_e=false + set +e + local total_retries=60 + shift + local retry=0 + '[' 0 -ge 60 ']' + clickhouse-client --query 'SELECT '\''Connected to clickhouse-server after attaching gdb'\''' Connected to clickhouse-server after attaching gdb + false + return + check_server_start + clickhouse-client --query 'SELECT '\''Server successfully started'\'', '\''OK'\'', NULL, '\'''\''' + '[' -s /test_output/application_errors.txt ']' + rm /test_output/application_errors.txt rm: cannot remove '/test_output/application_errors.txt': No such file or directory + stop + local max_tries=90 + local check_hang=true + local pid ++ cat /var/run/clickhouse-server/clickhouse-server.pid + pid=25745 + clickhouse stop --max-tries 90 --do-not-kill script.gdb:13: Error in sourced command file: No stack. /var/run/clickhouse-server/clickhouse-server.pid file exists and contains pid = 25745. The process with pid = 25745 is running. Sent terminate signal to process with pid 25745. Waiting for server to stop /var/run/clickhouse-server/clickhouse-server.pid file exists and contains pid = 25745. The process with pid = 25745 is running. Waiting for server to stop /var/run/clickhouse-server/clickhouse-server.pid file exists and contains pid = 25745. The process with pid = 25745 is running. Waiting for server to stop /var/run/clickhouse-server/clickhouse-server.pid file exists and contains pid = 25745. The process with pid = 25745 is running. Waiting for server to stop /var/run/clickhouse-server/clickhouse-server.pid file exists and contains pid = 25745. The process with pid = 25745 is running. Waiting for server to stop Now there is no clickhouse-server process. Server stopped + return + '[' -f /var/log/clickhouse-server/clickhouse-server.log ']' + '[' -f /var/log/clickhouse-server/stderr.log ']' + mv /var/log/clickhouse-server/clickhouse-server.log /var/log/clickhouse-server/clickhouse-server.final.log + check_logs_for_critical_errors + rg -v 'in query:' + rg -Fa ================== /var/log/clickhouse-server/stderr.log + rg -Fa WARNING /var/log/clickhouse-server/stderr.log + rg -Fav -e 'ASan doesn'\''t fully support makecontext/swapcontext functions' -e DB::Exception /test_output/tmp + echo -e 'No sanitizer asserts\tOK\t\N\t' + rm -f /test_output/tmp + rg -Fa ' Application: Child process was terminated by signal 9' /var/log/clickhouse-server/clickhouse-server.err.log /var/log/clickhouse-server/clickhouse-server.final.log /var/log/clickhouse-server/clickhouse-server.initial.log /var/log/clickhouse-server/clickhouse-server.stress.log + echo -e 'No OOM messages in clickhouse-server.log\tOK\t\N\t' + rg -Fa 'Code: 49. DB::Exception: ' /var/log/clickhouse-server/clickhouse-server.err.log /var/log/clickhouse-server/clickhouse-server.final.log /var/log/clickhouse-server/clickhouse-server.initial.log /var/log/clickhouse-server/clickhouse-server.stress.log + echo -e 'No logical errors\tOK\t\N\t' + '[' -s /test_output/logical_errors.txt ']' + rm /test_output/logical_errors.txt + rg --text 'Code: 499.*The specified key does not exist' /var/log/clickhouse-server/clickhouse-server.err.log /var/log/clickhouse-server/clickhouse-server.final.log /var/log/clickhouse-server/clickhouse-server.initial.log /var/log/clickhouse-server/clickhouse-server.stress.log + echo -e 'No lost s3 keys\tOK\t\N\t' + '[' -s /test_output/no_such_key_errors.txt ']' + rm /test_output/no_such_key_errors.txt + rg -Fa '########################################' /var/log/clickhouse-server/clickhouse-server.err.log /var/log/clickhouse-server/clickhouse-server.final.log /var/log/clickhouse-server/clickhouse-server.initial.log /var/log/clickhouse-server/clickhouse-server.stress.log + echo -e 'Not crashed\tOK\t\N\t' + rg -Fa ' ' /var/log/clickhouse-server/clickhouse-server.err.log /var/log/clickhouse-server/clickhouse-server.final.log /var/log/clickhouse-server/clickhouse-server.initial.log /var/log/clickhouse-server/clickhouse-server.stress.log + echo -e 'No fatal messages in clickhouse-server.log\tOK\t\N\t' + '[' -s /test_output/fatal_messages.txt ']' + rm /test_output/fatal_messages.txt + rg -Faz '########################################' /test_output/gdb.log /test_output/stress_run_logs.tar.zst /test_output/test_results.tsv + rg -Fa ' received signal ' /test_output/gdb.log + dmesg -T + grep -q -F -e 'Out of memory: Killed process' -e 'oom_reaper: reaped process' -e oom-kill:constraint=CONSTRAINT_NONE /test_output/dmesg.log + echo -e 'No OOM in dmesg\tOK\t\N\t' + tar -chf /test_output/coordination.tar /var/lib/clickhouse/coordination tar: Removing leading `/' from member names tar: Removing leading `/' from hard link targets + collect_query_and_trace_logs + for table in query_log trace_log + clickhouse-local --path /var/lib/clickhouse/ --only-system-tables -q 'select * from system.query_log format TSVWithNamesAndTypes' + zstd --threads=0 + for table in query_log trace_log + clickhouse-local --path /var/lib/clickhouse/ --only-system-tables -q 'select * from system.trace_log format TSVWithNamesAndTypes' + zstd --threads=0 + mv /var/log/clickhouse-server/stderr.log /test_output/ + clickhouse-local --structure 'test String, res String, time Nullable(Float32), desc String' -q 'SELECT '\''failure'\'', test FROM table WHERE res != '\''OK'\'' order by (test like '\''%Sanitizer%'\'') DESC, (test like '\''%Killed by signal%'\'') DESC, (test like '\''%gdb.log%'\'') DESC, (test ilike '\''%possible deadlock%'\'') DESC, (test like '\''%start%'\'') DESC, (test like '\''%dmesg%'\'') DESC, (test like '\''%OOM%'\'') DESC, (test like '\''%Signal 9%'\'') DESC, (test like '\''%Fatal message%'\'') DESC, rowNumberInAllBlocks() LIMIT 1' + '[' -s /test_output/check_status.tsv ']' + echo -e 'success\tNo errors found' + rg 'OOM in dmesg|Signal 9' /test_output/check_status.tsv + collect_core_dumps + find . -type f -maxdepth 1 -name 'core.*' + read core