+ ln -s /usr/share/clickhouse-test/ci/stress.py /usr/bin/stress
+ ln -s /usr/share/clickhouse-test/clickhouse-test /usr/bin/clickhouse-test
+ source /usr/share/clickhouse-test/ci/attach_gdb.lib
++ source /usr/share/clickhouse-test/ci/utils.lib
+ source /usr/share/clickhouse-test/ci/stress_tests.lib
++ sysctl kernel.core_pattern=core.%e.%p-%P
kernel.core_pattern = core.%e.%p-%P
++ OK='\tOK\t\N\t'
++ FAIL='\tFAIL\t\N\t'
++ FAILURE_CONTEXT_LINES=100
++ FAILURE_CONTEXT_MAX_LINE_WIDTH=300
+ install_packages package_folder
+ dpkg -i package_folder/clickhouse-common-static_23.8.16.43.altinitystable_amd64.deb
Selecting previously unselected package clickhouse-common-static.
(Reading database ... 58864 files and directories currently installed.)
Preparing to unpack .../clickhouse-common-static_23.8.16.43.altinitystable_amd64.deb ...
Unpacking clickhouse-common-static (23.8.16.43.altinitystable) ...
Setting up clickhouse-common-static (23.8.16.43.altinitystable) ...
+ dpkg -i package_folder/clickhouse-common-static-dbg_23.8.16.43.altinitystable_amd64.deb
Selecting previously unselected package clickhouse-common-static-dbg.
(Reading database ... 58878 files and directories currently installed.)
Preparing to unpack .../clickhouse-common-static-dbg_23.8.16.43.altinitystable_amd64.deb ...
Unpacking clickhouse-common-static-dbg (23.8.16.43.altinitystable) ...
Setting up clickhouse-common-static-dbg (23.8.16.43.altinitystable) ...
+ dpkg -i package_folder/clickhouse-server_23.8.16.43.altinitystable_amd64.deb
Selecting previously unselected package clickhouse-server.
(Reading database ... 58887 files and directories currently installed.)
Preparing to unpack .../clickhouse-server_23.8.16.43.altinitystable_amd64.deb ...
Unpacking clickhouse-server (23.8.16.43.altinitystable) ...
Setting up clickhouse-server (23.8.16.43.altinitystable) ...
ClickHouse binary is already located at /usr/bin/clickhouse
Symlink /usr/bin/clickhouse-server already exists but it points to /clickhouse. Will replace the old symlink to /usr/bin/clickhouse.
Creating symlink /usr/bin/clickhouse-server to /usr/bin/clickhouse.
Creating symlink /usr/bin/clickhouse-client to /usr/bin/clickhouse.
Creating symlink /usr/bin/clickhouse-local to /usr/bin/clickhouse.
Creating symlink /usr/bin/clickhouse-benchmark to /usr/bin/clickhouse.
Symlink /usr/bin/clickhouse-copier already exists but it points to /clickhouse. Will replace the old symlink to /usr/bin/clickhouse.
Creating symlink /usr/bin/clickhouse-copier to /usr/bin/clickhouse.
Creating symlink /usr/bin/clickhouse-obfuscator to /usr/bin/clickhouse.
Creating symlink /usr/bin/clickhouse-git-import to /usr/bin/clickhouse.
Creating symlink /usr/bin/clickhouse-compressor to /usr/bin/clickhouse.
Creating symlink /usr/bin/clickhouse-format to /usr/bin/clickhouse.
Symlink /usr/bin/clickhouse-extract-from-config already exists but it points to /clickhouse. Will replace the old symlink to /usr/bin/clickhouse.
Creating symlink /usr/bin/clickhouse-extract-from-config to /usr/bin/clickhouse.
Symlink /usr/bin/clickhouse-keeper already exists but it points to /clickhouse. Will replace the old symlink to /usr/bin/clickhouse.
Creating symlink /usr/bin/clickhouse-keeper to /usr/bin/clickhouse.
Symlink /usr/bin/clickhouse-keeper-converter already exists but it points to /clickhouse. Will replace the old symlink to /usr/bin/clickhouse.
Creating symlink /usr/bin/clickhouse-keeper-converter to /usr/bin/clickhouse.
Creating symlink /usr/bin/clickhouse-disks to /usr/bin/clickhouse.
Creating clickhouse group if it does not exist.
groupadd -r clickhouse
Creating clickhouse user if it does not exist.
useradd -r --shell /bin/false --home-dir /nonexistent -g clickhouse clickhouse
Will set ulimits for clickhouse user in /etc/security/limits.d/clickhouse.conf.
Creating config directory /etc/clickhouse-server/config.d that is used for tweaks of main server configuration.
Creating config directory /etc/clickhouse-server/users.d that is used for tweaks of users configuration.
Config file /etc/clickhouse-server/config.xml already exists, will keep it and extract path info from it.
/etc/clickhouse-server/config.xml has /var/lib/clickhouse/ as data path.
/etc/clickhouse-server/config.xml has /var/log/clickhouse-server/ as log path.
Users config file /etc/clickhouse-server/users.xml already exists, will keep it and extract users info from it.
Log directory /var/log/clickhouse-server/ already exists.
Creating data directory /var/lib/clickhouse/.
Creating pid directory /var/run/clickhouse-server.
chown -R clickhouse:clickhouse '/var/log/clickhouse-server/'
chown -R clickhouse:clickhouse '/var/run/clickhouse-server'
chown clickhouse:clickhouse '/var/lib/clickhouse/'
groupadd -r clickhouse-bridge
useradd -r --shell /bin/false --home-dir /nonexistent -g clickhouse-bridge clickhouse-bridge
chown -R clickhouse-bridge:clickhouse-bridge '/usr/bin/clickhouse-odbc-bridge'
chown -R clickhouse-bridge:clickhouse-bridge '/usr/bin/clickhouse-library-bridge'
[1mPassword for default user is empty string. See /etc/clickhouse-server/users.xml and /etc/clickhouse-server/users.d to change it.[0m
Setting capabilities for clickhouse binary. This is optional.
chown -R clickhouse:clickhouse '/etc/clickhouse-server'
ClickHouse has been successfully installed.
Start clickhouse-server with:
sudo clickhouse start
Start clickhouse-client with:
clickhouse-client
+ dpkg -i package_folder/clickhouse-client_23.8.16.43.altinitystable_amd64.deb
Selecting previously unselected package clickhouse-client.
(Reading database ... 58906 files and directories currently installed.)
Preparing to unpack .../clickhouse-client_23.8.16.43.altinitystable_amd64.deb ...
Unpacking clickhouse-client (23.8.16.43.altinitystable) ...
Setting up clickhouse-client (23.8.16.43.altinitystable) ...
+ export THREAD_FUZZER_CPU_TIME_PERIOD_US=1000
+ THREAD_FUZZER_CPU_TIME_PERIOD_US=1000
+ export THREAD_FUZZER_SLEEP_PROBABILITY=0.1
+ THREAD_FUZZER_SLEEP_PROBABILITY=0.1
+ export THREAD_FUZZER_SLEEP_TIME_US=100000
+ THREAD_FUZZER_SLEEP_TIME_US=100000
+ export THREAD_FUZZER_pthread_mutex_lock_BEFORE_MIGRATE_PROBABILITY=1
+ THREAD_FUZZER_pthread_mutex_lock_BEFORE_MIGRATE_PROBABILITY=1
+ export THREAD_FUZZER_pthread_mutex_lock_AFTER_MIGRATE_PROBABILITY=1
+ THREAD_FUZZER_pthread_mutex_lock_AFTER_MIGRATE_PROBABILITY=1
+ export THREAD_FUZZER_pthread_mutex_unlock_BEFORE_MIGRATE_PROBABILITY=1
+ THREAD_FUZZER_pthread_mutex_unlock_BEFORE_MIGRATE_PROBABILITY=1
+ export THREAD_FUZZER_pthread_mutex_unlock_AFTER_MIGRATE_PROBABILITY=1
+ THREAD_FUZZER_pthread_mutex_unlock_AFTER_MIGRATE_PROBABILITY=1
+ export THREAD_FUZZER_pthread_mutex_lock_BEFORE_SLEEP_PROBABILITY=0.001
+ THREAD_FUZZER_pthread_mutex_lock_BEFORE_SLEEP_PROBABILITY=0.001
+ export THREAD_FUZZER_pthread_mutex_lock_AFTER_SLEEP_PROBABILITY=0.001
+ THREAD_FUZZER_pthread_mutex_lock_AFTER_SLEEP_PROBABILITY=0.001
+ export THREAD_FUZZER_pthread_mutex_unlock_BEFORE_SLEEP_PROBABILITY=0.001
+ THREAD_FUZZER_pthread_mutex_unlock_BEFORE_SLEEP_PROBABILITY=0.001
+ export THREAD_FUZZER_pthread_mutex_unlock_AFTER_SLEEP_PROBABILITY=0.001
+ THREAD_FUZZER_pthread_mutex_unlock_AFTER_SLEEP_PROBABILITY=0.001
+ export THREAD_FUZZER_pthread_mutex_lock_BEFORE_SLEEP_TIME_US=10000
+ THREAD_FUZZER_pthread_mutex_lock_BEFORE_SLEEP_TIME_US=10000
+ export THREAD_FUZZER_pthread_mutex_lock_AFTER_SLEEP_TIME_US=10000
+ THREAD_FUZZER_pthread_mutex_lock_AFTER_SLEEP_TIME_US=10000
+ export THREAD_FUZZER_pthread_mutex_unlock_BEFORE_SLEEP_TIME_US=10000
+ THREAD_FUZZER_pthread_mutex_unlock_BEFORE_SLEEP_TIME_US=10000
+ export THREAD_FUZZER_pthread_mutex_unlock_AFTER_SLEEP_TIME_US=10000
+ THREAD_FUZZER_pthread_mutex_unlock_AFTER_SLEEP_TIME_US=10000
+ export THREAD_FUZZER_EXPLICIT_SLEEP_PROBABILITY=0.01
+ THREAD_FUZZER_EXPLICIT_SLEEP_PROBABILITY=0.01
+ export THREAD_FUZZER_EXPLICIT_MEMORY_EXCEPTION_PROBABILITY=0.01
+ THREAD_FUZZER_EXPLICIT_MEMORY_EXCEPTION_PROBABILITY=0.01
+ export ZOOKEEPER_FAULT_INJECTION=1
+ ZOOKEEPER_FAULT_INJECTION=1
+ configure
+ export USE_DATABASE_ORDINARY=1
+ USE_DATABASE_ORDINARY=1
+ export EXPORT_S3_STORAGE_POLICIES=1
+ EXPORT_S3_STORAGE_POLICIES=1
+ /usr/share/clickhouse-test/config/install.sh
+ DEST_SERVER_PATH=/etc/clickhouse-server
+ DEST_CLIENT_PATH=/etc/clickhouse-client
+++ dirname /usr/share/clickhouse-test/config/install.sh
++ cd /usr/share/clickhouse-test/config
++ pwd -P
+ SRC_PATH=/usr/share/clickhouse-test/config
+ echo 'Going to install test configs from /usr/share/clickhouse-test/config into /etc/clickhouse-server'
+ mkdir -p /etc/clickhouse-server/config.d/
Going to install test configs from /usr/share/clickhouse-test/config into /etc/clickhouse-server
+ mkdir -p /etc/clickhouse-server/users.d/
+ mkdir -p /etc/clickhouse-client
+ ln -sf /usr/share/clickhouse-test/config/config.d/zookeeper_write.xml /etc/clickhouse-server/config.d/
+ ln -sf /usr/share/clickhouse-test/config/config.d/listen.xml /etc/clickhouse-server/config.d/
+ ln -sf /usr/share/clickhouse-test/config/config.d/text_log.xml /etc/clickhouse-server/config.d/
+ ln -sf /usr/share/clickhouse-test/config/config.d/custom_settings_prefixes.xml /etc/clickhouse-server/config.d/
+ ln -sf /usr/share/clickhouse-test/config/config.d/enable_access_control_improvements.xml /etc/clickhouse-server/config.d/
+ ln -sf /usr/share/clickhouse-test/config/config.d/macros.xml /etc/clickhouse-server/config.d/
+ ln -sf /usr/share/clickhouse-test/config/config.d/disks.xml /etc/clickhouse-server/config.d/
+ ln -sf /usr/share/clickhouse-test/config/config.d/secure_ports.xml /etc/clickhouse-server/config.d/
+ ln -sf /usr/share/clickhouse-test/config/config.d/clusters.xml /etc/clickhouse-server/config.d/
+ ln -sf /usr/share/clickhouse-test/config/config.d/graphite.xml /etc/clickhouse-server/config.d/
+ ln -sf /usr/share/clickhouse-test/config/config.d/database_atomic.xml /etc/clickhouse-server/config.d/
+ ln -sf /usr/share/clickhouse-test/config/config.d/max_concurrent_queries.xml /etc/clickhouse-server/config.d/
+ ln -sf /usr/share/clickhouse-test/config/config.d/merge_tree_settings.xml /etc/clickhouse-server/config.d/
+ ln -sf /usr/share/clickhouse-test/config/config.d/merge_tree_old_dirs_cleanup.xml /etc/clickhouse-server/config.d/
+ ln -sf /usr/share/clickhouse-test/config/config.d/test_cluster_with_incorrect_pw.xml /etc/clickhouse-server/config.d/
+ ln -sf /usr/share/clickhouse-test/config/config.d/keeper_port.xml /etc/clickhouse-server/config.d/
+ ln -sf /usr/share/clickhouse-test/config/config.d/logging_no_rotate.xml /etc/clickhouse-server/config.d/
+ ln -sf /usr/share/clickhouse-test/config/config.d/merge_tree.xml /etc/clickhouse-server/config.d/
+ ln -sf /usr/share/clickhouse-test/config/config.d/lost_forever_check.xml /etc/clickhouse-server/config.d/
+ ln -sf /usr/share/clickhouse-test/config/config.d/metadata_cache.xml /etc/clickhouse-server/config.d/
+ ln -sf /usr/share/clickhouse-test/config/config.d/tcp_with_proxy.xml /etc/clickhouse-server/config.d/
+ ln -sf /usr/share/clickhouse-test/config/config.d/prometheus.xml /etc/clickhouse-server/config.d/
+ ln -sf /usr/share/clickhouse-test/config/config.d/top_level_domains_lists.xml /etc/clickhouse-server/config.d/
+ ln -sf /usr/share/clickhouse-test/config/config.d/top_level_domains_path.xml /etc/clickhouse-server/config.d/
+ ln -sf /usr/share/clickhouse-test/config/config.d/transactions.xml /etc/clickhouse-server/config.d/
+ ln -sf /usr/share/clickhouse-test/config/config.d/encryption.xml /etc/clickhouse-server/config.d/
+ ln -sf /usr/share/clickhouse-test/config/config.d/CORS.xml /etc/clickhouse-server/config.d/
+ ln -sf /usr/share/clickhouse-test/config/config.d/zookeeper_log.xml /etc/clickhouse-server/config.d/
+ ln -sf /usr/share/clickhouse-test/config/config.d/logger_trace.xml /etc/clickhouse-server/config.d/
+ ln -sf /usr/share/clickhouse-test/config/config.d/named_collection.xml /etc/clickhouse-server/config.d/
+ ln -sf /usr/share/clickhouse-test/config/config.d/ssl_certs.xml /etc/clickhouse-server/config.d/
+ ln -sf /usr/share/clickhouse-test/config/config.d/filesystem_cache_log.xml /etc/clickhouse-server/config.d/
+ ln -sf /usr/share/clickhouse-test/config/config.d/session_log.xml /etc/clickhouse-server/config.d/
+ ln -sf /usr/share/clickhouse-test/config/config.d/system_unfreeze.xml /etc/clickhouse-server/config.d/
+ ln -sf /usr/share/clickhouse-test/config/config.d/enable_zero_copy_replication.xml /etc/clickhouse-server/config.d/
+ ln -sf /usr/share/clickhouse-test/config/config.d/nlp.xml /etc/clickhouse-server/config.d/
+ ln -sf /usr/share/clickhouse-test/config/config.d/forbidden_headers.xml /etc/clickhouse-server/config.d/
+ ln -sf /usr/share/clickhouse-test/config/config.d/enable_keeper_map.xml /etc/clickhouse-server/config.d/
+ ln -sf /usr/share/clickhouse-test/config/config.d/custom_disks_base_path.xml /etc/clickhouse-server/config.d/
+ ln -sf /usr/share/clickhouse-test/config/config.d/display_name.xml /etc/clickhouse-server/config.d/
+ ln -sf /usr/share/clickhouse-test/config/config.d/reverse_dns_query_function.xml /etc/clickhouse-server/config.d/
+ ln -sf /usr/share/clickhouse-test/config/config.d/compressed_marks_and_index.xml /etc/clickhouse-server/config.d/
+ ln -sf /usr/share/clickhouse-test/config/config.d/disable_s3_env_credentials.xml /etc/clickhouse-server/config.d/
+ ln -sf /usr/share/clickhouse-test/config/config.d/enable_wait_for_shutdown_replicated_tables.xml /etc/clickhouse-server/config.d/
+ ln -sf /usr/share/clickhouse-test/config/config.d/backups.xml /etc/clickhouse-server/config.d/
+ ln -sf /usr/share/clickhouse-test/config/config.d/filesystem_caches_path.xml /etc/clickhouse-server/config.d/
+ ln -sf /usr/share/clickhouse-test/config/config.d/validate_tcp_client_information.xml /etc/clickhouse-server/config.d/
+ '[' /etc/clickhouse-server = /etc/clickhouse-server ']'
+ ln -sf /usr/share/clickhouse-test/config/config.d/legacy_geobase.xml /etc/clickhouse-server/config.d/
+ ln -sf /usr/share/clickhouse-test/config/users.d/log_queries.xml /etc/clickhouse-server/users.d/
+ ln -sf /usr/share/clickhouse-test/config/users.d/readonly.xml /etc/clickhouse-server/users.d/
+ ln -sf /usr/share/clickhouse-test/config/users.d/access_management.xml /etc/clickhouse-server/users.d/
+ ln -sf /usr/share/clickhouse-test/config/users.d/database_atomic_drop_detach_sync.xml /etc/clickhouse-server/users.d/
+ ln -sf /usr/share/clickhouse-test/config/users.d/opentelemetry.xml /etc/clickhouse-server/users.d/
+ ln -sf /usr/share/clickhouse-test/config/users.d/remote_queries.xml /etc/clickhouse-server/users.d/
+ ln -sf /usr/share/clickhouse-test/config/users.d/session_log_test.xml /etc/clickhouse-server/users.d/
+ ln -sf /usr/share/clickhouse-test/config/users.d/memory_profiler.xml /etc/clickhouse-server/users.d/
+ ln -sf /usr/share/clickhouse-test/config/users.d/no_fsync_metadata.xml /etc/clickhouse-server/users.d/
+ ln -sf /usr/share/clickhouse-test/config/users.d/filelog.xml /etc/clickhouse-server/users.d/
+ ln -sf /usr/share/clickhouse-test/config/users.d/enable_blobs_check.xml /etc/clickhouse-server/users.d/
+ ln -sf /usr/share/clickhouse-test/config/users.d/marks.xml /etc/clickhouse-server/users.d/
+ ln -sf /usr/share/clickhouse-test/config/users.d/insert_keeper_retries.xml /etc/clickhouse-server/users.d/
+ ln -sf /usr/share/clickhouse-test/config/users.d/prefetch_settings.xml /etc/clickhouse-server/users.d/
+ ln -sf /usr/share/clickhouse-test/config/users.d/nonconst_timezone.xml /etc/clickhouse-server/users.d/
+ [[ -n '' ]]
+ ln -sf /usr/share/clickhouse-test/config/users.d/timeouts.xml /etc/clickhouse-server/users.d/
+ ln -sf /usr/share/clickhouse-test/config/ints_dictionary.xml /etc/clickhouse-server/
+ ln -sf /usr/share/clickhouse-test/config/strings_dictionary.xml /etc/clickhouse-server/
+ ln -sf /usr/share/clickhouse-test/config/decimals_dictionary.xml /etc/clickhouse-server/
+ ln -sf /usr/share/clickhouse-test/config/executable_dictionary.xml /etc/clickhouse-server/
+ ln -sf /usr/share/clickhouse-test/config/executable_pool_dictionary.xml /etc/clickhouse-server/
+ ln -sf /usr/share/clickhouse-test/config/test_function.xml /etc/clickhouse-server/
+ ln -sf /usr/share/clickhouse-test/config/top_level_domains /etc/clickhouse-server/
+ ln -sf /usr/share/clickhouse-test/config/regions_hierarchy.txt /etc/clickhouse-server/config.d/
+ ln -sf /usr/share/clickhouse-test/config/regions_names_en.txt /etc/clickhouse-server/config.d/
+ ln -sf /usr/share/clickhouse-test/config/ext-en.txt /etc/clickhouse-server/config.d/
+ ln -sf /usr/share/clickhouse-test/config/ext-ru.txt /etc/clickhouse-server/config.d/
+ ln -sf /usr/share/clickhouse-test/config/lem-en.bin /etc/clickhouse-server/config.d/
+ ln -sf /usr/share/clickhouse-test/config/server.key /etc/clickhouse-server/
+ ln -sf /usr/share/clickhouse-test/config/server.crt /etc/clickhouse-server/
+ ln -sf /usr/share/clickhouse-test/config/dhparam.pem /etc/clickhouse-server/
+ ln -sf --backup=simple --suffix=_original.xml /usr/share/clickhouse-test/config/config.d/query_masking_rules.xml /etc/clickhouse-server/config.d/
+ [[ -n 1 ]]
+ [[ 1 -eq 1 ]]
+ rm -f /etc/clickhouse-server/config.d/zookeeper.xml
+ ln -sf /usr/share/clickhouse-test/config/config.d/zookeeper_fault_injection.xml /etc/clickhouse-server/config.d/
+ create_snapshot_on_exit=0
+ sed --follow-symlinks -i 's|true|0|' /etc/clickhouse-server/config.d/keeper_port.xml
+ [[ -n '' ]]
+ [[ -n 1 ]]
+ [[ 1 -eq 1 ]]
+ ln -sf /usr/share/clickhouse-test/config/users.d/database_ordinary.xml /etc/clickhouse-server/users.d/
+ [[ -n '' ]]
+ ARM=aarch64
++ uname -m
+ OS=x86_64
+ [[ -n 1 ]]
+ echo x86_64
+ [[ '' -eq 1 ]]
+ [[ x86_64 == \a\a\r\c\h\6\4 ]]
+ echo 'Adding azure configuration'
x86_64
Adding azure configuration
+ ln -sf /usr/share/clickhouse-test/config/config.d/azure_storage_conf.xml /etc/clickhouse-server/config.d/
+ ln -sf /usr/share/clickhouse-test/config/config.d/storage_conf.xml /etc/clickhouse-server/config.d/
+ ln -sf /usr/share/clickhouse-test/config/users.d/s3_cache.xml /etc/clickhouse-server/users.d/
+ [[ -n '' ]]
+ ln -sf /usr/share/clickhouse-test/config/client_config.xml /etc/clickhouse-client/config.xml
+ sed 's|100000|10000|'
+ sudo cat /etc/clickhouse-server/config.d/keeper_port.xml
+ sudo mv /etc/clickhouse-server/config.d/keeper_port.xml.tmp /etc/clickhouse-server/config.d/keeper_port.xml
+ sudo chown clickhouse /etc/clickhouse-server/config.d/keeper_port.xml
+ sudo chgrp clickhouse /etc/clickhouse-server/config.d/keeper_port.xml
+ echo 'ASAN_OPTIONS='\''malloc_context_size=10 verbosity=1 allocator_release_to_os_interval_ms=10000'\'''
+ export 'ASAN_OPTIONS=malloc_context_size=10 allocator_release_to_os_interval_ms=10000'
+ ASAN_OPTIONS='malloc_context_size=10 allocator_release_to_os_interval_ms=10000'
+ sudo chown root: /var/lib/clickhouse
+ echo '1'
+ local total_mem
++ awk '/MemTotal/ { print $(NF-1) }' /proc/meminfo
+ total_mem=32080796
+ total_mem=32850735104
+ max_server_memory_usage_to_ram_ratio=0.5
Setting max_server_memory_usage_to_ram_ratio to 0.5
+ echo 'Setting max_server_memory_usage_to_ram_ratio to 0.5'
+ cat
+ local max_users_mem
+ max_users_mem=9855220531
+ echo 'Setting max_memory_usage_for_user=9855220531 and max_memory_usage for queries to 10G'
+ cat
Setting max_memory_usage_for_user=9855220531 and max_memory_usage for queries to 10G
+ cat
+ cat
+ ./setup_minio.sh stateless
+ azurite-blob --blobHost 0.0.0.0 --blobPort 10000 --debug /azurite_log
+ export MINIO_ROOT_USER=clickhouse
+ MINIO_ROOT_USER=clickhouse
+ export MINIO_ROOT_PASSWORD=clickhouse
+ MINIO_ROOT_PASSWORD=clickhouse
+ main stateless
+ local query_dir
++ check_arg stateless
++ local query_dir
++ '[' '!' 1 -eq 1 ']'
++ case "$1" in
++ query_dir=0_stateless
++ echo 0_stateless
+ query_dir=0_stateless
+ '[' '!' -f ./minio ']'
+ start_minio
+ mkdir -p ./minio_data
+ ./minio --version
minio version RELEASE.2024-07-31T05-46-26Z (commit-id=a9dc061d847277e30c5c6918d6de6f0606f9d285)
Runtime: go1.22.5 linux/amd64
License: GNU AGPLv3 - https://www.gnu.org/licenses/agpl-3.0.html
Copyright: 2015-2024 MinIO, Inc.
+ wait_for_it
+ local counter=0
+ local max_counter=60
+ local url=http://localhost:11111
+ params=('--silent' '--verbose')
+ local params
+ ./minio server --address :11111 ./minio_data
+ grep AccessDenied
+ curl --silent --verbose http://localhost:11111
+ [[ 0 == \6\0 ]]
+ echo 'trying to connect to minio'
+ sleep 1
trying to connect to minio
Azurite Blob service is starting on 0.0.0.0:10000
Azurite Blob service successfully listens on http://0.0.0.0:10000
INFO: Formatting 1st pool, 1 set(s), 1 drives per set.
INFO: WARNING: Host local has more than 0 drives of set. A host failure will result in data becoming unavailable.
MinIO Object Storage Server
Copyright: 2015-2026 MinIO, Inc.
License: GNU AGPLv3 - https://www.gnu.org/licenses/agpl-3.0.html
Version: RELEASE.2024-07-31T05-46-26Z (go1.22.5 linux/amd64)
API: http://172.17.0.2:11111 http://127.0.0.1:11111
WebUI: http://172.17.0.2:42371 http://127.0.0.1:42371
Docs: https://min.io/docs/minio/linux/index.html
+ counter=1
+ curl --silent --verbose http://localhost:11111
+ grep AccessDenied
AccessDeniedAccess Denied./18E2B5C66AE54F927dc7eb22d3288ec80374614e9088e31d3668a6922ead55932dd2a8e56373820f
+ lsof -i :11111
COMMAND PID USER FD TYPE DEVICE SIZE/OFF NODE NAME
minio 238 root 9u IPv4 34152 0t0 TCP localhost:11111 (LISTEN)
minio 238 root 10u IPv6 34153 0t0 TCP *:11111 (LISTEN)
minio 238 root 11u IPv6 34154 0t0 TCP localhost:11111 (LISTEN)
+ sleep 5
+ setup_minio stateless
+ local test_type=stateless
+ ./mc alias set clickminio http://localhost:11111 clickhouse clickhouse
Added `clickminio` successfully.
+ ./mc admin user add clickminio test testtest
Added user `test` successfully.
+ ./mc admin policy attach clickminio readwrite --user=test
Attached Policies: [readwrite]
To User: test
+ ./mc mb clickminio/test
Bucket created successfully `clickminio/test`.
+ '[' stateless = stateless ']'
+ ./mc anonymous set public clickminio/test
Access permission for `clickminio/test` is set to `public`
+ upload_data 0_stateless /usr/share/clickhouse-test
+ local query_dir=0_stateless
+ local test_path=/usr/share/clickhouse-test
+ local data_path=/usr/share/clickhouse-test/queries/0_stateless/data_minio
++ ls /usr/share/clickhouse-test/queries/0_stateless/data_minio
02366_data.jsonl
+ for file in $(ls "${data_path}")
+ echo 02366_data.jsonl
+ ./mc cp /usr/share/clickhouse-test/queries/0_stateless/data_minio/02366_data.jsonl clickminio/test/02366_data.jsonl
`/usr/share/clickhouse-test/queries/0_stateless/data_minio/02366_data.jsonl` -> `clickminio/test/02366_data.jsonl`
Total: 0 B, Transferred: 0 B, Speed: 0 B/s
+ for file in $(ls "${data_path}")
+ echo 02731.arrow
+ ./mc cp /usr/share/clickhouse-test/queries/0_stateless/data_minio/02731.arrow clickminio/test/02731.arrow
02731.arrow
`/usr/share/clickhouse-test/queries/0_stateless/data_minio/02731.arrow` -> `clickminio/test/02731.arrow`
Total: 3.82 MiB, Transferred: 3.82 MiB, Speed: 85.82 MiB/s
02731.parquet
+ for file in $(ls "${data_path}")
+ echo 02731.parquet
+ ./mc cp /usr/share/clickhouse-test/queries/0_stateless/data_minio/02731.parquet clickminio/test/02731.parquet
`/usr/share/clickhouse-test/queries/0_stateless/data_minio/02731.parquet` -> `clickminio/test/02731.parquet`
Total: 1.57 MiB, Transferred: 1.57 MiB, Speed: 61.77 MiB/s
+ for file in $(ls "${data_path}")
+ echo a.tsv
+ ./mc cp /usr/share/clickhouse-test/queries/0_stateless/data_minio/a.tsv clickminio/test/a.tsv
a.tsv
`/usr/share/clickhouse-test/queries/0_stateless/data_minio/a.tsv` -> `clickminio/test/a.tsv`
Total: 24 B, Transferred: 24 B, Speed: 1.85 KiB/s
+ for file in $(ls "${data_path}")
+ echo b.tsv
+ ./mc cp /usr/share/clickhouse-test/queries/0_stateless/data_minio/b.tsv clickminio/test/b.tsv
b.tsv
`/usr/share/clickhouse-test/queries/0_stateless/data_minio/b.tsv` -> `clickminio/test/b.tsv`
Total: 33 B, Transferred: 33 B, Speed: 2.93 KiB/s
c.tsv
+ for file in $(ls "${data_path}")
+ echo c.tsv
+ ./mc cp /usr/share/clickhouse-test/queries/0_stateless/data_minio/c.tsv clickminio/test/c.tsv
`/usr/share/clickhouse-test/queries/0_stateless/data_minio/c.tsv` -> `clickminio/test/c.tsv`
Total: 33 B, Transferred: 33 B, Speed: 2.82 KiB/s
+ for file in $(ls "${data_path}")
+ echo tsv_with_header.tsv
+ ./mc cp /usr/share/clickhouse-test/queries/0_stateless/data_minio/tsv_with_header.tsv clickminio/test/tsv_with_header.tsv
tsv_with_header.tsv
`/usr/share/clickhouse-test/queries/0_stateless/data_minio/tsv_with_header.tsv` -> `clickminio/test/tsv_with_header.tsv`
Total: 44 B, Transferred: 44 B, Speed: 4.90 KiB/s
+ setup_aws_credentials
+ local minio_root_user=clickhouse
+ local minio_root_password=clickhouse
+ mkdir -p /root/.aws
+ cat
+ config_logs_export_cluster /etc/clickhouse-server/config.d/system_logs_export.yaml
+ set +x
File /tmp/export-logs-config.sh does not exist, do not setup
+ start
+ counter=0
+ clickhouse-client --query 'SELECT 1'
Code: 210. DB::NetException: Connection refused (localhost:9000). (NETWORK_ERROR)
+ '[' 0 -gt 120 ']'
+ clickhouse start --user root
+ sleep 0.5
+ counter=1
+ clickhouse-client --query 'SELECT 1'
Code: 210. DB::NetException: Connection refused (localhost:9000). (NETWORK_ERROR)
+ '[' 1 -gt 120 ']'
+ clickhouse start --user root
+ sleep 0.5
+ counter=2
+ clickhouse-client --query 'SELECT 1'
Code: 210. DB::NetException: Connection refused (localhost:9000). (NETWORK_ERROR)
+ '[' 2 -gt 120 ']'
+ clickhouse start --user root
+ sleep 0.5
+ counter=3
+ clickhouse-client --query 'SELECT 1'
Code: 210. DB::NetException: Connection refused (localhost:9000). (NETWORK_ERROR)
+ '[' 3 -gt 120 ']'
+ clickhouse start --user root
+ sleep 0.5
+ counter=4
+ clickhouse-client --query 'SELECT 1'
Code: 210. DB::NetException: Connection refused (localhost:9000). (NETWORK_ERROR)
+ '[' 4 -gt 120 ']'
+ clickhouse start --user root
+ sleep 0.5
+ counter=5
+ clickhouse-client --query 'SELECT 1'
Code: 210. DB::NetException: Connection refused (localhost:9000). (NETWORK_ERROR)
+ '[' 5 -gt 120 ']'
+ clickhouse start --user root
+ sleep 0.5
+ counter=6
+ clickhouse-client --query 'SELECT 1'
Code: 210. DB::NetException: Connection refused (localhost:9000). (NETWORK_ERROR)
+ '[' 6 -gt 120 ']'
+ clickhouse start --user root
+ sleep 0.5
+ counter=7
+ clickhouse-client --query 'SELECT 1'
Code: 210. DB::NetException: Connection refused (localhost:9000). (NETWORK_ERROR)
+ '[' 7 -gt 120 ']'
+ clickhouse start --user root
+ sleep 0.5
+ counter=8
+ clickhouse-client --query 'SELECT 1'
Code: 210. DB::NetException: Connection refused (localhost:9000). (NETWORK_ERROR)
+ '[' 8 -gt 120 ']'
+ clickhouse start --user root
+ sleep 0.5
+ counter=9
+ clickhouse-client --query 'SELECT 1'
Code: 210. DB::NetException: Connection refused (localhost:9000). (NETWORK_ERROR)
+ '[' 9 -gt 120 ']'
+ clickhouse start --user root
+ sleep 0.5
+ counter=10
+ clickhouse-client --query 'SELECT 1'
Code: 210. DB::NetException: Connection refused (localhost:9000). (NETWORK_ERROR)
+ '[' 10 -gt 120 ']'
+ clickhouse start --user root
+ sleep 0.5
+ counter=11
+ clickhouse-client --query 'SELECT 1'
Code: 210. DB::NetException: Connection refused (localhost:9000). (NETWORK_ERROR)
+ '[' 11 -gt 120 ']'
+ clickhouse start --user root
+ sleep 0.5
+ counter=12
+ clickhouse-client --query 'SELECT 1'
Code: 210. DB::NetException: Connection refused (localhost:9000). (NETWORK_ERROR)
+ '[' 12 -gt 120 ']'
+ clickhouse start --user root
+ sleep 0.5
+ counter=13
+ clickhouse-client --query 'SELECT 1'
Code: 210. DB::NetException: Connection refused (localhost:9000). (NETWORK_ERROR)
+ '[' 13 -gt 120 ']'
+ clickhouse start --user root
+ sleep 0.5
+ counter=14
+ clickhouse-client --query 'SELECT 1'
Code: 210. DB::NetException: Connection refused (localhost:9000). (NETWORK_ERROR)
+ '[' 14 -gt 120 ']'
+ clickhouse start --user root
+ sleep 0.5
+ counter=15
+ clickhouse-client --query 'SELECT 1'
Code: 210. DB::NetException: Connection refused (localhost:9000). (NETWORK_ERROR)
+ '[' 15 -gt 120 ']'
+ clickhouse start --user root
+ sleep 0.5
+ counter=16
+ clickhouse-client --query 'SELECT 1'
Code: 210. DB::NetException: Connection refused (localhost:9000). (NETWORK_ERROR)
+ '[' 16 -gt 120 ']'
+ clickhouse start --user root
+ sleep 0.5
+ counter=17
+ clickhouse-client --query 'SELECT 1'
Code: 210. DB::NetException: Connection refused (localhost:9000). (NETWORK_ERROR)
+ '[' 17 -gt 120 ']'
+ clickhouse start --user root
+ sleep 0.5
+ counter=18
+ clickhouse-client --query 'SELECT 1'
Code: 210. DB::NetException: Connection refused (localhost:9000). (NETWORK_ERROR)
+ '[' 18 -gt 120 ']'
+ clickhouse start --user root
+ sleep 0.5
+ counter=19
+ clickhouse-client --query 'SELECT 1'
Code: 210. DB::NetException: Connection refused (localhost:9000). (NETWORK_ERROR)
+ '[' 19 -gt 120 ']'
+ clickhouse start --user root
+ sleep 0.5
+ counter=20
+ clickhouse-client --query 'SELECT 1'
Code: 210. DB::NetException: Connection refused (localhost:9000). (NETWORK_ERROR)
+ '[' 20 -gt 120 ']'
+ clickhouse start --user root
+ sleep 0.5
+ counter=21
+ clickhouse-client --query 'SELECT 1'
Code: 210. DB::NetException: Connection refused (localhost:9000). (NETWORK_ERROR)
+ '[' 21 -gt 120 ']'
+ clickhouse start --user root
+ sleep 0.5
+ counter=22
+ clickhouse-client --query 'SELECT 1'
Code: 210. DB::NetException: Connection refused (localhost:9000). (NETWORK_ERROR)
+ '[' 22 -gt 120 ']'
+ clickhouse start --user root
+ sleep 0.5
+ counter=23
+ clickhouse-client --query 'SELECT 1'
Code: 210. DB::NetException: Connection refused (localhost:9000). (NETWORK_ERROR)
+ '[' 23 -gt 120 ']'
+ clickhouse start --user root
+ sleep 0.5
+ counter=24
+ clickhouse-client --query 'SELECT 1'
Code: 210. DB::NetException: Connection refused (localhost:9000). (NETWORK_ERROR)
+ '[' 24 -gt 120 ']'
+ clickhouse start --user root
+ sleep 0.5
+ counter=25
+ clickhouse-client --query 'SELECT 1'
Code: 210. DB::NetException: Connection refused (localhost:9000). (NETWORK_ERROR)
+ '[' 25 -gt 120 ']'
+ clickhouse start --user root
+ sleep 0.5
+ counter=26
+ clickhouse-client --query 'SELECT 1'
Code: 210. DB::NetException: Connection refused (localhost:9000). (NETWORK_ERROR)
+ '[' 26 -gt 120 ']'
+ clickhouse start --user root
+ sleep 0.5
+ counter=27
+ clickhouse-client --query 'SELECT 1'
Code: 210. DB::NetException: Connection refused (localhost:9000). (NETWORK_ERROR)
+ '[' 27 -gt 120 ']'
+ clickhouse start --user root
+ sleep 0.5
+ counter=28
+ clickhouse-client --query 'SELECT 1'
Code: 210. DB::NetException: Connection refused (localhost:9000). (NETWORK_ERROR)
+ '[' 28 -gt 120 ']'
+ clickhouse start --user root
+ sleep 0.5
+ counter=29
+ clickhouse-client --query 'SELECT 1'
Code: 210. DB::NetException: Connection refused (localhost:9000). (NETWORK_ERROR)
+ '[' 29 -gt 120 ']'
+ clickhouse start --user root
+ sleep 0.5
+ counter=30
+ clickhouse-client --query 'SELECT 1'
Code: 210. DB::NetException: Connection refused (localhost:9000). (NETWORK_ERROR)
+ '[' 30 -gt 120 ']'
+ clickhouse start --user root
+ sleep 0.5
+ counter=31
+ clickhouse-client --query 'SELECT 1'
Code: 210. DB::NetException: Connection refused (localhost:9000). (NETWORK_ERROR)
+ '[' 31 -gt 120 ']'
+ clickhouse start --user root
+ sleep 0.5
+ counter=32
+ clickhouse-client --query 'SELECT 1'
Code: 210. DB::NetException: Connection refused (localhost:9000). (NETWORK_ERROR)
+ '[' 32 -gt 120 ']'
+ clickhouse start --user root
+ sleep 0.5
+ counter=33
+ clickhouse-client --query 'SELECT 1'
Code: 210. DB::NetException: Connection refused (localhost:9000). (NETWORK_ERROR)
+ '[' 33 -gt 120 ']'
+ clickhouse start --user root
+ sleep 0.5
+ counter=34
+ clickhouse-client --query 'SELECT 1'
Code: 210. DB::NetException: Connection refused (localhost:9000). (NETWORK_ERROR)
+ '[' 34 -gt 120 ']'
+ clickhouse start --user root
+ sleep 0.5
+ counter=35
+ clickhouse-client --query 'SELECT 1'
Code: 210. DB::NetException: Connection refused (localhost:9000). (NETWORK_ERROR)
+ '[' 35 -gt 120 ']'
+ clickhouse start --user root
+ sleep 0.5
+ counter=36
+ clickhouse-client --query 'SELECT 1'
Code: 210. DB::NetException: Connection refused (localhost:9000). (NETWORK_ERROR)
+ '[' 36 -gt 120 ']'
+ clickhouse start --user root
+ sleep 0.5
+ counter=37
+ clickhouse-client --query 'SELECT 1'
Code: 210. DB::NetException: Connection refused (localhost:9000). (NETWORK_ERROR)
+ '[' 37 -gt 120 ']'
+ clickhouse start --user root
+ sleep 0.5
+ counter=38
+ clickhouse-client --query 'SELECT 1'
Code: 210. DB::NetException: Connection refused (localhost:9000). (NETWORK_ERROR)
+ '[' 38 -gt 120 ']'
+ clickhouse start --user root
+ sleep 0.5
+ counter=39
+ clickhouse-client --query 'SELECT 1'
Code: 210. DB::NetException: Connection refused (localhost:9000). (NETWORK_ERROR)
+ '[' 39 -gt 120 ']'
+ clickhouse start --user root
+ sleep 0.5
+ counter=40
+ clickhouse-client --query 'SELECT 1'
Code: 210. DB::NetException: Connection refused (localhost:9000). (NETWORK_ERROR)
+ '[' 40 -gt 120 ']'
+ clickhouse start --user root
+ sleep 0.5
+ counter=41
+ clickhouse-client --query 'SELECT 1'
Code: 210. DB::NetException: Connection refused (localhost:9000). (NETWORK_ERROR)
+ '[' 41 -gt 120 ']'
+ clickhouse start --user root
+ sleep 0.5
127.0.0.1 - - [28/Oct/2026:13:51:50 +0000] "PUT /devstoreaccount1/cont?restype=container HTTP/1.1" 201 -
127.0.0.1 - - [28/Oct/2026:13:51:50 +0000] "PUT /devstoreaccount1/cont/miiqjugumviscekbqxoehbvbkszzkfcp?blockid=hjyonyhsrxsijddatodjohudtgbnwehxslqmbyxxwviadpbaeleerqxlowmbfjye&comp=block HTTP/1.1" 201 -
127.0.0.1 - - [28/Oct/2026:13:51:50 +0000] "PUT /devstoreaccount1/cont/miiqjugumviscekbqxoehbvbkszzkfcp?comp=blocklist HTTP/1.1" 201 -
127.0.0.1 - - [28/Oct/2026:13:51:50 +0000] "GET /devstoreaccount1/cont/miiqjugumviscekbqxoehbvbkszzkfcp HTTP/1.1" 206 4
127.0.0.1 - - [28/Oct/2026:13:51:50 +0000] "GET /devstoreaccount1/cont/miiqjugumviscekbqxoehbvbkszzkfcp HTTP/1.1" 206 2
127.0.0.1 - - [28/Oct/2026:13:51:50 +0000] "DELETE /devstoreaccount1/cont/miiqjugumviscekbqxoehbvbkszzkfcp HTTP/1.1" 202 -
+ counter=42
+ clickhouse-client --query 'SELECT 1'
Code: 210. DB::NetException: Connection refused (localhost:9000). (NETWORK_ERROR)
+ '[' 42 -gt 120 ']'
+ clickhouse start --user root
+ sleep 0.5
+ counter=43
+ clickhouse-client --query 'SELECT 1'
Code: 210. DB::NetException: Connection refused (localhost:9000). (NETWORK_ERROR)
+ '[' 43 -gt 120 ']'
+ clickhouse start --user root
+ sleep 0.5
+ counter=44
+ clickhouse-client --query 'SELECT 1'
1
+ attach_gdb_to_clickhouse
++ kill -l SIGRTMIN
+ RTMIN=34
+ echo '
set follow-fork-mode parent
handle SIGHUP nostop noprint pass
handle SIGINT nostop noprint pass
handle SIGQUIT nostop noprint pass
handle SIGPIPE nostop noprint pass
handle SIGTERM nostop noprint pass
handle SIGUSR1 nostop noprint pass
handle SIGUSR2 nostop noprint pass
handle SIG34 nostop noprint pass
info signals
continue
backtrace full
thread apply all backtrace full
info registers
disassemble /s
up
disassemble /s
up
disassemble /s
p "done"
detach
quit
'
+ sleep 5
++ cat /var/run/clickhouse-server/clickhouse-server.pid
+ ts '%Y-%m-%d %H:%M:%S'
+ gdb -batch -command script.gdb -p 445
+ run_with_retry 60 clickhouse-client --query 'SELECT '\''Connected to clickhouse-server after attaching gdb'\'''
+ [[ hxB =~ e ]]
+ set_e=false
+ set +e
+ local total_retries=60
+ shift
+ local retry=0
+ '[' 0 -ge 60 ']'
+ clickhouse-client --query 'SELECT '\''Connected to clickhouse-server after attaching gdb'\'''
warning: Missing auto-load script at offset 0 in section .debug_gdb_scripts
of file /usr/bin/clickhouse.
Use `info auto-load python-scripts [REGEXP]' to list them.
Connected to clickhouse-server after attaching gdb
+ false
+ return
+ setup_logs_replication
+ set +x
File /tmp/export-logs-config.sh does not exist, do not setup
+ /s3downloader --url-prefix https://s3.amazonaws.com/clickhouse-datasets --dataset-names hits visits
INFO:root:Will fetch following datasets: hits, visits
INFO:root:Processing hits
INFO:root:Downloading from https://s3.amazonaws.com/clickhouse-datasets/hits/partitions/hits_v1.tar to temp path /tmp/0ucctztt
INFO:root:Content length is 1271623680 bytes
INFO:root:Downloading finished
INFO:root:Will unpack data from temp path /tmp/0ucctztt to clickhouse db /var/lib/clickhouse/
INFO:root:Unpack finished
INFO:root:Will remove downloaded file /tmp/0ucctztt from filesystem if it exists
INFO:root:Processing of hits finished
INFO:root:Processing visits
INFO:root:Downloading from https://s3.amazonaws.com/clickhouse-datasets/visits/partitions/visits_v1.tar to temp path /tmp/_14ptkjm
INFO:root:Content length is 563968000 bytes
INFO:root:Downloading finished
INFO:root:Will unpack data from temp path /tmp/_14ptkjm to clickhouse db /var/lib/clickhouse/
INFO:root:Unpack finished
INFO:root:Will remove downloaded file /tmp/_14ptkjm from filesystem if it exists
INFO:root:Processing of visits finished
INFO:root:Fetch finished, enjoy your tables!
+ chmod 777 -R /var/lib/clickhouse
+ clickhouse-client --query 'ATTACH DATABASE IF NOT EXISTS datasets ENGINE = Ordinary'
+ clickhouse-client --query 'CREATE DATABASE IF NOT EXISTS test'
+ stop
+ local max_tries=90
+ local check_hang=true
+ local pid
++ cat /var/run/clickhouse-server/clickhouse-server.pid
+ pid=445
+ clickhouse stop --max-tries 90 --do-not-kill
/var/run/clickhouse-server/clickhouse-server.pid file exists and contains pid = 445.
The process with pid = 445 is running.
Sent terminate signal to process with pid 445.
Waiting for server to stop
/var/run/clickhouse-server/clickhouse-server.pid file exists and contains pid = 445.
The process with pid = 445 is running.
Waiting for server to stop
/var/run/clickhouse-server/clickhouse-server.pid file exists and contains pid = 445.
The process with pid = 445 is running.
Waiting for server to stop
/var/run/clickhouse-server/clickhouse-server.pid file exists and contains pid = 445.
The process with pid = 445 is running.
Waiting for server to stop
/var/run/clickhouse-server/clickhouse-server.pid file exists and contains pid = 445.
The process with pid = 445 is running.
Waiting for server to stop
/var/run/clickhouse-server/clickhouse-server.pid file exists and contains pid = 445.
The process with pid = 445 is running.
Waiting for server to stop
/var/run/clickhouse-server/clickhouse-server.pid file exists and contains pid = 445.
The process with pid = 445 is running.
Waiting for server to stop
/var/run/clickhouse-server/clickhouse-server.pid file exists and contains pid = 445.
The process with pid = 445 is running.
Waiting for server to stop
/var/run/clickhouse-server/clickhouse-server.pid file exists and contains pid = 445.
The process with pid = 445 is running.
Waiting for server to stop
/var/run/clickhouse-server/clickhouse-server.pid file exists and contains pid = 445.
The process with pid = 445 is running.
Waiting for server to stop
/var/run/clickhouse-server/clickhouse-server.pid file exists and contains pid = 445.
The process with pid = 445 is running.
Waiting for server to stop
/var/run/clickhouse-server/clickhouse-server.pid file exists and contains pid = 445.
The process with pid = 445 is running.
Waiting for server to stop
/var/run/clickhouse-server/clickhouse-server.pid file exists and contains pid = 445.
The process with pid = 445 is running.
Waiting for server to stop
/var/run/clickhouse-server/clickhouse-server.pid file exists and contains pid = 445.
The process with pid = 445 is running.
Waiting for server to stop
/var/run/clickhouse-server/clickhouse-server.pid file exists and contains pid = 445.
The process with pid = 445 is running.
Waiting for server to stop
/var/run/clickhouse-server/clickhouse-server.pid file exists and contains pid = 445.
The process with pid = 445 is running.
Waiting for server to stop
/var/run/clickhouse-server/clickhouse-server.pid file exists and contains pid = 445.
The process with pid = 445 is running.
Waiting for server to stop
/var/run/clickhouse-server/clickhouse-server.pid file exists and contains pid = 445.
The process with pid = 445 is running.
Waiting for server to stop
/var/run/clickhouse-server/clickhouse-server.pid file exists and contains pid = 445.
The process with pid = 445 is running.
Waiting for server to stop
/var/run/clickhouse-server/clickhouse-server.pid file exists and contains pid = 445.
The process with pid = 445 is running.
Waiting for server to stop
/var/run/clickhouse-server/clickhouse-server.pid file exists and contains pid = 445.
The process with pid = 445 is running.
Waiting for server to stop
/var/run/clickhouse-server/clickhouse-server.pid file exists and contains pid = 445.
The process with pid = 445 is running.
Waiting for server to stop
/var/run/clickhouse-server/clickhouse-server.pid file exists and contains pid = 445.
The process with pid = 445 is running.
Waiting for server to stop
/var/run/clickhouse-server/clickhouse-server.pid file exists and contains pid = 445.
The process with pid = 445 is running.
Waiting for server to stop
/var/run/clickhouse-server/clickhouse-server.pid file exists and contains pid = 445.
The process with pid = 445 is running.
Waiting for server to stop
/var/run/clickhouse-server/clickhouse-server.pid file exists and contains pid = 445.
The process with pid = 445 is running.
Waiting for server to stop
/var/run/clickhouse-server/clickhouse-server.pid file exists and contains pid = 445.
The process with pid = 445 is running.script.gdb:13: Error in sourced command file:
No stack.
Waiting for server to stop
/var/run/clickhouse-server/clickhouse-server.pid file exists and contains pid = 445.
The process with pid = 445 is running.
Waiting for server to stop
/var/run/clickhouse-server/clickhouse-server.pid file exists and contains pid = 445.
The process with pid = 445 is running.
Waiting for server to stop
/var/run/clickhouse-server/clickhouse-server.pid file exists and contains pid = 445.
The process with pid = 445 is running.
Waiting for server to stop
/var/run/clickhouse-server/clickhouse-server.pid file exists and contains pid = 445.
The process with pid = 445 is running.
Waiting for server to stop
/var/run/clickhouse-server/clickhouse-server.pid file exists and contains pid = 445.
The process with pid = 445 is running.
Waiting for server to stop
/var/run/clickhouse-server/clickhouse-server.pid file exists and contains pid = 445.
The process with pid = 445 is running.
Waiting for server to stop
/var/run/clickhouse-server/clickhouse-server.pid file exists and contains pid = 445.
The process with pid = 445 is running.
Waiting for server to stop
/var/run/clickhouse-server/clickhouse-server.pid file exists and contains pid = 445.
The process with pid = 445 is running.
Waiting for server to stop
/var/run/clickhouse-server/clickhouse-server.pid file exists and contains pid = 445.
The process with pid = 445 is running.
Waiting for server to stop
Found pid = 445 in the list of running processes.
The process with pid = 445 is running.
Waiting for server to stop
Found pid = 445 in the list of running processes.
The process with pid = 445 is running.
Waiting for server to stop
Now there is no clickhouse-server process.
Server stopped
+ return
+ mv /var/log/clickhouse-server/clickhouse-server.log /var/log/clickhouse-server/clickhouse-server.initial.log
+ start
+ counter=0
+ clickhouse-client --query 'SELECT 1'
Code: 210. DB::NetException: Connection refused (localhost:9000). (NETWORK_ERROR)
+ '[' 0 -gt 120 ']'
+ clickhouse start --user root
+ sleep 0.5
+ counter=1
+ clickhouse-client --query 'SELECT 1'
Code: 210. DB::NetException: Connection refused (localhost:9000). (NETWORK_ERROR)
+ '[' 1 -gt 120 ']'
+ clickhouse start --user root
+ sleep 0.5
+ counter=2
+ clickhouse-client --query 'SELECT 1'
Code: 210. DB::NetException: Connection refused (localhost:9000). (NETWORK_ERROR)
+ '[' 2 -gt 120 ']'
+ clickhouse start --user root
+ sleep 0.5
+ counter=3
+ clickhouse-client --query 'SELECT 1'
Code: 210. DB::NetException: Connection refused (localhost:9000). (NETWORK_ERROR)
+ '[' 3 -gt 120 ']'
+ clickhouse start --user root
+ sleep 0.5
+ counter=4
+ clickhouse-client --query 'SELECT 1'
Code: 210. DB::NetException: Connection refused (localhost:9000). (NETWORK_ERROR)
+ '[' 4 -gt 120 ']'
+ clickhouse start --user root
+ sleep 0.5
+ counter=5
+ clickhouse-client --query 'SELECT 1'
Code: 210. DB::NetException: Connection refused (localhost:9000). (NETWORK_ERROR)
+ '[' 5 -gt 120 ']'
+ clickhouse start --user root
+ sleep 0.5
+ counter=6
+ clickhouse-client --query 'SELECT 1'
Code: 210. DB::NetException: Connection refused (localhost:9000). (NETWORK_ERROR)
+ '[' 6 -gt 120 ']'
+ clickhouse start --user root
+ sleep 0.5
+ counter=7
+ clickhouse-client --query 'SELECT 1'
Code: 210. DB::NetException: Connection refused (localhost:9000). (NETWORK_ERROR)
+ '[' 7 -gt 120 ']'
+ clickhouse start --user root
+ sleep 0.5
+ counter=8
+ clickhouse-client --query 'SELECT 1'
Code: 210. DB::NetException: Connection refused (localhost:9000). (NETWORK_ERROR)
+ '[' 8 -gt 120 ']'
+ clickhouse start --user root
+ sleep 0.5
+ counter=9
+ clickhouse-client --query 'SELECT 1'
Code: 210. DB::NetException: Connection refused (localhost:9000). (NETWORK_ERROR)
+ '[' 9 -gt 120 ']'
+ clickhouse start --user root
+ sleep 0.5
+ counter=10
+ clickhouse-client --query 'SELECT 1'
Code: 210. DB::NetException: Connection refused (localhost:9000). (NETWORK_ERROR)
+ '[' 10 -gt 120 ']'
+ clickhouse start --user root
+ sleep 0.5
+ counter=11
+ clickhouse-client --query 'SELECT 1'
Code: 210. DB::NetException: Connection refused (localhost:9000). (NETWORK_ERROR)
+ '[' 11 -gt 120 ']'
+ clickhouse start --user root
+ sleep 0.5
+ counter=12
+ clickhouse-client --query 'SELECT 1'
Code: 210. DB::NetException: Connection refused (localhost:9000). (NETWORK_ERROR)
+ '[' 12 -gt 120 ']'
+ clickhouse start --user root
+ sleep 0.5
+ counter=13
+ clickhouse-client --query 'SELECT 1'
Code: 210. DB::NetException: Connection refused (localhost:9000). (NETWORK_ERROR)
+ '[' 13 -gt 120 ']'
+ clickhouse start --user root
+ sleep 0.5
+ counter=14
+ clickhouse-client --query 'SELECT 1'
Code: 210. DB::NetException: Connection refused (localhost:9000). (NETWORK_ERROR)
+ '[' 14 -gt 120 ']'
+ clickhouse start --user root
+ sleep 0.5
+ counter=15
+ clickhouse-client --query 'SELECT 1'
Code: 210. DB::NetException: Connection refused (localhost:9000). (NETWORK_ERROR)
+ '[' 15 -gt 120 ']'
+ clickhouse start --user root
+ sleep 0.5
+ counter=16
+ clickhouse-client --query 'SELECT 1'
Code: 210. DB::NetException: Connection refused (localhost:9000). (NETWORK_ERROR)
+ '[' 16 -gt 120 ']'
+ clickhouse start --user root
+ sleep 0.5
+ counter=17
+ clickhouse-client --query 'SELECT 1'
Code: 210. DB::NetException: Connection refused (localhost:9000). (NETWORK_ERROR)
+ '[' 17 -gt 120 ']'
+ clickhouse start --user root
+ sleep 0.5
+ counter=18
+ clickhouse-client --query 'SELECT 1'
Code: 210. DB::NetException: Connection refused (localhost:9000). (NETWORK_ERROR)
+ '[' 18 -gt 120 ']'
+ clickhouse start --user root
+ sleep 0.5
+ counter=19
+ clickhouse-client --query 'SELECT 1'
Code: 210. DB::NetException: Connection refused (localhost:9000). (NETWORK_ERROR)
+ '[' 19 -gt 120 ']'
+ clickhouse start --user root
+ sleep 0.5
+ counter=20
+ clickhouse-client --query 'SELECT 1'
Code: 210. DB::NetException: Connection refused (localhost:9000). (NETWORK_ERROR)
+ '[' 20 -gt 120 ']'
+ clickhouse start --user root
+ sleep 0.5
+ counter=21
+ clickhouse-client --query 'SELECT 1'
Code: 210. DB::NetException: Connection refused (localhost:9000). (NETWORK_ERROR)
+ '[' 21 -gt 120 ']'
+ clickhouse start --user root
+ sleep 0.5
+ counter=22
+ clickhouse-client --query 'SELECT 1'
Code: 210. DB::NetException: Connection refused (localhost:9000). (NETWORK_ERROR)
+ '[' 22 -gt 120 ']'
+ clickhouse start --user root
+ sleep 0.5
+ counter=23
+ clickhouse-client --query 'SELECT 1'
Code: 210. DB::NetException: Connection refused (localhost:9000). (NETWORK_ERROR)
+ '[' 23 -gt 120 ']'
+ clickhouse start --user root
+ sleep 0.5
+ counter=24
+ clickhouse-client --query 'SELECT 1'
Code: 210. DB::NetException: Connection refused (localhost:9000). (NETWORK_ERROR)
+ '[' 24 -gt 120 ']'
+ clickhouse start --user root
+ sleep 0.5
+ counter=25
+ clickhouse-client --query 'SELECT 1'
Code: 210. DB::NetException: Connection refused (localhost:9000). (NETWORK_ERROR)
+ '[' 25 -gt 120 ']'
+ clickhouse start --user root
+ sleep 0.5
+ counter=26
+ clickhouse-client --query 'SELECT 1'
Code: 210. DB::NetException: Connection refused (localhost:9000). (NETWORK_ERROR)
+ '[' 26 -gt 120 ']'
+ clickhouse start --user root
+ sleep 0.5
+ counter=27
+ clickhouse-client --query 'SELECT 1'
Code: 210. DB::NetException: Connection refused (localhost:9000). (NETWORK_ERROR)
+ '[' 27 -gt 120 ']'
+ clickhouse start --user root
+ sleep 0.5
+ counter=28
+ clickhouse-client --query 'SELECT 1'
Code: 210. DB::NetException: Connection refused (localhost:9000). (NETWORK_ERROR)
+ '[' 28 -gt 120 ']'
+ clickhouse start --user root
+ sleep 0.5
+ counter=29
+ clickhouse-client --query 'SELECT 1'
Code: 210. DB::NetException: Connection refused (localhost:9000). (NETWORK_ERROR)
+ '[' 29 -gt 120 ']'
+ clickhouse start --user root
+ sleep 0.5
+ counter=30
+ clickhouse-client --query 'SELECT 1'
Code: 210. DB::NetException: Connection refused (localhost:9000). (NETWORK_ERROR)
+ '[' 30 -gt 120 ']'
+ clickhouse start --user root
+ sleep 0.5
+ counter=31
+ clickhouse-client --query 'SELECT 1'
Code: 210. DB::NetException: Connection refused (localhost:9000). (NETWORK_ERROR)
+ '[' 31 -gt 120 ']'
+ clickhouse start --user root
+ sleep 0.5
+ counter=32
+ clickhouse-client --query 'SELECT 1'
Code: 210. DB::NetException: Connection refused (localhost:9000). (NETWORK_ERROR)
+ '[' 32 -gt 120 ']'
+ clickhouse start --user root
+ sleep 0.5
+ counter=33
+ clickhouse-client --query 'SELECT 1'
Code: 210. DB::NetException: Connection refused (localhost:9000). (NETWORK_ERROR)
+ '[' 33 -gt 120 ']'
+ clickhouse start --user root
+ sleep 0.5
127.0.0.1 - - [28/Oct/2026:13:56:04 +0000] "PUT /devstoreaccount1/cont?restype=container HTTP/1.1" 409 -
127.0.0.1 - - [28/Oct/2026:13:56:04 +0000] "PUT /devstoreaccount1/cont/eipsvypcdcdcxygcvtylrokqhqkvgyue?blockid=vznlsvqomxduykuwwbmqsjzplnusonuvrptvscywapkapndvaxkaittzzpfjmqfs&comp=block HTTP/1.1" 201 -
127.0.0.1 - - [28/Oct/2026:13:56:04 +0000] "PUT /devstoreaccount1/cont/eipsvypcdcdcxygcvtylrokqhqkvgyue?comp=blocklist HTTP/1.1" 201 -
127.0.0.1 - - [28/Oct/2026:13:56:04 +0000] "GET /devstoreaccount1/cont/eipsvypcdcdcxygcvtylrokqhqkvgyue HTTP/1.1" 206 4
127.0.0.1 - - [28/Oct/2026:13:56:04 +0000] "GET /devstoreaccount1/cont/eipsvypcdcdcxygcvtylrokqhqkvgyue HTTP/1.1" 206 2
127.0.0.1 - - [28/Oct/2026:13:56:04 +0000] "DELETE /devstoreaccount1/cont/eipsvypcdcdcxygcvtylrokqhqkvgyue HTTP/1.1" 202 -
+ counter=34
+ clickhouse-client --query 'SELECT 1'
Code: 210. DB::NetException: Connection refused (localhost:9000). (NETWORK_ERROR)
+ '[' 34 -gt 120 ']'
+ clickhouse start --user root
+ sleep 0.5
+ counter=35
+ clickhouse-client --query 'SELECT 1'
Code: 210. DB::NetException: Connection refused (localhost:9000). (NETWORK_ERROR)
+ '[' 35 -gt 120 ']'
+ clickhouse start --user root
+ sleep 0.5
+ counter=36
+ clickhouse-client --query 'SELECT 1'
Code: 210. DB::NetException: Connection refused (localhost:9000). (NETWORK_ERROR)
+ '[' 36 -gt 120 ']'
+ clickhouse start --user root
+ sleep 0.5
+ counter=37
+ clickhouse-client --query 'SELECT 1'
Code: 210. DB::NetException: Connection refused (localhost:9000). (NETWORK_ERROR)
+ '[' 37 -gt 120 ']'
+ clickhouse start --user root
+ sleep 0.5
+ counter=38
+ clickhouse-client --query 'SELECT 1'
Code: 210. DB::NetException: Connection refused (localhost:9000). (NETWORK_ERROR)
+ '[' 38 -gt 120 ']'
+ clickhouse start --user root
+ sleep 0.5
+ counter=39
+ clickhouse-client --query 'SELECT 1'
Code: 210. DB::NetException: Connection refused (localhost:9000). (NETWORK_ERROR)
+ '[' 39 -gt 120 ']'
+ clickhouse start --user root
+ sleep 0.5
+ counter=40
+ clickhouse-client --query 'SELECT 1'
Code: 210. DB::NetException: Connection refused (localhost:9000). (NETWORK_ERROR)
+ '[' 40 -gt 120 ']'
+ clickhouse start --user root
+ sleep 0.5
+ counter=41
+ clickhouse-client --query 'SELECT 1'
Code: 210. DB::NetException: Connection refused (localhost:9000). (NETWORK_ERROR)
+ '[' 41 -gt 120 ']'
+ clickhouse start --user root
+ sleep 0.5
+ counter=42
+ clickhouse-client --query 'SELECT 1'
Code: 210. DB::NetException: Connection refused (localhost:9000). (NETWORK_ERROR)
+ '[' 42 -gt 120 ']'
+ clickhouse start --user root
+ sleep 0.5
+ counter=43
+ clickhouse-client --query 'SELECT 1'
Code: 210. DB::NetException: Connection refused (localhost:9000). (NETWORK_ERROR)
+ '[' 43 -gt 120 ']'
+ clickhouse start --user root
+ sleep 0.5
+ counter=44
+ clickhouse-client --query 'SELECT 1'
Code: 210. DB::NetException: Connection refused (localhost:9000). (NETWORK_ERROR)
+ '[' 44 -gt 120 ']'
+ clickhouse start --user root
+ sleep 0.5
+ counter=45
+ clickhouse-client --query 'SELECT 1'
Code: 210. DB::NetException: Connection refused (localhost:9000). (NETWORK_ERROR)
+ '[' 45 -gt 120 ']'
+ clickhouse start --user root
+ sleep 0.5
+ counter=46
+ clickhouse-client --query 'SELECT 1'
Code: 210. DB::NetException: Connection refused (localhost:9000). (NETWORK_ERROR)
+ '[' 46 -gt 120 ']'
+ clickhouse start --user root
+ sleep 0.5
+ counter=47
+ clickhouse-client --query 'SELECT 1'
Code: 210. DB::NetException: Connection refused (localhost:9000). (NETWORK_ERROR)
+ '[' 47 -gt 120 ']'
+ clickhouse start --user root
+ sleep 0.5
+ counter=48
+ clickhouse-client --query 'SELECT 1'
Code: 210. DB::NetException: Connection refused (localhost:9000). (NETWORK_ERROR)
+ '[' 48 -gt 120 ']'
+ clickhouse start --user root
+ sleep 0.5
+ counter=49
+ clickhouse-client --query 'SELECT 1'
Code: 210. DB::NetException: Connection refused (localhost:9000). (NETWORK_ERROR)
+ '[' 49 -gt 120 ']'
+ clickhouse start --user root
+ sleep 0.5
+ counter=50
+ clickhouse-client --query 'SELECT 1'
Code: 210. DB::NetException: Connection refused (localhost:9000). (NETWORK_ERROR)
+ '[' 50 -gt 120 ']'
+ clickhouse start --user root
+ sleep 0.5
+ counter=51
+ clickhouse-client --query 'SELECT 1'
Code: 210. DB::NetException: Connection refused (localhost:9000). (NETWORK_ERROR)
+ '[' 51 -gt 120 ']'
+ clickhouse start --user root
+ sleep 0.5
+ counter=52
+ clickhouse-client --query 'SELECT 1'
1
+ attach_gdb_to_clickhouse
++ kill -l SIGRTMIN
+ RTMIN=34
+ echo '
set follow-fork-mode parent
handle SIGHUP nostop noprint pass
handle SIGINT nostop noprint pass
handle SIGQUIT nostop noprint pass
handle SIGPIPE nostop noprint pass
handle SIGTERM nostop noprint pass
handle SIGUSR1 nostop noprint pass
handle SIGUSR2 nostop noprint pass
handle SIG34 nostop noprint pass
info signals
continue
backtrace full
thread apply all backtrace full
info registers
disassemble /s
up
disassemble /s
up
disassemble /s
p "done"
detach
quit
'
+ sleep 5
+ ts '%Y-%m-%d %H:%M:%S'
++ cat /var/run/clickhouse-server/clickhouse-server.pid
+ gdb -batch -command script.gdb -p 987
+ run_with_retry 60 clickhouse-client --query 'SELECT '\''Connected to clickhouse-server after attaching gdb'\'''
+ [[ hxB =~ e ]]
+ set_e=false
+ set +e
+ local total_retries=60
+ shift
+ local retry=0
+ '[' 0 -ge 60 ']'
+ clickhouse-client --query 'SELECT '\''Connected to clickhouse-server after attaching gdb'\'''
warning: Missing auto-load script at offset 0 in section .debug_gdb_scripts
of file /usr/bin/clickhouse.
Use `info auto-load python-scripts [REGEXP]' to list them.
Connected to clickhouse-server after attaching gdb
+ false
+ return
+ clickhouse-client --query 'SHOW TABLES FROM datasets'
hits_v1
visits_v1
+ clickhouse-client --query 'SHOW TABLES FROM test'
+ clickhouse-client --query 'CREATE TABLE test.hits_s3 (WatchID UInt64, JavaEnable UInt8, Title String, GoodEvent Int16,
EventTime DateTime, EventDate Date, CounterID UInt32, ClientIP UInt32, ClientIP6 FixedString(16), RegionID UInt32,
UserID UInt64, CounterClass Int8, OS UInt8, UserAgent UInt8, URL String, Referer String, URLDomain String, RefererDomain String,
Refresh UInt8, IsRobot UInt8, RefererCategories Array(UInt16), URLCategories Array(UInt16), URLRegions Array(UInt32),
RefererRegions Array(UInt32), ResolutionWidth UInt16, ResolutionHeight UInt16, ResolutionDepth UInt8, FlashMajor UInt8,
FlashMinor UInt8, FlashMinor2 String, NetMajor UInt8, NetMinor UInt8, UserAgentMajor UInt16, UserAgentMinor FixedString(2),
CookieEnable UInt8, JavascriptEnable UInt8, IsMobile UInt8, MobilePhone UInt8, MobilePhoneModel String, Params String,
IPNetworkID UInt32, TraficSourceID Int8, SearchEngineID UInt16, SearchPhrase String, AdvEngineID UInt8, IsArtifical UInt8,
WindowClientWidth UInt16, WindowClientHeight UInt16, ClientTimeZone Int16, ClientEventTime DateTime, SilverlightVersion1 UInt8,
SilverlightVersion2 UInt8, SilverlightVersion3 UInt32, SilverlightVersion4 UInt16, PageCharset String, CodeVersion UInt32,
IsLink UInt8, IsDownload UInt8, IsNotBounce UInt8, FUniqID UInt64, HID UInt32, IsOldCounter UInt8, IsEvent UInt8,
IsParameter UInt8, DontCountHits UInt8, WithHash UInt8, HitColor FixedString(1), UTCEventTime DateTime, Age UInt8,
Sex UInt8, Income UInt8, Interests UInt16, Robotness UInt8, GeneralInterests Array(UInt16), RemoteIP UInt32,
RemoteIP6 FixedString(16), WindowName Int32, OpenerName Int32, HistoryLength Int16, BrowserLanguage FixedString(2),
BrowserCountry FixedString(2), SocialNetwork String, SocialAction String, HTTPError UInt16, SendTiming Int32,
DNSTiming Int32, ConnectTiming Int32, ResponseStartTiming Int32, ResponseEndTiming Int32, FetchTiming Int32,
RedirectTiming Int32, DOMInteractiveTiming Int32, DOMContentLoadedTiming Int32, DOMCompleteTiming Int32,
LoadEventStartTiming Int32, LoadEventEndTiming Int32, NSToDOMContentLoadedTiming Int32, FirstPaintTiming Int32,
RedirectCount Int8, SocialSourceNetworkID UInt8, SocialSourcePage String, ParamPrice Int64, ParamOrderID String,
ParamCurrency FixedString(3), ParamCurrencyID UInt16, GoalsReached Array(UInt32), OpenstatServiceName String,
OpenstatCampaignID String, OpenstatAdID String, OpenstatSourceID String, UTMSource String, UTMMedium String,
UTMCampaign String, UTMContent String, UTMTerm String, FromTag String, HasGCLID UInt8, RefererHash UInt64,
URLHash UInt64, CLID UInt32, YCLID UInt64, ShareService String, ShareURL String, ShareTitle String,
ParsedParams Nested(Key1 String, Key2 String, Key3 String, Key4 String, Key5 String, ValueDouble Float64),
IslandID FixedString(16), RequestNum UInt32, RequestTry UInt8) ENGINE = MergeTree() PARTITION BY toYYYYMM(EventDate)
ORDER BY (CounterID, EventDate, intHash32(UserID)) SAMPLE BY intHash32(UserID) SETTINGS index_granularity = 8192, storage_policy='\''s3_cache'\'''
+ clickhouse-client --query 'CREATE TABLE test.hits (WatchID UInt64, JavaEnable UInt8, Title String, GoodEvent Int16,
EventTime DateTime, EventDate Date, CounterID UInt32, ClientIP UInt32, ClientIP6 FixedString(16), RegionID UInt32,
UserID UInt64, CounterClass Int8, OS UInt8, UserAgent UInt8, URL String, Referer String, URLDomain String,
RefererDomain String, Refresh UInt8, IsRobot UInt8, RefererCategories Array(UInt16), URLCategories Array(UInt16),
URLRegions Array(UInt32), RefererRegions Array(UInt32), ResolutionWidth UInt16, ResolutionHeight UInt16, ResolutionDepth UInt8,
FlashMajor UInt8, FlashMinor UInt8, FlashMinor2 String, NetMajor UInt8, NetMinor UInt8, UserAgentMajor UInt16,
UserAgentMinor FixedString(2), CookieEnable UInt8, JavascriptEnable UInt8, IsMobile UInt8, MobilePhone UInt8,
MobilePhoneModel String, Params String, IPNetworkID UInt32, TraficSourceID Int8, SearchEngineID UInt16,
SearchPhrase String, AdvEngineID UInt8, IsArtifical UInt8, WindowClientWidth UInt16, WindowClientHeight UInt16,
ClientTimeZone Int16, ClientEventTime DateTime, SilverlightVersion1 UInt8, SilverlightVersion2 UInt8, SilverlightVersion3 UInt32,
SilverlightVersion4 UInt16, PageCharset String, CodeVersion UInt32, IsLink UInt8, IsDownload UInt8, IsNotBounce UInt8,
FUniqID UInt64, HID UInt32, IsOldCounter UInt8, IsEvent UInt8, IsParameter UInt8, DontCountHits UInt8, WithHash UInt8,
HitColor FixedString(1), UTCEventTime DateTime, Age UInt8, Sex UInt8, Income UInt8, Interests UInt16, Robotness UInt8,
GeneralInterests Array(UInt16), RemoteIP UInt32, RemoteIP6 FixedString(16), WindowName Int32, OpenerName Int32,
HistoryLength Int16, BrowserLanguage FixedString(2), BrowserCountry FixedString(2), SocialNetwork String, SocialAction String,
HTTPError UInt16, SendTiming Int32, DNSTiming Int32, ConnectTiming Int32, ResponseStartTiming Int32, ResponseEndTiming Int32,
FetchTiming Int32, RedirectTiming Int32, DOMInteractiveTiming Int32, DOMContentLoadedTiming Int32, DOMCompleteTiming Int32,
LoadEventStartTiming Int32, LoadEventEndTiming Int32, NSToDOMContentLoadedTiming Int32, FirstPaintTiming Int32,
RedirectCount Int8, SocialSourceNetworkID UInt8, SocialSourcePage String, ParamPrice Int64, ParamOrderID String,
ParamCurrency FixedString(3), ParamCurrencyID UInt16, GoalsReached Array(UInt32), OpenstatServiceName String,
OpenstatCampaignID String, OpenstatAdID String, OpenstatSourceID String, UTMSource String, UTMMedium String,
UTMCampaign String, UTMContent String, UTMTerm String, FromTag String, HasGCLID UInt8, RefererHash UInt64,
URLHash UInt64, CLID UInt32, YCLID UInt64, ShareService String, ShareURL String, ShareTitle String,
ParsedParams Nested(Key1 String, Key2 String, Key3 String, Key4 String, Key5 String, ValueDouble Float64),
IslandID FixedString(16), RequestNum UInt32, RequestTry UInt8) ENGINE = MergeTree() PARTITION BY toYYYYMM(EventDate)
ORDER BY (CounterID, EventDate, intHash32(UserID)) SAMPLE BY intHash32(UserID) SETTINGS index_granularity = 8192, storage_policy='\''s3_cache'\'''
+ clickhouse-client --query 'CREATE TABLE test.visits (CounterID UInt32, StartDate Date, Sign Int8, IsNew UInt8,
VisitID UInt64, UserID UInt64, StartTime DateTime, Duration UInt32, UTCStartTime DateTime, PageViews Int32,
Hits Int32, IsBounce UInt8, Referer String, StartURL String, RefererDomain String, StartURLDomain String,
EndURL String, LinkURL String, IsDownload UInt8, TraficSourceID Int8, SearchEngineID UInt16, SearchPhrase String,
AdvEngineID UInt8, PlaceID Int32, RefererCategories Array(UInt16), URLCategories Array(UInt16), URLRegions Array(UInt32),
RefererRegions Array(UInt32), IsYandex UInt8, GoalReachesDepth Int32, GoalReachesURL Int32, GoalReachesAny Int32,
SocialSourceNetworkID UInt8, SocialSourcePage String, MobilePhoneModel String, ClientEventTime DateTime, RegionID UInt32,
ClientIP UInt32, ClientIP6 FixedString(16), RemoteIP UInt32, RemoteIP6 FixedString(16), IPNetworkID UInt32,
SilverlightVersion3 UInt32, CodeVersion UInt32, ResolutionWidth UInt16, ResolutionHeight UInt16, UserAgentMajor UInt16,
UserAgentMinor UInt16, WindowClientWidth UInt16, WindowClientHeight UInt16, SilverlightVersion2 UInt8, SilverlightVersion4 UInt16,
FlashVersion3 UInt16, FlashVersion4 UInt16, ClientTimeZone Int16, OS UInt8, UserAgent UInt8, ResolutionDepth UInt8,
FlashMajor UInt8, FlashMinor UInt8, NetMajor UInt8, NetMinor UInt8, MobilePhone UInt8, SilverlightVersion1 UInt8,
Age UInt8, Sex UInt8, Income UInt8, JavaEnable UInt8, CookieEnable UInt8, JavascriptEnable UInt8, IsMobile UInt8,
BrowserLanguage UInt16, BrowserCountry UInt16, Interests UInt16, Robotness UInt8, GeneralInterests Array(UInt16),
Params Array(String), Goals Nested(ID UInt32, Serial UInt32, EventTime DateTime, Price Int64, OrderID String, CurrencyID UInt32),
WatchIDs Array(UInt64), ParamSumPrice Int64, ParamCurrency FixedString(3), ParamCurrencyID UInt16, ClickLogID UInt64,
ClickEventID Int32, ClickGoodEvent Int32, ClickEventTime DateTime, ClickPriorityID Int32, ClickPhraseID Int32, ClickPageID Int32,
ClickPlaceID Int32, ClickTypeID Int32, ClickResourceID Int32, ClickCost UInt32, ClickClientIP UInt32, ClickDomainID UInt32,
ClickURL String, ClickAttempt UInt8, ClickOrderID UInt32, ClickBannerID UInt32, ClickMarketCategoryID UInt32, ClickMarketPP UInt32,
ClickMarketCategoryName String, ClickMarketPPName String, ClickAWAPSCampaignName String, ClickPageName String, ClickTargetType UInt16,
ClickTargetPhraseID UInt64, ClickContextType UInt8, ClickSelectType Int8, ClickOptions String, ClickGroupBannerID Int32,
OpenstatServiceName String, OpenstatCampaignID String, OpenstatAdID String, OpenstatSourceID String, UTMSource String,
UTMMedium String, UTMCampaign String, UTMContent String, UTMTerm String, FromTag String, HasGCLID UInt8, FirstVisit DateTime,
PredLastVisit Date, LastVisit Date, TotalVisits UInt32, TraficSource Nested(ID Int8, SearchEngineID UInt16, AdvEngineID UInt8,
PlaceID UInt16, SocialSourceNetworkID UInt8, Domain String, SearchPhrase String, SocialSourcePage String), Attendance FixedString(16),
CLID UInt32, YCLID UInt64, NormalizedRefererHash UInt64, SearchPhraseHash UInt64, RefererDomainHash UInt64, NormalizedStartURLHash UInt64,
StartURLDomainHash UInt64, NormalizedEndURLHash UInt64, TopLevelDomain UInt64, URLScheme UInt64, OpenstatServiceNameHash UInt64,
OpenstatCampaignIDHash UInt64, OpenstatAdIDHash UInt64, OpenstatSourceIDHash UInt64, UTMSourceHash UInt64, UTMMediumHash UInt64,
UTMCampaignHash UInt64, UTMContentHash UInt64, UTMTermHash UInt64, FromHash UInt64, WebVisorEnabled UInt8, WebVisorActivity UInt32,
ParsedParams Nested(Key1 String, Key2 String, Key3 String, Key4 String, Key5 String, ValueDouble Float64),
Market Nested(Type UInt8, GoalID UInt32, OrderID String, OrderPrice Int64, PP UInt32, DirectPlaceID UInt32, DirectOrderID UInt32,
DirectBannerID UInt32, GoodID String, GoodName String, GoodQuantity Int32, GoodPrice Int64), IslandID FixedString(16))
ENGINE = CollapsingMergeTree(Sign) PARTITION BY toYYYYMM(StartDate) ORDER BY (CounterID, StartDate, intHash32(UserID), VisitID)
SAMPLE BY intHash32(UserID) SETTINGS index_granularity = 8192, storage_policy='\''s3_cache'\'''
+ clickhouse-client --query 'INSERT INTO test.hits_s3 SELECT * FROM datasets.hits_v1 SETTINGS enable_filesystem_cache_on_write_operations=0'
+ clickhouse-client --query 'INSERT INTO test.hits SELECT * FROM datasets.hits_v1 SETTINGS enable_filesystem_cache_on_write_operations=0'
+ clickhouse-client --query 'INSERT INTO test.visits SELECT * FROM datasets.visits_v1 SETTINGS enable_filesystem_cache_on_write_operations=0'
+ clickhouse-client --query 'DROP TABLE datasets.visits_v1 SYNC'
+ clickhouse-client --query 'DROP TABLE datasets.hits_v1 SYNC'
+ clickhouse-client --query 'SHOW TABLES FROM test'
hits
hits_s3
visits
+ clickhouse-client --query 'SYSTEM STOP THREAD FUZZER'
+ stop
+ local max_tries=90
+ local check_hang=true
+ local pid
++ cat /var/run/clickhouse-server/clickhouse-server.pid
+ pid=987
+ clickhouse stop --max-tries 90 --do-not-kill
script.gdb:13: Error in sourced command file:
No stack.
/var/run/clickhouse-server/clickhouse-server.pid file exists and contains pid = 987.
The process with pid = 987 is running.
Sent terminate signal to process with pid 987.
Waiting for server to stop
/var/run/clickhouse-server/clickhouse-server.pid file exists and contains pid = 987.
The process with pid = 987 is running.
Waiting for server to stop
/var/run/clickhouse-server/clickhouse-server.pid file exists and contains pid = 987.
The process with pid = 987 is running.
Waiting for server to stop
/var/run/clickhouse-server/clickhouse-server.pid file exists and contains pid = 987.
The process with pid = 987 is running.
Waiting for server to stop
/var/run/clickhouse-server/clickhouse-server.pid file exists and contains pid = 987.
The process with pid = 987 is running.
Waiting for server to stop
/var/run/clickhouse-server/clickhouse-server.pid file exists and contains pid = 987.
The process with pid = 987 is running.
Waiting for server to stop
/var/run/clickhouse-server/clickhouse-server.pid file exists and contains pid = 987.
The process with pid = 987 is running.
Waiting for server to stop
/var/run/clickhouse-server/clickhouse-server.pid file exists and contains pid = 987.
The process with pid = 987 is running.
Waiting for server to stop
/var/run/clickhouse-server/clickhouse-server.pid file exists and contains pid = 987.
The process with pid = 987 is running.
Waiting for server to stop
/var/run/clickhouse-server/clickhouse-server.pid file exists and contains pid = 987.
The process with pid = 987 is running.
Waiting for server to stop
/var/run/clickhouse-server/clickhouse-server.pid file exists and contains pid = 987.
The process with pid = 987 is running.
Waiting for server to stop
/var/run/clickhouse-server/clickhouse-server.pid file exists and contains pid = 987.
The process with pid = 987 is running.
Waiting for server to stop
/var/run/clickhouse-server/clickhouse-server.pid file exists and contains pid = 987.
The process with pid = 987 is running.
Waiting for server to stop
/var/run/clickhouse-server/clickhouse-server.pid file exists and contains pid = 987.
The process with pid = 987 is running.
Waiting for server to stop
/var/run/clickhouse-server/clickhouse-server.pid file exists and contains pid = 987.
The process with pid = 987 is running.
Waiting for server to stop
/var/run/clickhouse-server/clickhouse-server.pid file exists and contains pid = 987.
The process with pid = 987 is running.
Waiting for server to stop
/var/run/clickhouse-server/clickhouse-server.pid file exists and contains pid = 987.
The process with pid = 987 is running.
Waiting for server to stop
/var/run/clickhouse-server/clickhouse-server.pid file exists and contains pid = 987.
The process with pid = 987 is running.
Waiting for server to stop
Found pid = 987 in the list of running processes.
The process with pid = 987 is running.
Waiting for server to stop
Now there is no clickhouse-server process.
Server stopped
+ return
+ export USE_S3_STORAGE_FOR_MERGE_TREE=1
+ USE_S3_STORAGE_FOR_MERGE_TREE=1
+ export ZOOKEEPER_FAULT_INJECTION=1
+ ZOOKEEPER_FAULT_INJECTION=1
+ configure
+ export USE_DATABASE_ORDINARY=1
+ USE_DATABASE_ORDINARY=1
+ export EXPORT_S3_STORAGE_POLICIES=1
+ EXPORT_S3_STORAGE_POLICIES=1
+ /usr/share/clickhouse-test/config/install.sh
+ DEST_SERVER_PATH=/etc/clickhouse-server
+ DEST_CLIENT_PATH=/etc/clickhouse-client
+++ dirname /usr/share/clickhouse-test/config/install.sh
++ cd /usr/share/clickhouse-test/config
++ pwd -P
Going to install test configs from /usr/share/clickhouse-test/config into /etc/clickhouse-server
+ SRC_PATH=/usr/share/clickhouse-test/config
+ echo 'Going to install test configs from /usr/share/clickhouse-test/config into /etc/clickhouse-server'
+ mkdir -p /etc/clickhouse-server/config.d/
+ mkdir -p /etc/clickhouse-server/users.d/
+ mkdir -p /etc/clickhouse-client
+ ln -sf /usr/share/clickhouse-test/config/config.d/zookeeper_write.xml /etc/clickhouse-server/config.d/
+ ln -sf /usr/share/clickhouse-test/config/config.d/listen.xml /etc/clickhouse-server/config.d/
+ ln -sf /usr/share/clickhouse-test/config/config.d/text_log.xml /etc/clickhouse-server/config.d/
+ ln -sf /usr/share/clickhouse-test/config/config.d/custom_settings_prefixes.xml /etc/clickhouse-server/config.d/
+ ln -sf /usr/share/clickhouse-test/config/config.d/enable_access_control_improvements.xml /etc/clickhouse-server/config.d/
+ ln -sf /usr/share/clickhouse-test/config/config.d/macros.xml /etc/clickhouse-server/config.d/
+ ln -sf /usr/share/clickhouse-test/config/config.d/disks.xml /etc/clickhouse-server/config.d/
+ ln -sf /usr/share/clickhouse-test/config/config.d/secure_ports.xml /etc/clickhouse-server/config.d/
+ ln -sf /usr/share/clickhouse-test/config/config.d/clusters.xml /etc/clickhouse-server/config.d/
+ ln -sf /usr/share/clickhouse-test/config/config.d/graphite.xml /etc/clickhouse-server/config.d/
+ ln -sf /usr/share/clickhouse-test/config/config.d/database_atomic.xml /etc/clickhouse-server/config.d/
+ ln -sf /usr/share/clickhouse-test/config/config.d/max_concurrent_queries.xml /etc/clickhouse-server/config.d/
+ ln -sf /usr/share/clickhouse-test/config/config.d/merge_tree_settings.xml /etc/clickhouse-server/config.d/
+ ln -sf /usr/share/clickhouse-test/config/config.d/merge_tree_old_dirs_cleanup.xml /etc/clickhouse-server/config.d/
+ ln -sf /usr/share/clickhouse-test/config/config.d/test_cluster_with_incorrect_pw.xml /etc/clickhouse-server/config.d/
+ ln -sf /usr/share/clickhouse-test/config/config.d/keeper_port.xml /etc/clickhouse-server/config.d/
+ ln -sf /usr/share/clickhouse-test/config/config.d/logging_no_rotate.xml /etc/clickhouse-server/config.d/
+ ln -sf /usr/share/clickhouse-test/config/config.d/merge_tree.xml /etc/clickhouse-server/config.d/
+ ln -sf /usr/share/clickhouse-test/config/config.d/lost_forever_check.xml /etc/clickhouse-server/config.d/
+ ln -sf /usr/share/clickhouse-test/config/config.d/metadata_cache.xml /etc/clickhouse-server/config.d/
+ ln -sf /usr/share/clickhouse-test/config/config.d/tcp_with_proxy.xml /etc/clickhouse-server/config.d/
+ ln -sf /usr/share/clickhouse-test/config/config.d/prometheus.xml /etc/clickhouse-server/config.d/
+ ln -sf /usr/share/clickhouse-test/config/config.d/top_level_domains_lists.xml /etc/clickhouse-server/config.d/
+ ln -sf /usr/share/clickhouse-test/config/config.d/top_level_domains_path.xml /etc/clickhouse-server/config.d/
+ ln -sf /usr/share/clickhouse-test/config/config.d/transactions.xml /etc/clickhouse-server/config.d/
+ ln -sf /usr/share/clickhouse-test/config/config.d/encryption.xml /etc/clickhouse-server/config.d/
+ ln -sf /usr/share/clickhouse-test/config/config.d/CORS.xml /etc/clickhouse-server/config.d/
+ ln -sf /usr/share/clickhouse-test/config/config.d/zookeeper_log.xml /etc/clickhouse-server/config.d/
+ ln -sf /usr/share/clickhouse-test/config/config.d/logger_trace.xml /etc/clickhouse-server/config.d/
+ ln -sf /usr/share/clickhouse-test/config/config.d/named_collection.xml /etc/clickhouse-server/config.d/
+ ln -sf /usr/share/clickhouse-test/config/config.d/ssl_certs.xml /etc/clickhouse-server/config.d/
+ ln -sf /usr/share/clickhouse-test/config/config.d/filesystem_cache_log.xml /etc/clickhouse-server/config.d/
+ ln -sf /usr/share/clickhouse-test/config/config.d/session_log.xml /etc/clickhouse-server/config.d/
+ ln -sf /usr/share/clickhouse-test/config/config.d/system_unfreeze.xml /etc/clickhouse-server/config.d/
+ ln -sf /usr/share/clickhouse-test/config/config.d/enable_zero_copy_replication.xml /etc/clickhouse-server/config.d/
+ ln -sf /usr/share/clickhouse-test/config/config.d/nlp.xml /etc/clickhouse-server/config.d/
+ ln -sf /usr/share/clickhouse-test/config/config.d/forbidden_headers.xml /etc/clickhouse-server/config.d/
+ ln -sf /usr/share/clickhouse-test/config/config.d/enable_keeper_map.xml /etc/clickhouse-server/config.d/
+ ln -sf /usr/share/clickhouse-test/config/config.d/custom_disks_base_path.xml /etc/clickhouse-server/config.d/
+ ln -sf /usr/share/clickhouse-test/config/config.d/display_name.xml /etc/clickhouse-server/config.d/
+ ln -sf /usr/share/clickhouse-test/config/config.d/reverse_dns_query_function.xml /etc/clickhouse-server/config.d/
+ ln -sf /usr/share/clickhouse-test/config/config.d/compressed_marks_and_index.xml /etc/clickhouse-server/config.d/
+ ln -sf /usr/share/clickhouse-test/config/config.d/disable_s3_env_credentials.xml /etc/clickhouse-server/config.d/
+ ln -sf /usr/share/clickhouse-test/config/config.d/enable_wait_for_shutdown_replicated_tables.xml /etc/clickhouse-server/config.d/
+ ln -sf /usr/share/clickhouse-test/config/config.d/backups.xml /etc/clickhouse-server/config.d/
+ ln -sf /usr/share/clickhouse-test/config/config.d/filesystem_caches_path.xml /etc/clickhouse-server/config.d/
+ ln -sf /usr/share/clickhouse-test/config/config.d/validate_tcp_client_information.xml /etc/clickhouse-server/config.d/
+ '[' /etc/clickhouse-server = /etc/clickhouse-server ']'
+ ln -sf /usr/share/clickhouse-test/config/config.d/legacy_geobase.xml /etc/clickhouse-server/config.d/
+ ln -sf /usr/share/clickhouse-test/config/users.d/log_queries.xml /etc/clickhouse-server/users.d/
+ ln -sf /usr/share/clickhouse-test/config/users.d/readonly.xml /etc/clickhouse-server/users.d/
+ ln -sf /usr/share/clickhouse-test/config/users.d/access_management.xml /etc/clickhouse-server/users.d/
+ ln -sf /usr/share/clickhouse-test/config/users.d/database_atomic_drop_detach_sync.xml /etc/clickhouse-server/users.d/
+ ln -sf /usr/share/clickhouse-test/config/users.d/opentelemetry.xml /etc/clickhouse-server/users.d/
+ ln -sf /usr/share/clickhouse-test/config/users.d/remote_queries.xml /etc/clickhouse-server/users.d/
+ ln -sf /usr/share/clickhouse-test/config/users.d/session_log_test.xml /etc/clickhouse-server/users.d/
+ ln -sf /usr/share/clickhouse-test/config/users.d/memory_profiler.xml /etc/clickhouse-server/users.d/
+ ln -sf /usr/share/clickhouse-test/config/users.d/no_fsync_metadata.xml /etc/clickhouse-server/users.d/
+ ln -sf /usr/share/clickhouse-test/config/users.d/filelog.xml /etc/clickhouse-server/users.d/
+ ln -sf /usr/share/clickhouse-test/config/users.d/enable_blobs_check.xml /etc/clickhouse-server/users.d/
+ ln -sf /usr/share/clickhouse-test/config/users.d/marks.xml /etc/clickhouse-server/users.d/
+ ln -sf /usr/share/clickhouse-test/config/users.d/insert_keeper_retries.xml /etc/clickhouse-server/users.d/
+ ln -sf /usr/share/clickhouse-test/config/users.d/prefetch_settings.xml /etc/clickhouse-server/users.d/
+ ln -sf /usr/share/clickhouse-test/config/users.d/nonconst_timezone.xml /etc/clickhouse-server/users.d/
+ [[ -n '' ]]
+ ln -sf /usr/share/clickhouse-test/config/users.d/timeouts.xml /etc/clickhouse-server/users.d/
+ ln -sf /usr/share/clickhouse-test/config/ints_dictionary.xml /etc/clickhouse-server/
+ ln -sf /usr/share/clickhouse-test/config/strings_dictionary.xml /etc/clickhouse-server/
+ ln -sf /usr/share/clickhouse-test/config/decimals_dictionary.xml /etc/clickhouse-server/
+ ln -sf /usr/share/clickhouse-test/config/executable_dictionary.xml /etc/clickhouse-server/
+ ln -sf /usr/share/clickhouse-test/config/executable_pool_dictionary.xml /etc/clickhouse-server/
+ ln -sf /usr/share/clickhouse-test/config/test_function.xml /etc/clickhouse-server/
+ ln -sf /usr/share/clickhouse-test/config/top_level_domains /etc/clickhouse-server/
+ ln -sf /usr/share/clickhouse-test/config/regions_hierarchy.txt /etc/clickhouse-server/config.d/
+ ln -sf /usr/share/clickhouse-test/config/regions_names_en.txt /etc/clickhouse-server/config.d/
+ ln -sf /usr/share/clickhouse-test/config/ext-en.txt /etc/clickhouse-server/config.d/
+ ln -sf /usr/share/clickhouse-test/config/ext-ru.txt /etc/clickhouse-server/config.d/
+ ln -sf /usr/share/clickhouse-test/config/lem-en.bin /etc/clickhouse-server/config.d/
+ ln -sf /usr/share/clickhouse-test/config/server.key /etc/clickhouse-server/
+ ln -sf /usr/share/clickhouse-test/config/server.crt /etc/clickhouse-server/
+ ln -sf /usr/share/clickhouse-test/config/dhparam.pem /etc/clickhouse-server/
+ ln -sf --backup=simple --suffix=_original.xml /usr/share/clickhouse-test/config/config.d/query_masking_rules.xml /etc/clickhouse-server/config.d/
+ [[ -n 1 ]]
+ [[ 1 -eq 1 ]]
+ rm -f /etc/clickhouse-server/config.d/zookeeper.xml
+ ln -sf /usr/share/clickhouse-test/config/config.d/zookeeper_fault_injection.xml /etc/clickhouse-server/config.d/
+ create_snapshot_on_exit=0
+ sed --follow-symlinks -i 's|true|0|' /etc/clickhouse-server/config.d/keeper_port.xml
+ [[ -n '' ]]
+ [[ -n 1 ]]
+ [[ 1 -eq 1 ]]
+ ln -sf /usr/share/clickhouse-test/config/users.d/database_ordinary.xml /etc/clickhouse-server/users.d/
+ [[ -n 1 ]]
+ [[ 1 -eq 1 ]]
+ ln -sf /usr/share/clickhouse-test/config/config.d/s3_storage_policy_by_default.xml /etc/clickhouse-server/config.d/
+ ARM=aarch64
++ uname -m
+ OS=x86_64
x86_64
Adding azure configuration
+ [[ -n 1 ]]
+ echo x86_64
+ [[ '' -eq 1 ]]
+ [[ x86_64 == \a\a\r\c\h\6\4 ]]
+ echo 'Adding azure configuration'
+ ln -sf /usr/share/clickhouse-test/config/config.d/azure_storage_conf.xml /etc/clickhouse-server/config.d/
+ ln -sf /usr/share/clickhouse-test/config/config.d/storage_conf.xml /etc/clickhouse-server/config.d/
+ ln -sf /usr/share/clickhouse-test/config/users.d/s3_cache.xml /etc/clickhouse-server/users.d/
+ [[ -n '' ]]
+ ln -sf /usr/share/clickhouse-test/config/client_config.xml /etc/clickhouse-client/config.xml
+ sudo cat /etc/clickhouse-server/config.d/keeper_port.xml
+ sed 's|100000|10000|'
+ sudo mv /etc/clickhouse-server/config.d/keeper_port.xml.tmp /etc/clickhouse-server/config.d/keeper_port.xml
+ sudo chown clickhouse /etc/clickhouse-server/config.d/keeper_port.xml
+ sudo chgrp clickhouse /etc/clickhouse-server/config.d/keeper_port.xml
+ echo 'ASAN_OPTIONS='\''malloc_context_size=10 verbosity=1 allocator_release_to_os_interval_ms=10000'\'''
+ export 'ASAN_OPTIONS=malloc_context_size=10 allocator_release_to_os_interval_ms=10000'
+ ASAN_OPTIONS='malloc_context_size=10 allocator_release_to_os_interval_ms=10000'
+ sudo chown root: /var/lib/clickhouse
+ echo '1'
+ local total_mem
++ awk '/MemTotal/ { print $(NF-1) }' /proc/meminfo
+ total_mem=32080796
+ total_mem=32850735104
+ max_server_memory_usage_to_ram_ratio=0.5
+ echo 'Setting max_server_memory_usage_to_ram_ratio to 0.5'
+ cat
Setting max_server_memory_usage_to_ram_ratio to 0.5
Setting max_memory_usage_for_user=9855220531 and max_memory_usage for queries to 10G
+ local max_users_mem
+ max_users_mem=9855220531
+ echo 'Setting max_memory_usage_for_user=9855220531 and max_memory_usage for queries to 10G'
+ cat
+ cat
+ cat
+ sudo cat /etc/clickhouse-server/config.d/s3_storage_policy_by_default.xml
+ sed 's|s3|s3default|'
+ mv /etc/clickhouse-server/config.d/s3_storage_policy_by_default.xml.tmp /etc/clickhouse-server/config.d/s3_storage_policy_by_default.xml
+ sudo chown clickhouse /etc/clickhouse-server/config.d/s3_storage_policy_by_default.xml
+ sudo chgrp clickhouse /etc/clickhouse-server/config.d/s3_storage_policy_by_default.xml
+ sudo cat /etc/clickhouse-server/config.d/logger_trace.xml
+ sed 's|trace|test|'
+ mv /etc/clickhouse-server/config.d/logger_trace.xml.tmp /etc/clickhouse-server/config.d/logger_trace.xml
+ start
+ counter=0
+ clickhouse-client --query 'SELECT 1'
Code: 210. DB::NetException: Connection refused (localhost:9000). (NETWORK_ERROR)
+ '[' 0 -gt 120 ']'
+ clickhouse start --user root
+ sleep 0.5
+ counter=1
+ clickhouse-client --query 'SELECT 1'
Code: 210. DB::NetException: Connection refused (localhost:9000). (NETWORK_ERROR)
+ '[' 1 -gt 120 ']'
+ clickhouse start --user root
+ sleep 0.5
+ counter=2
+ clickhouse-client --query 'SELECT 1'
Code: 210. DB::NetException: Connection refused (localhost:9000). (NETWORK_ERROR)
+ '[' 2 -gt 120 ']'
+ clickhouse start --user root
+ sleep 0.5
+ counter=3
+ clickhouse-client --query 'SELECT 1'
Code: 210. DB::NetException: Connection refused (localhost:9000). (NETWORK_ERROR)
+ '[' 3 -gt 120 ']'
+ clickhouse start --user root
+ sleep 0.5
+ counter=4
+ clickhouse-client --query 'SELECT 1'
Code: 210. DB::NetException: Connection refused (localhost:9000). (NETWORK_ERROR)
+ '[' 4 -gt 120 ']'
+ clickhouse start --user root
+ sleep 0.5
+ counter=5
+ clickhouse-client --query 'SELECT 1'
Code: 210. DB::NetException: Connection refused (localhost:9000). (NETWORK_ERROR)
+ '[' 5 -gt 120 ']'
+ clickhouse start --user root
+ sleep 0.5
+ counter=6
+ clickhouse-client --query 'SELECT 1'
Code: 210. DB::NetException: Connection refused (localhost:9000). (NETWORK_ERROR)
+ '[' 6 -gt 120 ']'
+ clickhouse start --user root
+ sleep 0.5
+ counter=7
+ clickhouse-client --query 'SELECT 1'
Code: 210. DB::NetException: Connection refused (localhost:9000). (NETWORK_ERROR)
+ '[' 7 -gt 120 ']'
+ clickhouse start --user root
+ sleep 0.5
+ counter=8
+ clickhouse-client --query 'SELECT 1'
Code: 210. DB::NetException: Connection refused (localhost:9000). (NETWORK_ERROR)
+ '[' 8 -gt 120 ']'
+ clickhouse start --user root
+ sleep 0.5
+ counter=9
+ clickhouse-client --query 'SELECT 1'
Code: 210. DB::NetException: Connection refused (localhost:9000). (NETWORK_ERROR)
+ '[' 9 -gt 120 ']'
+ clickhouse start --user root
+ sleep 0.5
+ counter=10
+ clickhouse-client --query 'SELECT 1'
Code: 210. DB::NetException: Connection refused (localhost:9000). (NETWORK_ERROR)
+ '[' 10 -gt 120 ']'
+ clickhouse start --user root
+ sleep 0.5
+ counter=11
+ clickhouse-client --query 'SELECT 1'
Code: 210. DB::NetException: Connection refused (localhost:9000). (NETWORK_ERROR)
+ '[' 11 -gt 120 ']'
+ clickhouse start --user root
+ sleep 0.5
+ counter=12
+ clickhouse-client --query 'SELECT 1'
Code: 210. DB::NetException: Connection refused (localhost:9000). (NETWORK_ERROR)
+ '[' 12 -gt 120 ']'
+ clickhouse start --user root
+ sleep 0.5
+ counter=13
+ clickhouse-client --query 'SELECT 1'
Code: 210. DB::NetException: Connection refused (localhost:9000). (NETWORK_ERROR)
+ '[' 13 -gt 120 ']'
+ clickhouse start --user root
+ sleep 0.5
+ counter=14
+ clickhouse-client --query 'SELECT 1'
Code: 210. DB::NetException: Connection refused (localhost:9000). (NETWORK_ERROR)
+ '[' 14 -gt 120 ']'
+ clickhouse start --user root
+ sleep 0.5
+ counter=15
+ clickhouse-client --query 'SELECT 1'
Code: 210. DB::NetException: Connection refused (localhost:9000). (NETWORK_ERROR)
+ '[' 15 -gt 120 ']'
+ clickhouse start --user root
+ sleep 0.5
+ counter=16
+ clickhouse-client --query 'SELECT 1'
Code: 210. DB::NetException: Connection refused (localhost:9000). (NETWORK_ERROR)
+ '[' 16 -gt 120 ']'
+ clickhouse start --user root
+ sleep 0.5
+ counter=17
+ clickhouse-client --query 'SELECT 1'
Code: 210. DB::NetException: Connection refused (localhost:9000). (NETWORK_ERROR)
+ '[' 17 -gt 120 ']'
+ clickhouse start --user root
+ sleep 0.5
+ counter=18
+ clickhouse-client --query 'SELECT 1'
Code: 210. DB::NetException: Connection refused (localhost:9000). (NETWORK_ERROR)
+ '[' 18 -gt 120 ']'
+ clickhouse start --user root
+ sleep 0.5
+ counter=19
+ clickhouse-client --query 'SELECT 1'
Code: 210. DB::NetException: Connection refused (localhost:9000). (NETWORK_ERROR)
+ '[' 19 -gt 120 ']'
+ clickhouse start --user root
+ sleep 0.5
+ counter=20
+ clickhouse-client --query 'SELECT 1'
Code: 210. DB::NetException: Connection refused (localhost:9000). (NETWORK_ERROR)
+ '[' 20 -gt 120 ']'
+ clickhouse start --user root
+ sleep 0.5
+ counter=21
+ clickhouse-client --query 'SELECT 1'
Code: 210. DB::NetException: Connection refused (localhost:9000). (NETWORK_ERROR)
+ '[' 21 -gt 120 ']'
+ clickhouse start --user root
+ sleep 0.5
+ counter=22
+ clickhouse-client --query 'SELECT 1'
Code: 210. DB::NetException: Connection refused (localhost:9000). (NETWORK_ERROR)
+ '[' 22 -gt 120 ']'
+ clickhouse start --user root
+ sleep 0.5
+ counter=23
+ clickhouse-client --query 'SELECT 1'
Code: 210. DB::NetException: Connection refused (localhost:9000). (NETWORK_ERROR)
+ '[' 23 -gt 120 ']'
+ clickhouse start --user root
+ sleep 0.5
+ counter=24
+ clickhouse-client --query 'SELECT 1'
Code: 210. DB::NetException: Connection refused (localhost:9000). (NETWORK_ERROR)
+ '[' 24 -gt 120 ']'
+ clickhouse start --user root
+ sleep 0.5
+ counter=25
+ clickhouse-client --query 'SELECT 1'
Code: 210. DB::NetException: Connection refused (localhost:9000). (NETWORK_ERROR)
+ '[' 25 -gt 120 ']'
+ clickhouse start --user root
+ sleep 0.5
+ counter=26
+ clickhouse-client --query 'SELECT 1'
Code: 210. DB::NetException: Connection refused (localhost:9000). (NETWORK_ERROR)
+ '[' 26 -gt 120 ']'
+ clickhouse start --user root
+ sleep 0.5
+ counter=27
+ clickhouse-client --query 'SELECT 1'
Code: 210. DB::NetException: Connection refused (localhost:9000). (NETWORK_ERROR)
+ '[' 27 -gt 120 ']'
+ clickhouse start --user root
+ sleep 0.5
+ counter=28
+ clickhouse-client --query 'SELECT 1'
Code: 210. DB::NetException: Connection refused (localhost:9000). (NETWORK_ERROR)
+ '[' 28 -gt 120 ']'
+ clickhouse start --user root
+ sleep 0.5
+ counter=29
+ clickhouse-client --query 'SELECT 1'
Code: 210. DB::NetException: Connection refused (localhost:9000). (NETWORK_ERROR)
+ '[' 29 -gt 120 ']'
+ clickhouse start --user root
+ sleep 0.5
+ counter=30
+ clickhouse-client --query 'SELECT 1'
Code: 210. DB::NetException: Connection refused (localhost:9000). (NETWORK_ERROR)
+ '[' 30 -gt 120 ']'
+ clickhouse start --user root
+ sleep 0.5
+ counter=31
+ clickhouse-client --query 'SELECT 1'
Code: 210. DB::NetException: Connection refused (localhost:9000). (NETWORK_ERROR)
+ '[' 31 -gt 120 ']'
+ clickhouse start --user root
+ sleep 0.5
+ counter=32
+ clickhouse-client --query 'SELECT 1'
Code: 210. DB::NetException: Connection refused (localhost:9000). (NETWORK_ERROR)
+ '[' 32 -gt 120 ']'
+ clickhouse start --user root
+ sleep 0.5
+ counter=33
+ clickhouse-client --query 'SELECT 1'
Code: 210. DB::NetException: Connection refused (localhost:9000). (NETWORK_ERROR)
+ '[' 33 -gt 120 ']'
+ clickhouse start --user root
+ sleep 0.5
+ counter=34
+ clickhouse-client --query 'SELECT 1'
Code: 210. DB::NetException: Connection refused (localhost:9000). (NETWORK_ERROR)
+ '[' 34 -gt 120 ']'
+ clickhouse start --user root
+ sleep 0.5
+ counter=35
+ clickhouse-client --query 'SELECT 1'
Code: 210. DB::NetException: Connection refused (localhost:9000). (NETWORK_ERROR)
+ '[' 35 -gt 120 ']'
+ clickhouse start --user root
+ sleep 0.5
+ counter=36
+ clickhouse-client --query 'SELECT 1'
Code: 210. DB::NetException: Connection refused (localhost:9000). (NETWORK_ERROR)
+ '[' 36 -gt 120 ']'
+ clickhouse start --user root
+ sleep 0.5
+ counter=37
+ clickhouse-client --query 'SELECT 1'
Code: 210. DB::NetException: Connection refused (localhost:9000). (NETWORK_ERROR)
+ '[' 37 -gt 120 ']'
+ clickhouse start --user root
+ sleep 0.5
+ counter=38
+ clickhouse-client --query 'SELECT 1'
Code: 210. DB::NetException: Connection refused (localhost:9000). (NETWORK_ERROR)
+ '[' 38 -gt 120 ']'
+ clickhouse start --user root
+ sleep 0.5
+ counter=39
+ clickhouse-client --query 'SELECT 1'
Code: 210. DB::NetException: Connection refused (localhost:9000). (NETWORK_ERROR)
+ '[' 39 -gt 120 ']'
+ clickhouse start --user root
+ sleep 0.5
+ counter=40
+ clickhouse-client --query 'SELECT 1'
Code: 210. DB::NetException: Connection refused (localhost:9000). (NETWORK_ERROR)
+ '[' 40 -gt 120 ']'
+ clickhouse start --user root
+ sleep 0.5
+ counter=41
+ clickhouse-client --query 'SELECT 1'
Code: 210. DB::NetException: Connection refused (localhost:9000). (NETWORK_ERROR)
+ '[' 41 -gt 120 ']'
+ clickhouse start --user root
+ sleep 0.5
+ counter=42
+ clickhouse-client --query 'SELECT 1'
Code: 210. DB::NetException: Connection refused (localhost:9000). (NETWORK_ERROR)
+ '[' 42 -gt 120 ']'
+ clickhouse start --user root
+ sleep 0.5
+ counter=43
+ clickhouse-client --query 'SELECT 1'
Code: 210. DB::NetException: Connection refused (localhost:9000). (NETWORK_ERROR)
+ '[' 43 -gt 120 ']'
+ clickhouse start --user root
+ sleep 0.5
127.0.0.1 - - [28/Oct/2026:15:28:26 +0000] "PUT /devstoreaccount1/cont?restype=container HTTP/1.1" 409 -
127.0.0.1 - - [28/Oct/2026:15:28:27 +0000] "PUT /devstoreaccount1/cont/hbidvqpmzejlrcrypyxwzkqwszofbjjb?blockid=omqzoikujapmxxbwmdduiduxqgpczermqdtkggnmjiinrmbdivrubspcbwxxkhsw&comp=block HTTP/1.1" 201 -
127.0.0.1 - - [28/Oct/2026:15:28:27 +0000] "PUT /devstoreaccount1/cont/hbidvqpmzejlrcrypyxwzkqwszofbjjb?comp=blocklist HTTP/1.1" 201 -
127.0.0.1 - - [28/Oct/2026:15:28:27 +0000] "GET /devstoreaccount1/cont/hbidvqpmzejlrcrypyxwzkqwszofbjjb HTTP/1.1" 206 4
127.0.0.1 - - [28/Oct/2026:15:28:27 +0000] "GET /devstoreaccount1/cont/hbidvqpmzejlrcrypyxwzkqwszofbjjb HTTP/1.1" 206 2
127.0.0.1 - - [28/Oct/2026:15:28:27 +0000] "DELETE /devstoreaccount1/cont/hbidvqpmzejlrcrypyxwzkqwszofbjjb HTTP/1.1" 202 -
+ counter=44
+ clickhouse-client --query 'SELECT 1'
Code: 210. DB::NetException: Connection refused (localhost:9000). (NETWORK_ERROR)
+ '[' 44 -gt 120 ']'
+ clickhouse start --user root
+ sleep 0.5
+ counter=45
+ clickhouse-client --query 'SELECT 1'
Code: 210. DB::NetException: Connection refused (localhost:9000). (NETWORK_ERROR)
+ '[' 45 -gt 120 ']'
+ clickhouse start --user root
+ sleep 0.5
+ counter=46
+ clickhouse-client --query 'SELECT 1'
Code: 210. DB::NetException: Connection refused (localhost:9000). (NETWORK_ERROR)
+ '[' 46 -gt 120 ']'
+ clickhouse start --user root
+ sleep 0.5
+ counter=47
+ clickhouse-client --query 'SELECT 1'
Code: 210. DB::NetException: Connection refused (localhost:9000). (NETWORK_ERROR)
+ '[' 47 -gt 120 ']'
+ clickhouse start --user root
+ sleep 0.5
+ counter=48
+ clickhouse-client --query 'SELECT 1'
Code: 210. DB::NetException: Connection refused (localhost:9000). (NETWORK_ERROR)
+ '[' 48 -gt 120 ']'
+ clickhouse start --user root
+ sleep 0.5
+ counter=49
+ clickhouse-client --query 'SELECT 1'
Code: 210. DB::NetException: Connection refused (localhost:9000). (NETWORK_ERROR)
+ '[' 49 -gt 120 ']'
+ clickhouse start --user root
+ sleep 0.5
+ counter=50
+ clickhouse-client --query 'SELECT 1'
Code: 210. DB::NetException: Connection refused (localhost:9000). (NETWORK_ERROR)
+ '[' 50 -gt 120 ']'
+ clickhouse start --user root
+ sleep 0.5
+ counter=51
+ clickhouse-client --query 'SELECT 1'
Code: 210. DB::NetException: Connection refused (localhost:9000). (NETWORK_ERROR)
+ '[' 51 -gt 120 ']'
+ clickhouse start --user root
+ sleep 0.5
+ counter=52
+ clickhouse-client --query 'SELECT 1'
Code: 210. DB::NetException: Connection refused (localhost:9000). (NETWORK_ERROR)
+ '[' 52 -gt 120 ']'
+ clickhouse start --user root
+ sleep 0.5
+ counter=53
+ clickhouse-client --query 'SELECT 1'
Code: 210. DB::NetException: Connection refused (localhost:9000). (NETWORK_ERROR)
+ '[' 53 -gt 120 ']'
+ clickhouse start --user root
+ sleep 0.5
+ counter=54
+ clickhouse-client --query 'SELECT 1'
Code: 210. DB::NetException: Connection refused (localhost:9000). (NETWORK_ERROR)
+ '[' 54 -gt 120 ']'
+ clickhouse start --user root
+ sleep 0.5
+ counter=55
+ clickhouse-client --query 'SELECT 1'
Code: 210. DB::NetException: Connection refused (localhost:9000). (NETWORK_ERROR)
+ '[' 55 -gt 120 ']'
+ clickhouse start --user root
+ sleep 0.5
+ counter=56
+ clickhouse-client --query 'SELECT 1'
Code: 210. DB::NetException: Connection refused (localhost:9000). (NETWORK_ERROR)
+ '[' 56 -gt 120 ']'
+ clickhouse start --user root
+ sleep 0.5
+ counter=57
+ clickhouse-client --query 'SELECT 1'
Code: 210. DB::NetException: Connection refused (localhost:9000). (NETWORK_ERROR)
+ '[' 57 -gt 120 ']'
+ clickhouse start --user root
+ sleep 0.5
+ counter=58
+ clickhouse-client --query 'SELECT 1'
Code: 210. DB::NetException: Connection refused (localhost:9000). (NETWORK_ERROR)
+ '[' 58 -gt 120 ']'
+ clickhouse start --user root
+ sleep 0.5
+ counter=59
+ clickhouse-client --query 'SELECT 1'
Code: 210. DB::NetException: Connection refused (localhost:9000). (NETWORK_ERROR)
+ '[' 59 -gt 120 ']'
+ clickhouse start --user root
+ sleep 0.5
+ counter=60
+ clickhouse-client --query 'SELECT 1'
Code: 210. DB::NetException: Connection refused (localhost:9000). (NETWORK_ERROR)
+ '[' 60 -gt 120 ']'
+ clickhouse start --user root
+ sleep 0.5
+ counter=61
+ clickhouse-client --query 'SELECT 1'
Code: 210. DB::NetException: Connection refused (localhost:9000). (NETWORK_ERROR)
+ '[' 61 -gt 120 ']'
+ clickhouse start --user root
+ sleep 0.5
+ counter=62
+ clickhouse-client --query 'SELECT 1'
Code: 210. DB::NetException: Connection refused (localhost:9000). (NETWORK_ERROR)
+ '[' 62 -gt 120 ']'
+ clickhouse start --user root
+ sleep 0.5
+ counter=63
+ clickhouse-client --query 'SELECT 1'
Code: 210. DB::NetException: Connection refused (localhost:9000). (NETWORK_ERROR)
+ '[' 63 -gt 120 ']'
+ clickhouse start --user root
+ sleep 0.5
+ counter=64
+ clickhouse-client --query 'SELECT 1'
Code: 210. DB::NetException: Connection refused (localhost:9000). (NETWORK_ERROR)
+ '[' 64 -gt 120 ']'
+ clickhouse start --user root
+ sleep 0.5
+ counter=65
+ clickhouse-client --query 'SELECT 1'
Code: 210. DB::NetException: Connection refused (localhost:9000). (NETWORK_ERROR)
+ '[' 65 -gt 120 ']'
+ clickhouse start --user root
+ sleep 0.5
+ counter=66
+ clickhouse-client --query 'SELECT 1'
Code: 210. DB::NetException: Connection refused (localhost:9000). (NETWORK_ERROR)
+ '[' 66 -gt 120 ']'
+ clickhouse start --user root
+ sleep 0.5
+ counter=67
+ clickhouse-client --query 'SELECT 1'
Code: 210. DB::NetException: Connection refused (localhost:9000). (NETWORK_ERROR)
+ '[' 67 -gt 120 ']'
+ clickhouse start --user root
+ sleep 0.5
+ counter=68
+ clickhouse-client --query 'SELECT 1'
1
+ attach_gdb_to_clickhouse
++ kill -l SIGRTMIN
+ RTMIN=34
+ echo '
set follow-fork-mode parent
handle SIGHUP nostop noprint pass
handle SIGINT nostop noprint pass
handle SIGQUIT nostop noprint pass
handle SIGPIPE nostop noprint pass
handle SIGTERM nostop noprint pass
handle SIGUSR1 nostop noprint pass
handle SIGUSR2 nostop noprint pass
handle SIG34 nostop noprint pass
info signals
continue
backtrace full
thread apply all backtrace full
info registers
disassemble /s
up
disassemble /s
up
disassemble /s
p "done"
detach
quit
'
+ sleep 5
+ ts '%Y-%m-%d %H:%M:%S'
++ cat /var/run/clickhouse-server/clickhouse-server.pid
+ gdb -batch -command script.gdb -p 1868
+ run_with_retry 60 clickhouse-client --query 'SELECT '\''Connected to clickhouse-server after attaching gdb'\'''
+ [[ hxB =~ e ]]
+ set_e=false
+ set +e
+ local total_retries=60
+ shift
+ local retry=0
+ '[' 0 -ge 60 ']'
+ clickhouse-client --query 'SELECT '\''Connected to clickhouse-server after attaching gdb'\'''
warning: Missing auto-load script at offset 0 in section .debug_gdb_scripts
of file /usr/bin/clickhouse.
Use `info auto-load python-scripts [REGEXP]' to list them.
Connected to clickhouse-server after attaching gdb
+ false
+ return
+ stress --hung-check --drop-databases --output-folder test_output --skip-func-tests '' --global-time-limit 1200
2026-10-28 16:30:15,583 Run func tests '/usr/bin/clickhouse-test --global_time_limit=1200 '
2026-10-28 16:30:16,084 Run func tests '/usr/bin/clickhouse-test --order=random --database=test_1 --client-option join_use_nulls=1 join_algorithm='parallel_hash' memory_tracker_fault_probability=0.001 group_by_use_nulls=1 --global_time_limit=1200 '
2026-10-28 16:30:16,586 Run func tests '/usr/bin/clickhouse-test --order=random --db-engine="Replicated('/test/db/test_2', 's1', 'r1')" --client-option allow_experimental_database_replicated=1 enable_deflate_qpl_codec=1 use_query_cache=1 --global_time_limit=1200 '
2026-10-28 16:30:17,087 Run func tests '/usr/bin/clickhouse-test --order=random --database=test_3 --client-option join_algorithm='partial_merge' use_query_cache=1 group_by_use_nulls=1 --global_time_limit=1200 '
2026-10-28 16:30:17,589 Run func tests '/usr/bin/clickhouse-test --order=random --client-option join_use_nulls=1 --global_time_limit=1200 '
2026-10-28 16:30:18,090 Run func tests '/usr/bin/clickhouse-test --order=random --db-engine="Replicated('/test/db/test_5', 's1', 'r1')" --database=test_5 --client-option allow_experimental_database_replicated=1 enable_deflate_qpl_codec=1 join_algorithm='full_sorting_merge' group_by_use_nulls=1 --global_time_limit=1200 '
2026-10-28 16:30:18,592 Run func tests '/usr/bin/clickhouse-test --order=random --client-option memory_tracker_fault_probability=0.001 --global_time_limit=1200 '
2026-10-28 16:30:19,094 Run func tests '/usr/bin/clickhouse-test --order=random --database=test_7 --client-option join_use_nulls=1 join_algorithm='grace_hash' group_by_use_nulls=1 --global_time_limit=1200 '
2026-10-28 16:30:19,595 Run func tests '/usr/bin/clickhouse-test --order=random --db-engine="Replicated('/test/db/test_8', 's1', 'r1')" --client-option allow_experimental_database_replicated=1 enable_deflate_qpl_codec=1 --global_time_limit=1200 '
2026-10-28 16:30:20,097 Run func tests '/usr/bin/clickhouse-test --order=random --database=test_9 --client-option join_algorithm='auto' max_rows_in_join=1000 group_by_use_nulls=1 --global_time_limit=1200 '
2026-10-28 16:30:20,598 Run func tests '/usr/bin/clickhouse-test --order=random --client-option join_use_nulls=1 --global_time_limit=1200 '
2026-10-28 16:30:21,100 Run func tests '/usr/bin/clickhouse-test --order=random --db-engine="Replicated('/test/db/test_11', 's1', 'r1')" --database=test_11 --client-option allow_experimental_database_replicated=1 enable_deflate_qpl_codec=1 join_algorithm='parallel_hash' memory_tracker_fault_probability=0.001 group_by_use_nulls=1 --global_time_limit=1200 '
2026-10-28 16:30:21,601 Run func tests '/usr/bin/clickhouse-test --order=random --client-option use_query_cache=1 implicit_transaction=1 throw_on_unsupported_query_inside_transaction=0 --global_time_limit=1200 '
2026-10-28 16:30:22,103 Run func tests '/usr/bin/clickhouse-test --order=random --database=test_13 --client-option join_use_nulls=1 join_algorithm='partial_merge' group_by_use_nulls=1 --global_time_limit=1200 '
2026-10-28 16:30:22,604 Run func tests '/usr/bin/clickhouse-test --order=random --db-engine="Replicated('/test/db/test_14', 's1', 'r1')" --client-option allow_experimental_database_replicated=1 enable_deflate_qpl_codec=1 --global_time_limit=1200 '
2026-10-28 16:30:23,106 Run func tests '/usr/bin/clickhouse-test --order=random --database=test_15 --client-option join_algorithm='full_sorting_merge' group_by_use_nulls=1 --global_time_limit=1200 '
2026-10-28 16:30:23,607 Will wait functests to finish
2026-10-28 16:30:23,607 Finished 0 from 16 processes
2026-10-28 16:30:28,610 Finished 0 from 16 processes
2026-10-28 16:30:33,615 Finished 0 from 16 processes
2026-10-28 16:30:38,620 Finished 0 from 16 processes
2026-10-28 16:30:43,625 Finished 0 from 16 processes
2026-10-28 16:30:48,630 Finished 0 from 16 processes
2026-10-28 16:30:53,634 Finished 0 from 16 processes
2026-10-28 16:30:58,638 Finished 0 from 16 processes
2026-10-28 16:31:03,642 Finished 0 from 16 processes
2026-10-28 16:31:08,646 Finished 0 from 16 processes
2026-10-28 16:31:13,650 Finished 0 from 16 processes
2026-10-28 16:31:18,655 Finished 0 from 16 processes
2026-10-28 16:31:23,659 Finished 0 from 16 processes
2026-10-28 16:31:28,660 Finished 0 from 16 processes
2026-10-28 16:31:33,662 Finished 0 from 16 processes
2026-10-28 16:31:38,667 Finished 0 from 16 processes
2026-10-28 16:31:43,670 Finished 0 from 16 processes
2026-10-28 16:31:48,673 Finished 0 from 16 processes
2026-10-28 16:31:53,678 Finished 0 from 16 processes
2026-10-28 16:31:58,682 Finished 0 from 16 processes
2026-10-28 16:32:03,687 Finished 0 from 16 processes
2026-10-28 16:32:08,690 Finished 0 from 16 processes
2026-10-28 16:32:13,694 Finished 0 from 16 processes
2026-10-28 16:32:18,698 Finished 0 from 16 processes
2026-10-28 16:32:23,702 Finished 0 from 16 processes
2026-10-28 16:32:28,706 Finished 0 from 16 processes
2026-10-28 16:32:33,710 Finished 0 from 16 processes
2026-10-28 16:32:38,714 Finished 0 from 16 processes
2026-10-28 16:32:43,718 Finished 0 from 16 processes
2026-10-28 16:32:48,722 Finished 0 from 16 processes
2026-10-28 16:32:53,724 Finished 0 from 16 processes
2026-10-28 16:32:58,730 Finished 0 from 16 processes
2026-10-28 16:33:03,734 Finished 0 from 16 processes
2026-10-28 16:33:08,738 Finished 0 from 16 processes
2026-10-28 16:33:13,742 Finished 0 from 16 processes
2026-10-28 16:33:18,746 Finished 0 from 16 processes
2026-10-28 16:33:23,750 Finished 0 from 16 processes
2026-10-28 16:33:28,754 Finished 0 from 16 processes
2026-10-28 16:33:33,758 Finished 0 from 16 processes
2026-10-28 16:33:38,763 Finished 0 from 16 processes
2026-10-28 16:33:43,768 Finished 0 from 16 processes
2026-10-28 16:33:48,770 Finished 0 from 16 processes
2026-10-28 16:33:53,774 Finished 0 from 16 processes
2026-10-28 16:33:58,778 Finished 0 from 16 processes
2026-10-28 16:34:03,781 Finished 0 from 16 processes
2026-10-28 16:34:08,786 Finished 0 from 16 processes
2026-10-28 16:34:13,790 Finished 0 from 16 processes
2026-10-28 16:34:18,794 Finished 0 from 16 processes
2026-10-28 16:34:23,799 Finished 0 from 16 processes
2026-10-28 16:34:28,803 Finished 0 from 16 processes
2026-10-28 16:34:33,806 Finished 0 from 16 processes
2026-10-28 16:34:38,810 Finished 0 from 16 processes
2026-10-28 16:34:43,814 Finished 0 from 16 processes
2026-10-28 16:34:48,819 Finished 0 from 16 processes
2026-10-28 16:34:53,822 Finished 0 from 16 processes
2026-10-28 16:34:58,826 Finished 0 from 16 processes
2026-10-28 16:35:03,830 Finished 0 from 16 processes
2026-10-28 16:35:08,835 Finished 0 from 16 processes
2026-10-28 16:35:13,838 Finished 0 from 16 processes
2026-10-28 16:35:18,842 Finished 0 from 16 processes
2026-10-28 16:35:23,846 Finished 0 from 16 processes
2026-10-28 16:35:28,850 Finished 0 from 16 processes
2026-10-28 16:35:33,855 Finished 0 from 16 processes
2026-10-28 16:35:38,859 Finished 0 from 16 processes
2026-10-28 16:35:43,863 Finished 0 from 16 processes
2026-10-28 16:35:48,866 Finished 0 from 16 processes
2026-10-28 16:35:53,870 Finished 0 from 16 processes
2026-10-28 16:35:58,874 Finished 0 from 16 processes
2026-10-28 16:36:03,878 Finished 0 from 16 processes
2026-10-28 16:36:08,882 Finished 0 from 16 processes
2026-10-28 16:36:13,886 Finished 0 from 16 processes
2026-10-28 16:36:18,890 Finished 0 from 16 processes
2026-10-28 16:36:23,894 Finished 0 from 16 processes
2026-10-28 16:36:28,899 Finished 0 from 16 processes
2026-10-28 16:36:33,902 Finished 0 from 16 processes
2026-10-28 16:36:38,906 Finished 0 from 16 processes
2026-10-28 16:36:43,910 Finished 0 from 16 processes
2026-10-28 16:36:48,912 Finished 0 from 16 processes
2026-10-28 16:36:53,914 Finished 0 from 16 processes
2026-10-28 16:36:58,918 Finished 0 from 16 processes
2026-10-28 16:37:03,922 Finished 0 from 16 processes
2026-10-28 16:37:08,926 Finished 0 from 16 processes
2026-10-28 16:37:13,930 Finished 0 from 16 processes
2026-10-28 16:37:18,934 Finished 0 from 16 processes
2026-10-28 16:37:23,938 Finished 0 from 16 processes
2026-10-28 16:37:28,942 Finished 0 from 16 processes
2026-10-28 16:37:33,943 Finished 0 from 16 processes
2026-10-28 16:37:38,946 Finished 0 from 16 processes
2026-10-28 16:37:43,950 Finished 0 from 16 processes
2026-10-28 16:37:48,954 Finished 0 from 16 processes
2026-10-28 16:37:53,958 Finished 0 from 16 processes
2026-10-28 16:37:58,962 Finished 0 from 16 processes
2026-10-28 16:38:03,966 Finished 0 from 16 processes
2026-10-28 16:38:08,971 Finished 0 from 16 processes
2026-10-28 16:38:13,976 Finished 0 from 16 processes
2026-10-28 16:38:18,982 Finished 0 from 16 processes
2026-10-28 16:38:23,986 Finished 0 from 16 processes
2026-10-28 16:38:28,990 Finished 0 from 16 processes
2026-10-28 16:38:33,993 Finished 0 from 16 processes
2026-10-28 16:38:38,995 Finished 0 from 16 processes
2026-10-28 16:38:43,999 Finished 0 from 16 processes
2026-10-28 16:38:49,002 Finished 0 from 16 processes
2026-10-28 16:38:54,007 Finished 0 from 16 processes
2026-10-28 16:38:59,010 Finished 0 from 16 processes
2026-10-28 16:39:04,014 Finished 0 from 16 processes
2026-10-28 16:39:09,018 Finished 0 from 16 processes
2026-10-28 16:39:14,022 Finished 0 from 16 processes
2026-10-28 16:39:19,026 Finished 0 from 16 processes
2026-10-28 16:39:24,030 Finished 0 from 16 processes
2026-10-28 16:39:29,034 Finished 0 from 16 processes
2026-10-28 16:39:34,039 Finished 0 from 16 processes
2026-10-28 16:39:39,042 Finished 0 from 16 processes
2026-10-28 16:39:44,047 Finished 0 from 16 processes
2026-10-28 16:39:49,050 Finished 0 from 16 processes
2026-10-28 16:39:54,054 Finished 0 from 16 processes
2026-10-28 16:39:59,058 Finished 0 from 16 processes
2026-10-28 16:40:04,063 Finished 0 from 16 processes
2026-10-28 16:40:09,064 Finished 0 from 16 processes
2026-10-28 16:40:14,066 Finished 0 from 16 processes
2026-10-28 16:40:19,070 Finished 0 from 16 processes
2026-10-28 16:40:24,074 Finished 0 from 16 processes
2026-10-28 16:40:29,078 Finished 0 from 16 processes
2026-10-28 16:40:34,082 Finished 0 from 16 processes
2026-10-28 16:40:39,087 Finished 0 from 16 processes
2026-10-28 16:40:44,092 Finished 0 from 16 processes
2026-10-28 16:40:49,094 Finished 0 from 16 processes
2026-10-28 16:40:54,098 Finished 0 from 16 processes
2026-10-28 16:40:59,102 Finished 0 from 16 processes
2026-10-28 16:41:04,107 Finished 0 from 16 processes
2026-10-28 16:41:09,110 Finished 0 from 16 processes
2026-10-28 16:41:14,114 Finished 0 from 16 processes
2026-10-28 16:41:19,118 Finished 0 from 16 processes
2026-10-28 16:41:24,122 Finished 0 from 16 processes
2026-10-28 16:41:29,127 Finished 0 from 16 processes
2026-10-28 16:41:34,130 Finished 0 from 16 processes
2026-10-28 16:41:39,134 Finished 0 from 16 processes
2026-10-28 16:41:44,138 Finished 0 from 16 processes
2026-10-28 16:41:49,142 Finished 0 from 16 processes
2026-10-28 16:41:54,146 Finished 0 from 16 processes
2026-10-28 16:41:59,151 Finished 0 from 16 processes
2026-10-28 16:42:04,155 Finished 0 from 16 processes
2026-10-28 16:42:09,158 Finished 0 from 16 processes
2026-10-28 16:42:14,163 Finished 0 from 16 processes
2026-10-28 16:42:19,166 Finished 0 from 16 processes
2026-10-28 16:42:24,170 Finished 0 from 16 processes
2026-10-28 16:42:29,174 Finished 0 from 16 processes
2026-10-28 16:42:34,178 Finished 0 from 16 processes
2026-10-28 16:42:39,182 Finished 0 from 16 processes
2026-10-28 16:42:44,186 Finished 0 from 16 processes
2026-10-28 16:42:49,190 Finished 0 from 16 processes
2026-10-28 16:42:54,194 Finished 0 from 16 processes
2026-10-28 16:42:59,195 Finished 0 from 16 processes
2026-10-28 16:43:04,198 Finished 0 from 16 processes
2026-10-28 16:43:09,203 Finished 0 from 16 processes
2026-10-28 16:43:14,206 Finished 0 from 16 processes
2026-10-28 16:43:19,210 Finished 0 from 16 processes
2026-10-28 16:43:24,214 Finished 0 from 16 processes
2026-10-28 16:43:29,218 Finished 0 from 16 processes
2026-10-28 16:43:34,223 Finished 0 from 16 processes
2026-10-28 16:43:39,227 Finished 0 from 16 processes
2026-10-28 16:43:44,230 Finished 0 from 16 processes
2026-10-28 16:43:49,234 Finished 0 from 16 processes
2026-10-28 16:43:54,236 Finished 0 from 16 processes
2026-10-28 16:43:59,238 Finished 0 from 16 processes
2026-10-28 16:44:04,243 Finished 0 from 16 processes
2026-10-28 16:44:09,249 Finished 0 from 16 processes
2026-10-28 16:44:14,254 Finished 0 from 16 processes
2026-10-28 16:44:19,258 Finished 0 from 16 processes
2026-10-28 16:44:24,258 Finished 0 from 16 processes
2026-10-28 16:44:29,262 Finished 0 from 16 processes
2026-10-28 16:44:34,266 Finished 0 from 16 processes
2026-10-28 16:44:39,270 Finished 0 from 16 processes
2026-10-28 16:44:44,274 Finished 0 from 16 processes
2026-10-28 16:44:49,278 Finished 0 from 16 processes
2026-10-28 16:44:54,282 Finished 0 from 16 processes
2026-10-28 16:44:59,286 Finished 0 from 16 processes
2026-10-28 16:45:04,291 Finished 0 from 16 processes
2026-10-28 16:45:09,295 Finished 0 from 16 processes
2026-10-28 16:45:14,300 Finished 0 from 16 processes
2026-10-28 16:45:19,302 Finished 0 from 16 processes
2026-10-28 16:45:24,306 Finished 0 from 16 processes
2026-10-28 16:45:29,311 Finished 0 from 16 processes
2026-10-28 16:45:34,314 Finished 0 from 16 processes
2026-10-28 16:45:39,320 Finished 0 from 16 processes
2026-10-28 16:45:44,323 Finished 0 from 16 processes
2026-10-28 16:45:49,326 Finished 0 from 16 processes
2026-10-28 16:45:54,330 Finished 0 from 16 processes
2026-10-28 16:45:59,334 Finished 0 from 16 processes
2026-10-28 16:46:04,339 Finished 0 from 16 processes
2026-10-28 16:46:09,343 Finished 0 from 16 processes
2026-10-28 16:46:14,346 Finished 0 from 16 processes
2026-10-28 16:46:19,350 Finished 0 from 16 processes
2026-10-28 16:46:24,354 Finished 0 from 16 processes
2026-10-28 16:46:29,358 Finished 0 from 16 processes
2026-10-28 16:46:34,362 Finished 0 from 16 processes
2026-10-28 16:46:39,366 Finished 0 from 16 processes
2026-10-28 16:46:44,371 Finished 0 from 16 processes
2026-10-28 16:46:49,374 Finished 0 from 16 processes
2026-10-28 16:46:54,378 Finished 0 from 16 processes
2026-10-28 16:46:59,382 Finished 0 from 16 processes
2026-10-28 16:47:04,386 Finished 0 from 16 processes
2026-10-28 16:47:09,390 Finished 0 from 16 processes
2026-10-28 16:47:14,394 Finished 0 from 16 processes
2026-10-28 16:47:19,398 Finished 0 from 16 processes
2026-10-28 16:47:24,402 Finished 0 from 16 processes
2026-10-28 16:47:29,407 Finished 0 from 16 processes
2026-10-28 16:47:34,410 Finished 0 from 16 processes
2026-10-28 16:47:39,414 Finished 0 from 16 processes
2026-10-28 16:47:44,419 Finished 0 from 16 processes
2026-10-28 16:47:49,422 Finished 0 from 16 processes
2026-10-28 16:47:54,426 Finished 0 from 16 processes
2026-10-28 16:47:59,430 Finished 0 from 16 processes
2026-10-28 16:48:04,434 Finished 0 from 16 processes
2026-10-28 16:48:09,438 Finished 0 from 16 processes
2026-10-28 16:48:14,442 Finished 0 from 16 processes
2026-10-28 16:48:19,446 Finished 0 from 16 processes
2026-10-28 16:48:24,450 Finished 0 from 16 processes
2026-10-28 16:48:29,454 Finished 0 from 16 processes
2026-10-28 16:48:34,458 Finished 0 from 16 processes
2026-10-28 16:48:39,462 Finished 0 from 16 processes
2026-10-28 16:48:44,467 Finished 0 from 16 processes
2026-10-28 16:48:49,470 Finished 0 from 16 processes
2026-10-28 16:48:54,474 Finished 0 from 16 processes
2026-10-28 16:48:59,479 Finished 0 from 16 processes
2026-10-28 16:49:04,483 Finished 0 from 16 processes
2026-10-28 16:49:09,487 Finished 0 from 16 processes
2026-10-28 16:49:14,492 Finished 0 from 16 processes
2026-10-28 16:49:19,495 Finished 0 from 16 processes
2026-10-28 16:49:24,496 Finished 0 from 16 processes
2026-10-28 16:49:29,498 Finished 0 from 16 processes
2026-10-28 16:49:34,502 Finished 0 from 16 processes
2026-10-28 16:49:39,507 Finished 0 from 16 processes
2026-10-28 16:49:44,510 Finished 0 from 16 processes
2026-10-28 16:49:49,514 Finished 0 from 16 processes
2026-10-28 16:49:54,518 Finished 0 from 16 processes
2026-10-28 16:49:59,522 Finished 0 from 16 processes
2026-10-28 16:50:04,526 Finished 0 from 16 processes
2026-10-28 16:50:09,530 Finished 0 from 16 processes
2026-10-28 16:50:14,534 Finished 0 from 16 processes
2026-10-28 16:50:19,538 Finished 0 from 16 processes
2026-10-28 16:50:24,542 Finished 0 from 16 processes
2026-10-28 16:50:29,547 Finished 0 from 16 processes
2026-10-28 16:50:34,550 Finished 0 from 16 processes
2026-10-28 16:50:39,554 Finished 0 from 16 processes
2026-10-28 16:50:44,555 Finished 2 from 16 processes
2026-10-28 16:50:49,558 Finished 4 from 16 processes
2026-10-28 16:50:54,562 Finished 6 from 16 processes
2026-10-28 16:50:59,566 Finished 6 from 16 processes
2026-10-28 16:51:04,570 Finished 7 from 16 processes
2026-10-28 16:51:09,574 Finished 7 from 16 processes
2026-10-28 16:51:14,578 Finished 7 from 16 processes
2026-10-28 16:51:19,582 Finished 7 from 16 processes
2026-10-28 16:51:24,586 Finished 8 from 16 processes
2026-10-28 16:51:29,590 Finished 9 from 16 processes
2026-10-28 16:51:34,594 Finished 9 from 16 processes
2026-10-28 16:51:39,598 Finished 9 from 16 processes
2026-10-28 16:51:44,602 Finished 9 from 16 processes
2026-10-28 16:51:49,606 Finished 9 from 16 processes
2026-10-28 16:51:54,610 Finished 9 from 16 processes
2026-10-28 16:51:59,614 Finished 9 from 16 processes
2026-10-28 16:52:04,619 Finished 9 from 16 processes
2026-10-28 16:52:09,623 Finished 9 from 16 processes
2026-10-28 16:52:14,628 Finished 9 from 16 processes
2026-10-28 16:52:19,633 Finished 9 from 16 processes
2026-10-28 16:52:24,638 Finished 10 from 16 processes
2026-10-28 16:52:29,642 Finished 10 from 16 processes
2026-10-28 16:52:34,646 Finished 10 from 16 processes
2026-10-28 16:52:39,646 Finished 10 from 16 processes
2026-10-28 16:52:44,651 Finished 10 from 16 processes
2026-10-28 16:52:49,654 Finished 10 from 16 processes
2026-10-28 16:52:54,658 Finished 10 from 16 processes
2026-10-28 16:52:59,663 Finished 10 from 16 processes
2026-10-28 16:53:04,666 Finished 10 from 16 processes
2026-10-28 16:53:09,670 Finished 10 from 16 processes
2026-10-28 16:53:14,674 Finished 10 from 16 processes
2026-10-28 16:53:19,678 Finished 10 from 16 processes
2026-10-28 16:53:24,682 Finished 10 from 16 processes
2026-10-28 16:53:29,686 Finished 10 from 16 processes
2026-10-28 16:53:34,689 Finished 10 from 16 processes
2026-10-28 16:53:39,694 Finished 10 from 16 processes
2026-10-28 16:53:44,699 Finished 10 from 16 processes
2026-10-28 16:53:49,702 Finished 10 from 16 processes
2026-10-28 16:53:54,706 Finished 11 from 16 processes
2026-10-28 16:53:59,710 Finished 11 from 16 processes
2026-10-28 16:54:04,714 Finished 11 from 16 processes
2026-10-28 16:54:09,718 Finished 11 from 16 processes
2026-10-28 16:54:14,722 Finished 11 from 16 processes
2026-10-28 16:54:19,724 Finished 11 from 16 processes
2026-10-28 16:54:24,730 Finished 11 from 16 processes
2026-10-28 16:54:29,734 Finished 11 from 16 processes
2026-10-28 16:54:34,738 Finished 11 from 16 processes
2026-10-28 16:54:39,743 Finished 11 from 16 processes
2026-10-28 16:54:44,746 Finished 11 from 16 processes
2026-10-28 16:54:49,750 Finished 11 from 16 processes
2026-10-28 16:54:54,754 Finished 11 from 16 processes
2026-10-28 16:54:59,758 Finished 11 from 16 processes
2026-10-28 16:55:04,762 Finished 11 from 16 processes
2026-10-28 16:55:09,767 Finished 11 from 16 processes
2026-10-28 16:55:14,770 Finished 11 from 16 processes
2026-10-28 16:55:19,774 Finished 11 from 16 processes
2026-10-28 16:55:24,779 Finished 11 from 16 processes
2026-10-28 16:55:29,784 Finished 11 from 16 processes
2026-10-28 16:55:34,789 Finished 11 from 16 processes
2026-10-28 16:55:39,794 Finished 12 from 16 processes
2026-10-28 16:55:44,798 Finished 12 from 16 processes
2026-10-28 16:55:49,803 Finished 12 from 16 processes
2026-10-28 16:55:54,808 Finished 12 from 16 processes
2026-10-28 16:55:59,810 Finished 12 from 16 processes
2026-10-28 16:56:04,815 Finished 12 from 16 processes
2026-10-28 16:56:09,818 Finished 12 from 16 processes
2026-10-28 16:56:14,819 Finished 12 from 16 processes
2026-10-28 16:56:19,824 Finished 12 from 16 processes
2026-10-28 16:56:24,826 Finished 12 from 16 processes
2026-10-28 16:56:29,830 Finished 13 from 16 processes
2026-10-28 16:56:34,835 Finished 13 from 16 processes
2026-10-28 16:56:39,840 Finished 13 from 16 processes
2026-10-28 16:56:44,845 Finished 13 from 16 processes
2026-10-28 16:56:49,850 Finished 13 from 16 processes
2026-10-28 16:56:54,855 Finished 13 from 16 processes
2026-10-28 16:56:59,858 Finished 13 from 16 processes
2026-10-28 16:57:04,863 Finished 13 from 16 processes
2026-10-28 16:57:09,868 Finished 13 from 16 processes
2026-10-28 16:57:14,870 Finished 13 from 16 processes
2026-10-28 16:57:19,873 Finished 13 from 16 processes
2026-10-28 16:57:24,878 Finished 13 from 16 processes
2026-10-28 16:57:29,883 Finished 13 from 16 processes
2026-10-28 16:57:34,886 Finished 13 from 16 processes
2026-10-28 16:57:39,886 Finished 13 from 16 processes
2026-10-28 16:57:44,890 Finished 13 from 16 processes
2026-10-28 16:57:49,894 Finished 14 from 16 processes
2026-10-28 16:57:54,898 Finished 14 from 16 processes
2026-10-28 16:57:59,902 Finished 14 from 16 processes
2026-10-28 16:58:04,907 Finished 14 from 16 processes
2026-10-28 16:58:09,910 Finished 14 from 16 processes
2026-10-28 16:58:14,915 Finished 14 from 16 processes
2026-10-28 16:58:19,920 Finished 14 from 16 processes
2026-10-28 16:58:24,922 Finished 14 from 16 processes
2026-10-28 16:58:29,927 Finished 14 from 16 processes
2026-10-28 16:58:34,930 Finished 14 from 16 processes
2026-10-28 16:58:39,935 Finished 14 from 16 processes
2026-10-28 16:58:44,940 Finished 14 from 16 processes
2026-10-28 16:58:49,942 Finished 14 from 16 processes
2026-10-28 16:58:54,947 Finished 14 from 16 processes
2026-10-28 16:58:59,952 Finished 14 from 16 processes
2026-10-28 16:59:04,954 Finished 14 from 16 processes
2026-10-28 16:59:09,958 Finished 14 from 16 processes
2026-10-28 16:59:14,962 Finished 14 from 16 processes
2026-10-28 16:59:19,966 Finished 15 from 16 processes
2026-10-28 16:59:24,971 Finished 15 from 16 processes
2026-10-28 16:59:29,976 Finished 15 from 16 processes
2026-10-28 16:59:34,978 Finished 15 from 16 processes
2026-10-28 16:59:39,982 Finished 15 from 16 processes
2026-10-28 16:59:44,986 Finished 15 from 16 processes
2026-10-28 16:59:49,990 Finished 15 from 16 processes
2026-10-28 16:59:54,991 Finished 15 from 16 processes
2026-10-28 16:59:59,995 Finished 15 from 16 processes
2026-10-28 17:00:04,998 Finished 15 from 16 processes
2026-10-28 17:00:10,003 Finished 15 from 16 processes
2026-10-28 17:00:15,008 Finished 15 from 16 processes
2026-10-28 17:00:20,013 All processes finished
2026-10-28 17:00:20,013 Compressing stress logs
2026-10-28 17:00:20,031 Logs compressed
2026-10-28 17:00:20,031 Will terminate gdb (if any)
Quit
2026-10-28 17:05:30,133 Checking if some queries hung
Using queries from '/usr/share/clickhouse-test/queries' directory
Connecting to ClickHouse server... OK
Running 1 stateless tests (MainProcess).
00001_select_1: [ OK ]
1 tests passed. 0 tests skipped. 1.98 s elapsed (MainProcess).
Won't run stateful tests because test data wasn't loaded.
No queries hung.
All tests have finished.
Top patterns of log messages:
count count_% size size_% uniq_loggers uniq_threads levels background_% message_format_string
UInt64 Float64 String Float64 UInt64 UInt64 Array(String) Float64 LowCardinality(String)
38280 0.209 2.05 MiB 0.095 1 770 ['Trace'] 0.482 Created HTTP(S) session with {}:{} ({}:{})
6934 0.038 525.19 KiB 0.024 1 309 ['Debug'] 0.36 Remove from cache. Key: {}, offset: {}, size: {}
6842 0.037 379.49 KiB 0.017 2 103 ['Trace'] 0 Access granted: {}{}
6797 0.037 404.90 KiB 0.018 1 105 ['Debug'] 0.989 Key {} is removed from metadata
5365 0.029 772.32 KiB 0.035 1 64 ['Debug'] 0 (from {}{}{}){}{} {} (stage: {})
5293 0.029 811.45 KiB 0.037 2 64 ['Trace'] 1 {} Creating query context from {} context, user_id: {}, parent context user: {}
5029 0.027 574.60 KiB 0.026 907 463 ['Trace'] 0 Bypassing cache because file segment state is `PARTIALLY_DOWNLOADED_NO_CONTINUATION` and downloaded part already used
4381 0.024 252.42 KiB 0.011 1 193 ['Debug'] 0.034 Submitting key {} for removal
4025 0.022 180.10 KiB 0.008 1 1 ['Trace'] 1 Processing requests batch, size: {}, bytes: {}
3910 0.021 92.91 KiB 0.004 1 84 ['Trace'] 0.002 {} -> {}
3673 0.02 289.34 KiB 0.013 1 63 ['Debug'] 0 Read {} rows, {} in {} sec., {} rows/sec., {}/sec.
3602 0.02 101.87 KiB 0.005 1 64 ['Debug'] 0.001 Processed in {} sec.
2890 0.016 343.39 KiB 0.016 139 149 ['Trace'] 0.68 Renaming temporary part {} to {} with tid {}.
2793 0.015 129.53 KiB 0.006 1 78 ['Debug'] 0.183 Peak memory usage{}: {}.
2750 0.015 190.68 KiB 0.009 141 292 ['Trace'] 0.823 Trying to reserve {} using storage policy from min volume index {}
2747 0.015 238.55 KiB 0.011 3 72 ['Debug'] 0.997 {} Authenticating user \'{}\' from {}
2747 0.015 308.50 KiB 0.014 3 72 ['Debug'] 0.997 {} Authenticated with global context as user {}
2741 0.015 240.91 KiB 0.011 3 72 ['Debug'] 0.997 {} Logout, user_id: {}
2738 0.015 131.61 KiB 0.006 1 174 ['Trace'] 0.644 filled checksums {}
2733 0.015 298.92 KiB 0.014 2 64 ['Debug'] 1 {} Creating session context with user_id: {}
2338 0.013 1.20 MiB 0.056 1 240 ['Debug'] 0.978 Objects with paths [{}] were removed from S3
2337 0.013 219.82 KiB 0.01 1 22 ['Debug'] 0 Reading {} marks from part {}, total {} rows starting from the beginning of the part
2181 0.012 2.64 MiB 0.123 1 226 ['Debug'] 0.981 metadata and objects were removed for [{}], only metadata were removed for [{}].
2102 0.011 646.21 KiB 0.029 1893 390 ['Information'] 0 Setting download as failed: {}
1966 0.011 179.37 KiB 0.008 1 647 ['Trace'] 0 Aggregated. {} to {} rows (from {}) in {} sec. ({:.3f} rows/sec., {}/sec.)
1927 0.011 379.41 KiB 0.017 2 61 ['Trace'] 1 HTTP Request for {}. Method: {}, Address: {}, User-Agent: {}{}, Content Type: {}, Transfer Encoding: {}, X-Forwarded-For: {}
1927 0.011 290.49 KiB 0.013 2 61 ['Trace'] 1 Request URI: {}
1876 0.01 38.47 KiB 0.002 2 61 ['Debug'] 0.11 Done processing query
1759 0.01 62.96 KiB 0.003 12 12 ['Trace'] 1 Flushed system log up to offset {}
1759 0.01 101.63 KiB 0.005 12 12 ['Trace'] 1 Flushing system log, {} entries to flush up to offset {}
1550 0.008 124.86 KiB 0.006 1424 346 ['Trace'] 0 No space left in cache to reserve {} bytes, will continue without cache download
1443 0.008 136.36 KiB 0.006 1 360 ['Trace'] 0.168 Sending request to {}
1343 0.007 39.70 KiB 0.002 1 608 ['Trace'] 0 Aggregation method: {}
1203 0.007 26.48 KiB 0.001 108 128 ['Trace'] 1 Execution took {} ms.
1093 0.006 11.74 KiB 0.001 1 579 ['Trace'] 0 Aggregating
1055 0.006 34.33 KiB 0.002 1 64 ['Trace'] 1 TCP Request. Address: {}
1055 0.006 98.37 KiB 0.004 1 64 ['Debug'] 1 Connected {} version {}.{}.{}, revision: {}{}{}.
1049 0.006 27.66 KiB 0.001 1 64 ['Debug'] 1 Done processing connection.
686 0.004 52.92 KiB 0.002 1 53 ['Trace'] 0 Query span trace_id for opentelemetry log: {}
661 0.004 81.75 KiB 0.004 1 2 ['Trace'] 1 MemoryTracking: was {}, peak {}, free memory in arenas {}, will set to {} (RSS), difference: {}
644 0.004 71.05 KiB 0.003 1 18 ['Debug'] 0 Reading {} marks from part {}, total {} rows starting from the beginning of the part, column {}
627 0.003 132.00 KiB 0.006 48 8 ['Information'] 1 {} is in use (by merge/mutation/INSERT) (consider increasing temporary_directories_lifetime setting)
600 0.003 113.73 KiB 0.005 1 338 ['Trace'] 0 Failed to setup ParallelReadBuffer because of an exception:\n{}.\nFalling back to the single-threaded buffer
571 0.003 39.60 KiB 0.002 1 153 ['Trace'] 0.89 Rolling back transaction {}{}
519 0.003 27.29 KiB 0.001 41 133 ['Debug'] 0.958 Selected {} parts from {} to {}
511 0.003 51.94 KiB 0.002 432 247 ['Trace'] 0 Predownload failed because of space limit. Will read from remote filesystem starting from offset: {}
489 0.003 24.48 KiB 0.001 13 324 ['Trace'] 0.479 Finished loading {} part {} on disk {}
489 0.003 21.14 KiB 0.001 13 324 ['Trace'] 0.479 Loading {} part {} from disk {}
468 0.003 15.98 KiB 0.001 1 23 ['Debug'] 0 Selected MergeAlgorithm: {}
468 0.003 38.74 KiB 0.002 1 23 ['Debug'] 0 Merging {} parts: from {} to {} into {} with storage {}
457 0.002 59.64 KiB 0.003 1 23 ['Debug'] 0 Merge sorted {} rows, containing {} columns ({} merged, {} gathered) in {} sec., {} rows/sec., {}/sec.
455 0.002 29.59 KiB 0.001 34 23 ['Trace'] 0 Merged {} parts: [{}, {}] -> {}
419 0.002 102.73 KiB 0.005 1 61 ['Trace'] 0.647 Create WriteBufferFromS3, {}
419 0.002 36.91 KiB 0.002 1 61 ['Trace'] 0.652 Close WriteBufferFromS3. {}.
417 0.002 43.69 KiB 0.002 1 61 ['Trace'] 0.65 Single part upload has completed. {}, size {}
416 0.002 39.48 KiB 0.002 1 61 ['Trace'] 0.651 finalizeImpl WriteBufferFromS3. {}.
408 0.002 54.89 KiB 0.002 129 83 ['Debug'] 0.995 Removing {} parts from filesystem (serially): Parts: [{}]
403 0.002 102.08 KiB 0.005 1 12 ['Information'] 0.261 WriteBufferFromS3 is not finalized in destructor. The file might not be written to S3. {}.
376 0.002 18.28 KiB 0.001 22 123 ['Trace'] 1 Scheduling next merge selecting task after {}ms
374 0.002 10.69 KiB 0 112 71 ['Debug'] 0.008 Key condition: {}
356 0.002 41.25 KiB 0.002 111 71 ['Debug'] 0.008 Selected {}/{} parts by partition key, {} parts by primary key, {}/{} marks by primary key, {} marks to read from {} ranges
353 0.002 28.13 KiB 0.001 1 55 ['Trace'] 0 Reading {} ranges in order from part {}, approx. {} rows starting from {}
346 0.002 10.02 KiB 0 21 212 ['Trace'] 0 Found (LEFT) boundary mark: {}
346 0.002 23.57 KiB 0.001 21 212 ['Trace'] 0 Running binary search on index range for part {} ({} marks)
346 0.002 10.15 KiB 0 21 212 ['Trace'] 0 Found {} range in {} steps
346 0.002 10.36 KiB 0 21 212 ['Trace'] 0 Found (RIGHT) boundary mark: {}
343 0.002 29.12 KiB 0.001 19 58 ['Trace'] 0.875 Part {} local references is zero, will check blobs can be removed in zookeeper
338 0.002 30.03 KiB 0.001 21 114 ['Trace'] 1 Insert entry {} to queue with type {}
337 0.002 27.37 KiB 0.001 1 266 ['Trace'] 0 An entry for key={} found in cache: sum_of_sizes={}, median_size={}
313 0.002 7.03 KiB 0 1 227 ['Trace'] 0 Merging aggregated data
311 0.002 33.79 KiB 0.002 1 40 ['Trace'] 0 No entry found for query {}
309 0.002 42.41 KiB 0.002 19 118 ['Trace'] 1 Checked {} partitions, found {} partitions with parts that may be merged: [{}](max_total_size_to_merge={}, merge_with_ttl_allowed{})
309 0.002 48.18 KiB 0.002 1 93 ['Debug'] 0.874 Recursively remove path {}: metadata and objects were removed for [{}], only metadata were removed for [{}].
307 0.002 15.89 KiB 0.001 102 65 ['Trace'] 0.01 Spreading mark ranges among streams (default reading)
301 0.002 49.65 KiB 0.002 19 19 ['Trace'] 0.99 Remove zookeeper lock {} for part {}
298 0.002 8.73 KiB 0 22 116 ['Debug'] 1 Updating strategy picker state
292 0.002 36.77 KiB 0.002 14 9 ['Debug'] 0.993 Removing {} parts from memory: Parts: [{}]
292 0.002 36.49 KiB 0.002 14 9 ['Trace'] 0.993 Found {} old parts to remove. Parts: [{}]
268 0.001 25.09 KiB 0.001 1 158 ['Debug'] 0.041 Will evict {} file segments (while reserving {} bytes for {}:{})
247 0.001 4.34 KiB 0 162 64 ['Debug'] 0.077 Loading data parts
246 0.001 30.36 KiB 0.001 15 22 ['Debug'] 1 Fetching part {} from {}:{}
244 0.001 2.14 KiB 0 2 29 ['Trace'] 0.008 No tables
243 0.001 6.88 KiB 0 15 22 ['Trace'] 1 Checking disk {} with type {}
243 0.001 12.58 KiB 0.001 15 22 ['Trace'] 1 Disk {} (with type {}) supports zero-copy replication
243 0.001 20.88 KiB 0.001 15 22 ['Trace'] 1 Trying to fetch with zero-copy replication, but disk is not provided, will try to select
233 0.001 5.92 KiB 0 21 113 ['Debug'] 1 Pulled {} entries to queue.
233 0.001 13.42 KiB 0.001 21 113 ['Debug'] 1 Pulling {} entries to queue: {} - {}
231 0.001 18.67 KiB 0.001 18 109 ['Debug'] 1 Strategy picker state updated, current replica: {}, active replicas: [{}]
230 0.001 8.75 KiB 0 17 23 ['Debug'] 0.878 Part {} committed to zookeeper
230 0.001 8.97 KiB 0 17 23 ['Debug'] 0.878 Committing part {} to zookeeper
212 0.001 40.71 KiB 0.002 6 17 ['Trace'] 0 ZooKeeperWithFaultInjection call SUCCEEDED: seed={} func={} path={}
210 0.001 6.77 KiB 0 1 2 ['Trace'] 1 Received heartbeat for session #{}
207 0.001 13.34 KiB 0.001 15 22 ['Trace'] 1 Trying to reserve {} on the selected disk: {} (with type {})
207 0.001 20.16 KiB 0.001 15 22 ['Debug'] 1 Downloading part {} unique id {} metadata onto disk {}.
207 0.001 15.97 KiB 0.001 15 22 ['Trace'] 1 Disk for fetch is not provided, getting disk from reservation {} with type \'{}\'
207 0.001 32.96 KiB 0.001 15 22 ['Trace'] 1 Set zookeeper temporary ephemeral lock {}
207 0.001 4.80 KiB 0 15 38 ['Trace'] 1 Sending part {}
207 0.001 33.77 KiB 0.002 15 22 ['Trace'] 1 Zookeeper temporary ephemeral lock {} created
206 0.001 25.80 KiB 0.001 1 102 ['Information'] 1 Have {} tables in drop queue ({} of them are in use), will try drop {}
206 0.001 40.12 KiB 0.002 1 102 ['Information'] 1 Removing metadata {} of dropped table {}
Top messages without format string (fmt::runtime):
count pattern runtime_message line
UInt64 String String Tuple(String, UInt64)
8 PocoExceptionCodeecodeIOerrorBro Poco::Exception. Code: 1000, e.code() = 32, I/O error: Broken pipe, Stack trace (when copying this message, always include the lines below):\n\n0. /build/contrib/llvm-project/libcxx/include/exception:134: std::exception::capture() @ 0x000000000b1ae782 in /us ('/Exception.cpp',235)
6 CodeDBExceptionSyntaxerrorfailed Code: 62. DB::Exception: Syntax error: failed at position 8 (\'$\'): $$ab\n. Expected one of: ALL, DISTINCT ON, DISTINCT, TOP, not empty list of expressions, list of expressions, list of elements, expression with optional alias, element of expression with opt ('/executeQuery.cpp',207)
3 configatindexiscommittedprevconf config at index 1 is committed, prev config log idx 26 ('/LoggerWrapper.h',42)
2 CodeDBNetExceptionTimeoutexceede Code: 209. DB::NetException: Timeout exceeded while reading from socket (socket (127.0.0.1:9000), receive timeout 300000 ms): While executing Remote. (SOCKET_TIMEOUT) (version 23.8.16.43.altinitystable (altinity build)) (from [::ffff:127.0.0.1]:42440) (com ('/executeQuery.cpp',207)
2 CodeDBErrnoExceptionCannotrename Code: 521. DB::ErrnoException: Cannot rename /var/lib/clickhouse/metadata/test.sql.tmp to /var/lib/clickhouse/metadata/test.sql because the second path already exists, errno: 17, strerror: File exists. (ATOMIC_RENAME_FAIL) (version 23.8.16.43.altinitystabl ('/executeQuery.cpp',207)
2 skippedconfiglatestconfig skipped config 1, latest config 26 ('/LoggerWrapper.h',42)
2 CodeDBExceptionReceivedfromDBNet Code: 209. DB::Exception: Received from 127.0.0.1:9000. DB::NetException. DB::NetException: Timeout exceeded while reading from socket (socket (127.0.0.1:9000), receive timeout 300000 ms): While executing Remote. Stack trace:\n\n0. /build/contrib/llvm-projec ('/executeQuery.cpp',207)
1 VOTEINITmyidmyrolecandidateterml [VOTE INIT] my id 1, my role candidate, term 3, log idx 573, log term 2, priority (target 1 / mine 1) ('/LoggerWrapper.h',42)
1 invalidelectiontimeoutupperbound invalid election timeout upper bound detected, adjusted to 0 ('/LoggerWrapper.h',42)
1 ELECTIONTIMEOUTcurrentrolefollow [ELECTION TIMEOUT] current role: follower, log last term 2, state term 2, target p 1, my p 1, hb dead, pre-vote NOT done ('/LoggerWrapper.h',42)
1 Thesettingmergetreemetadatacache The setting \'merge_tree_metadata_cache\' is enabled. But the feature of \'metadata cache in RocksDB\' is experimental and is not ready for production. The usage of this feature can lead to data corruption and loss. The setting should be disabled in production ('',0)
1 numberofpendingcommitelements number of pending commit elements: 0 ('/LoggerWrapper.h',42)
1 globalmanagerdoesnotexistwilluse global manager does not exist. will use local thread for commit and append ('/LoggerWrapper.h',42)
1 ThreadFuzzerisenabledApplication ThreadFuzzer is enabled. Application will run slowly and unstable. ('',0)
1 detectaconfigurationchangethatis detect a configuration change that is not committed yet at index 1 ('/LoggerWrapper.h',42)
1 Forkedachildprocesstowatch Forked a child process to watch ('',0)
1 statemachinecommitindexprecommit state machine commit index 0, precommit index 573, last log index 573 ('/LoggerWrapper.h',42)
1 newconfiglogidxprevlogidxcurconf new config log idx 574, prev log idx 26, cur config log idx 26, prev log idx 1 ('/LoggerWrapper.h',42)
1 PocoExceptionCodeecodeNetExcepti Poco::Exception. Code: 1000, e.code() = 107, Net Exception: Socket is not connected, Stack trace (when copying this message, always include the lines below):\n\n0. /build/contrib/llvm-project/libcxx/include/exception:134: std::exception::capture() @ 0x000000 ('/Exception.cpp',235)
1 CodeDBExceptionBadURIsyntaxURIco Code: 1000. DB::Exception: Bad URI syntax: URI contains invalid characters. (POCO_EXCEPTION), Stack trace (when copying this message, always include the lines below):\n\n0. /build/contrib/llvm-project/libcxx/include/exception:134: std::exception::capture() @ ('/TCPHandler.cpp',680)
1 startingup starting up ('',0)
1 newconfigurationlogidxprevlogidx new configuration: log idx 574, prev log idx 26\npeer 1, DC ID 0, localhost:9234, voting member, 1\nmy id: 1, leader: 1, term: 3 ('/LoggerWrapper.h',42)
1 Serverlogginglevelissettotestand Server logging level is set to \'test\' and performance is degraded. This cannot be used in production. ('',0)
1 StartingClickHousealtinitystable Starting ClickHouse 23.8.16.43.altinitystable (revision: 54477, git hash: a26de2e0e62c813df59bc08c1069dd5620e7c685, build id: BCB784F9A3C19CEA839077CCB85FA6E854FF803C), PID 1868 ('',0)
1 INITRAFTSERVERcommitindextermele === INIT RAFT SERVER ===\ncommit index 0\nterm 2\nelection timer allowed\nlog store start 1, end 573\nconfig log idx 26, prev log idx 1 ('/LoggerWrapper.h',42)
1 waitforHBforms wait for HB, for 50 + [0, 0] ms ('/LoggerWrapper.h',42)
1 bgappendentriesthreadinitiated bg append_entries thread initiated ('/LoggerWrapper.h',42)
1 parameterselectiontimeoutrangehe parameters: election timeout range 0 - 0, heartbeat 0, leadership expiry 0, max batch 100, backoff 50, snapshot distance 10000, enable randomized snapshot creation NO, log sync stop gap 99999, reserved logs 2147483647, client timeout 10000, auto forwarding ('/LoggerWrapper.h',42)
1 newelectiontimeoutrange new election timeout range: 0 - 0 ('/LoggerWrapper.h',42)
1 prevotetermisdifferentresetitto pre-vote term (0) is different, reset it to 2 ('/LoggerWrapper.h',42)
Top messages that does not match its format string:
message_format_string count() any_message
LowCardinality(String) UInt64 String
{} is in use (by merge/mutation/INSERT) (consider increasing temporary_directories_lifetime setting) 359 /var/lib/clickhouse/disks/s3/store/cdf/cdf9d90e-1f27-4103-8122-825231032050/tmp_merge_202610_44_60_3/ is in use (by merge/mutation/INSERT) (consider increasing temporary_directories_lifetime setting) (skipped 1 similar messages)
45 Poco::Exception. Code: 1000, e.code() = 32, I/O error: Broken pipe, Stack trace (when copying this message, always include the lines below):\n\n0. /build/contrib/llvm-project/libcxx/include/exception:134: std::exception::capture() @ 0x000000000b1ae782 in /usr/bin/clickhouse\n1. /build/contrib/llvm-project/libcxx/include/exception:112: std::exception::exception[abi:v15000]() @ 0x000000000b1ae74d in /usr/bin/clickhouse\n2. /build/base/poco/Foundation/src/Exception.cpp:27: Poco::Exception::Exception(String const&, int) @ 0x000000002492de80 in /usr/bin/clickhouse\n3. /build/base/poco/Foundation/src/Exception.cpp:145: Poco::RuntimeException::RuntimeException(String const&, int) @ 0x00000000249312e7 in /usr/bin/clickhouse\n4. /build/base/poco/Foundation/src/Exception.cpp:164: Poco::IOException::IOException(String const&, int) @ 0x0000000024935427 in /usr/bin/clickhouse\n5. /build/base/poco/Net/src/SocketImpl.cpp:1008: Poco::Net::SocketImpl::error(int, String const&) @ 0x000000002474bf8d in /usr/bin/clickhouse\n6. /build/base/poco/Net/src/SocketImpl.cpp:927: Poco::Net::SocketImpl::error(int) @ 0x000000002474c624 in /usr/bin/clickhouse\n7. /build/base/poco/Net/src/SocketImpl.cpp:0: Poco::Net::SocketImpl::sendBytes(void const*, int, int) @ 0x000000002474d212 in /usr/bin/clickhouse\n8. /build/base/poco/Net/src/StreamSocketImpl.cpp:63: Poco::Net::StreamSocketImpl::sendBytes(void const*, int, int) @ 0x0000000024754ebe in /usr/bin/clickhouse\n9. /build/base/poco/Net/src/StreamSocket.cpp:114: Poco::Net::StreamSocket::sendBytes(void const*, int, int) @ 0x0000000024750d12 in /usr/bin/clickhouse\n10. /build/base/poco/Net/src/HTTPSession.cpp:144: Poco::Net::HTTPSession::write(char const*, long) @ 0x000000002472b78e in /usr/bin/clickhouse\n11. /build/base/poco/Net/src/HTTPChunkedStream.cpp:57: Poco::Net::HTTPChunkedStreamBuf::close() @ 0x000000002471530d in /usr/bin/clickhouse\n12. /build/base/poco/Net/src/HTTPChunkedStream.cpp:166: Poco::Net::HTTPChunkedIOS::~HTTPChunkedIOS() @ 0x0000000024715cda in /usr/bin/clickhouse\n13. /build/base/poco/Net/src/HTTPChunkedStream.cpp:208: Poco::Net::HTTPChunkedOutputStream::~HTTPChunkedOutputStream() @ 0x00000000247163c1 in /usr/bin/clickhouse\n14. /build/base/poco/Net/src/HTTPChunkedStream.cpp:207: Poco::Net::HTTPChunkedOutputStream::~HTTPChunkedOutputStream() @ 0x0000000024716400 in /usr/bin/clickhouse\n15. /build/contrib/llvm-project/libcxx/include/__memory/construct_at.h:64: void std::__destroy_at[abi:v15000](Poco::Net::HTTPChunkedOutputStream*) @ 0x000000001e67628d in /usr/bin/clickhouse\n16. /build/contrib/llvm-project/libcxx/include/__memory/construct_at.h:89: void std::destroy_at[abi:v15000](Poco::Net::HTTPChunkedOutputStream*) @ 0x000000001e676235 in /usr/bin/clickhouse\n17. /build/contrib/llvm-project/libcxx/include/__memory/allocator_traits.h:321: void std::allocator_traits>::destroy[abi:v15000](std::allocator&, Poco::Net::HTTPChunkedOutputStream*) @ 0x000000001e676219 in /usr/bin/clickhouse\n18. /build/contrib/llvm-project/libcxx/include/__memory/shared_ptr.h:309: std::__shared_ptr_emplace>::__on_zero_shared() @ 0x000000001e67608e in /usr/bin/clickhouse\n19. /build/contrib/llvm-project/libcxx/include/__memory/shared_ptr.h:175: std::__shared_count::__release_shared[abi:v15000]() @ 0x000000000b19ee14 in /usr/bin/clickhouse\n20. /build/contrib/llvm-project/libcxx/include/__memory/shared_ptr.h:215: std::__shared_weak_count::__release_shared[abi:v15000]() @ 0x000000000b19edb9 in /usr/bin/clickhouse\n21. /build/contrib/llvm-project/libcxx/include/__memory/shared_ptr.h:703: std::shared_ptr>>::~shared_ptr[abi:v15000]() @ 0x000000001e5d8dec in /usr/bin/clickhouse\n22. /build/src/Server/HTTP/HTTPServerResponse.h:16: DB::HTTPServerResponse::~HTTPServerResponse() @ 0x000000001e67057b in /usr/bin/clickhouse\n23. /build/src/Server/HTTP/HTTPServerConnection.cpp:88: DB::HTTPServerConnection::run() @ 0x000000001e6700b8 in /usr/bin/clickhouse\n24. /build/base/poco/Net/src/TCPServerConnection.cpp:43: Poco::Net::TCPServerConnection::start() @ 0x00000000247564b9 in /usr/bin/clickhouse\n25. /build/base/poco/Net/src/TCPServerDispatcher.cpp:115: Poco::Net::TCPServerDispatcher::run() @ 0x0000000024756cfc in /usr/bin/clickhouse\n26. /build/base/poco/Foundation/src/ThreadPool.cpp:188: Poco::PooledThread::run() @ 0x00000000249ab374 in /usr/bin/clickhouse\n27. /build/base/poco/Foundation/src/Thread.cpp:46: Poco::(anonymous namespace)::RunnableHolder::run() @ 0x00000000249a811a in /usr/bin/clickhouse\n28. /build/base/poco/Foundation/src/Thread_POSIX.cpp:335: Poco::ThreadImpl::runnableEntry(void*) @ 0x00000000249a6e1e in /usr/bin/clickhouse\n29. ? @ 0x00007fe5244a2a83 in ?\n30. ? @ 0x00007fe5245348e0 in ?\n (version 23.8.16.43.altinitystable (altinity build))
Top short messages:
c message_format_string substring(any(message), 1, 120) min_length_without_exception_boilerplate
UInt64 LowCardinality(String) String Int64
2 Processed: {}% Processed: 10% -12
1 Found {} on {} Found changelog_1_100000.bin.zstd on LocalLogDisk 23
Top messages by level:
(0.0003214435539671038,'') Error
(0.0001416530915787237,'Client has gone away.') Warning
(0.011452107634556816,'Setting download as failed: {}') Information
(0.03805019967637717,'Remove from cache. Key: {}, offset: {}, size: {}') Debug
(0.2085569363705209,'Created HTTP(S) session with {}:{} ({}:{})') Trace
2026-10-28 17:05:54,896 Stress test finished
+ echo -e 'Test script exit code\tOK\t\N\t'
+ rg -Fa 'No queries hung' /test_output/test_results.tsv
+ grep -Fa OK
No queries hung OK \N
+ stop
+ local max_tries=90
+ local check_hang=true
+ local pid
++ cat /var/run/clickhouse-server/clickhouse-server.pid
+ pid=1868
+ clickhouse stop --max-tries 90 --do-not-kill
/var/run/clickhouse-server/clickhouse-server.pid file exists and contains pid = 1868.
The process with pid = 1868 is running.
Sent terminate signal to process with pid 1868.
Waiting for server to stop
/var/run/clickhouse-server/clickhouse-server.pid file exists and contains pid = 1868.
The process with pid = 1868 is running.
Waiting for server to stop
/var/run/clickhouse-server/clickhouse-server.pid file exists and contains pid = 1868.
The process with pid = 1868 is running.
Waiting for server to stop
/var/run/clickhouse-server/clickhouse-server.pid file exists and contains pid = 1868.
The process with pid = 1868 is running.
Waiting for server to stop
/var/run/clickhouse-server/clickhouse-server.pid file exists and contains pid = 1868.
The process with pid = 1868 is running.
Waiting for server to stop
/var/run/clickhouse-server/clickhouse-server.pid file exists and contains pid = 1868.
The process with pid = 1868 is running.
Waiting for server to stop
/var/run/clickhouse-server/clickhouse-server.pid file exists and contains pid = 1868.
The process with pid = 1868 is running.
Waiting for server to stop
/var/run/clickhouse-server/clickhouse-server.pid file exists and contains pid = 1868.
The process with pid = 1868 is running.
Waiting for server to stop
/var/run/clickhouse-server/clickhouse-server.pid file exists and contains pid = 1868.
The process with pid = 1868 does not exist.
Server stopped
+ return
+ mv /var/log/clickhouse-server/clickhouse-server.log /var/log/clickhouse-server/clickhouse-server.stress.log
+ unset THREAD_FUZZER_CPU_TIME_PERIOD_US THREAD_FUZZER_EXPLICIT_MEMORY_EXCEPTION_PROBABILITY THREAD_FUZZER_EXPLICIT_SLEEP_PROBABILITY THREAD_FUZZER_SLEEP_PROBABILITY THREAD_FUZZER_SLEEP_TIME_US THREAD_FUZZER_pthread_mutex_lock_AFTER_MIGRATE_PROBABILITY THREAD_FUZZER_pthread_mutex_lock_AFTER_SLEEP_PROBABILITY THREAD_FUZZER_pthread_mutex_lock_AFTER_SLEEP_TIME_US THREAD_FUZZER_pthread_mutex_lock_BEFORE_MIGRATE_PROBABILITY THREAD_FUZZER_pthread_mutex_lock_BEFORE_SLEEP_PROBABILITY THREAD_FUZZER_pthread_mutex_lock_BEFORE_SLEEP_TIME_US THREAD_FUZZER_pthread_mutex_unlock_AFTER_MIGRATE_PROBABILITY THREAD_FUZZER_pthread_mutex_unlock_AFTER_SLEEP_PROBABILITY THREAD_FUZZER_pthread_mutex_unlock_AFTER_SLEEP_TIME_US THREAD_FUZZER_pthread_mutex_unlock_BEFORE_MIGRATE_PROBABILITY THREAD_FUZZER_pthread_mutex_unlock_BEFORE_SLEEP_PROBABILITY THREAD_FUZZER_pthread_mutex_unlock_BEFORE_SLEEP_TIME_US
+ start
+ counter=0
+ clickhouse-client --query 'SELECT 1'
Code: 210. DB::NetException: Connection refused (localhost:9000). (NETWORK_ERROR)
+ '[' 0 -gt 120 ']'
+ clickhouse start --user root
+ sleep 0.5
+ counter=1
+ clickhouse-client --query 'SELECT 1'
Code: 210. DB::NetException: Connection refused (localhost:9000). (NETWORK_ERROR)
+ '[' 1 -gt 120 ']'
+ clickhouse start --user root
+ sleep 0.5
+ counter=2
+ clickhouse-client --query 'SELECT 1'
Code: 210. DB::NetException: Connection refused (localhost:9000). (NETWORK_ERROR)
+ '[' 2 -gt 120 ']'
+ clickhouse start --user root
+ sleep 0.5
+ counter=3
+ clickhouse-client --query 'SELECT 1'
Code: 210. DB::NetException: Connection refused (localhost:9000). (NETWORK_ERROR)
+ '[' 3 -gt 120 ']'
+ clickhouse start --user root
+ sleep 0.5
+ counter=4
+ clickhouse-client --query 'SELECT 1'
Code: 210. DB::NetException: Connection refused (localhost:9000). (NETWORK_ERROR)
+ '[' 4 -gt 120 ']'
+ clickhouse start --user root
+ sleep 0.5
+ counter=5
+ clickhouse-client --query 'SELECT 1'
Code: 210. DB::NetException: Connection refused (localhost:9000). (NETWORK_ERROR)
+ '[' 5 -gt 120 ']'
+ clickhouse start --user root
+ sleep 0.5
+ counter=6
+ clickhouse-client --query 'SELECT 1'
Code: 210. DB::NetException: Connection refused (localhost:9000). (NETWORK_ERROR)
+ '[' 6 -gt 120 ']'
+ clickhouse start --user root
+ sleep 0.5
+ counter=7
+ clickhouse-client --query 'SELECT 1'
Code: 210. DB::NetException: Connection refused (localhost:9000). (NETWORK_ERROR)
+ '[' 7 -gt 120 ']'
+ clickhouse start --user root
+ sleep 0.5
127.0.0.1 - - [28/Oct/2026:16:06:08 +0000] "PUT /devstoreaccount1/cont?restype=container HTTP/1.1" 409 -
127.0.0.1 - - [28/Oct/2026:16:06:08 +0000] "PUT /devstoreaccount1/cont/noispfjatqgbsaxdrmnrkjuhqoltfbqs?blockid=ayplyzqawzdmivhhlokfzlekslzhzxiiiqohzcjicohpmdwsnqvoswcfynqfugso&comp=block HTTP/1.1" 201 -
127.0.0.1 - - [28/Oct/2026:16:06:08 +0000] "PUT /devstoreaccount1/cont/noispfjatqgbsaxdrmnrkjuhqoltfbqs?comp=blocklist HTTP/1.1" 201 -
127.0.0.1 - - [28/Oct/2026:16:06:08 +0000] "GET /devstoreaccount1/cont/noispfjatqgbsaxdrmnrkjuhqoltfbqs HTTP/1.1" 206 4
127.0.0.1 - - [28/Oct/2026:16:06:08 +0000] "GET /devstoreaccount1/cont/noispfjatqgbsaxdrmnrkjuhqoltfbqs HTTP/1.1" 206 2
127.0.0.1 - - [28/Oct/2026:16:06:08 +0000] "DELETE /devstoreaccount1/cont/noispfjatqgbsaxdrmnrkjuhqoltfbqs HTTP/1.1" 202 -
+ counter=8
+ clickhouse-client --query 'SELECT 1'
Code: 210. DB::NetException: Connection refused (localhost:9000). (NETWORK_ERROR)
+ '[' 8 -gt 120 ']'
+ clickhouse start --user root
+ sleep 0.5
+ counter=9
+ clickhouse-client --query 'SELECT 1'
Code: 210. DB::NetException: Connection refused (localhost:9000). (NETWORK_ERROR)
+ '[' 9 -gt 120 ']'
+ clickhouse start --user root
+ sleep 0.5
+ counter=10
+ clickhouse-client --query 'SELECT 1'
Code: 210. DB::NetException: Connection refused (localhost:9000). (NETWORK_ERROR)
+ '[' 10 -gt 120 ']'
+ clickhouse start --user root
+ sleep 0.5
+ counter=11
+ clickhouse-client --query 'SELECT 1'
Code: 210. DB::NetException: Connection refused (localhost:9000). (NETWORK_ERROR)
+ '[' 11 -gt 120 ']'
+ clickhouse start --user root
+ sleep 0.5
+ counter=12
+ clickhouse-client --query 'SELECT 1'
1
+ attach_gdb_to_clickhouse
++ kill -l SIGRTMIN
+ RTMIN=34
+ echo '
set follow-fork-mode parent
handle SIGHUP nostop noprint pass
handle SIGINT nostop noprint pass
handle SIGQUIT nostop noprint pass
handle SIGPIPE nostop noprint pass
handle SIGTERM nostop noprint pass
handle SIGUSR1 nostop noprint pass
handle SIGUSR2 nostop noprint pass
handle SIG34 nostop noprint pass
info signals
continue
backtrace full
thread apply all backtrace full
info registers
disassemble /s
up
disassemble /s
up
disassemble /s
p "done"
detach
quit
'
+ sleep 5
+ ts '%Y-%m-%d %H:%M:%S'
++ cat /var/run/clickhouse-server/clickhouse-server.pid
+ gdb -batch -command script.gdb -p 10568
+ run_with_retry 60 clickhouse-client --query 'SELECT '\''Connected to clickhouse-server after attaching gdb'\'''
+ [[ hxB =~ e ]]
+ set_e=false
+ set +e
+ local total_retries=60
+ shift
+ local retry=0
+ '[' 0 -ge 60 ']'
+ clickhouse-client --query 'SELECT '\''Connected to clickhouse-server after attaching gdb'\'''
warning: Missing auto-load script at offset 0 in section .debug_gdb_scripts
of file /usr/bin/clickhouse.
Use `info auto-load python-scripts [REGEXP]' to list them.
Connected to clickhouse-server after attaching gdb
+ false
+ return
+ check_server_start
+ clickhouse-client --query 'SELECT '\''Server successfully started'\'', '\''OK'\'', NULL, '\'''\'''
+ '[' -s /test_output/application_errors.txt ']'
+ rm /test_output/application_errors.txt
rm: cannot remove '/test_output/application_errors.txt': No such file or directory
+ stop
+ local max_tries=90
+ local check_hang=true
+ local pid
++ cat /var/run/clickhouse-server/clickhouse-server.pid
+ pid=10568
+ clickhouse stop --max-tries 90 --do-not-kill
script.gdb:13: Error in sourced command file:
No stack.
/var/run/clickhouse-server/clickhouse-server.pid file exists and contains pid = 10568.
The process with pid = 10568 is running.
Sent terminate signal to process with pid 10568.
Waiting for server to stop
/var/run/clickhouse-server/clickhouse-server.pid file exists and contains pid = 10568.
The process with pid = 10568 is running.
Waiting for server to stop
/var/run/clickhouse-server/clickhouse-server.pid file exists and contains pid = 10568.
The process with pid = 10568 is running.
Waiting for server to stop
/var/run/clickhouse-server/clickhouse-server.pid file exists and contains pid = 10568.
The process with pid = 10568 is running.
Waiting for server to stop
/var/run/clickhouse-server/clickhouse-server.pid file exists and contains pid = 10568.
The process with pid = 10568 is running.
Waiting for server to stop
/var/run/clickhouse-server/clickhouse-server.pid file exists and contains pid = 10568.
The process with pid = 10568 is running.
Waiting for server to stop
/var/run/clickhouse-server/clickhouse-server.pid file exists and contains pid = 10568.
The process with pid = 10568 is running.
Waiting for server to stop
/var/run/clickhouse-server/clickhouse-server.pid file exists and contains pid = 10568.
The process with pid = 10568 is running.
Waiting for server to stop
/var/run/clickhouse-server/clickhouse-server.pid file exists and contains pid = 10568.
The process with pid = 10568 is running.
Waiting for server to stop
Now there is no clickhouse-server process.
Server stopped
+ return
+ '[' -f /var/log/clickhouse-server/clickhouse-server.log ']'
+ '[' -f /var/log/clickhouse-server/stderr.log ']'
+ mv /var/log/clickhouse-server/clickhouse-server.log /var/log/clickhouse-server/clickhouse-server.final.log
+ check_logs_for_critical_errors
+ rg -Fa ================== /var/log/clickhouse-server/stderr.log
+ rg -v 'in query:'
+ rg -Fa WARNING /var/log/clickhouse-server/stderr.log
+ rg -Fav -e 'ASan doesn'\''t fully support makecontext/swapcontext functions' -e DB::Exception /test_output/tmp
+ echo -e 'No sanitizer asserts\tOK\t\N\t'
+ rm -f /test_output/tmp
+ rg -Fa ' Application: Child process was terminated by signal 9' /var/log/clickhouse-server/clickhouse-server.err.log /var/log/clickhouse-server/clickhouse-server.final.log /var/log/clickhouse-server/clickhouse-server.initial.log /var/log/clickhouse-server/clickhouse-server.stress.log
+ echo -e 'No OOM messages in clickhouse-server.log\tOK\t\N\t'
+ rg -Fa 'Code: 49. DB::Exception: ' /var/log/clickhouse-server/clickhouse-server.err.log /var/log/clickhouse-server/clickhouse-server.final.log /var/log/clickhouse-server/clickhouse-server.initial.log /var/log/clickhouse-server/clickhouse-server.stress.log
+ echo -e 'No logical errors\tOK\t\N\t'
+ '[' -s /test_output/logical_errors.txt ']'
+ rm /test_output/logical_errors.txt
+ rg --text 'Code: 499.*The specified key does not exist' /var/log/clickhouse-server/clickhouse-server.err.log /var/log/clickhouse-server/clickhouse-server.final.log /var/log/clickhouse-server/clickhouse-server.initial.log /var/log/clickhouse-server/clickhouse-server.stress.log
+ echo -e 'No lost s3 keys\tOK\t\N\t'
+ '[' -s /test_output/no_such_key_errors.txt ']'
+ rm /test_output/no_such_key_errors.txt
+ rg -Fa '########################################' /var/log/clickhouse-server/clickhouse-server.err.log /var/log/clickhouse-server/clickhouse-server.final.log /var/log/clickhouse-server/clickhouse-server.initial.log /var/log/clickhouse-server/clickhouse-server.stress.log
+ echo -e 'Not crashed\tOK\t\N\t'
+ rg -Fa ' ' /var/log/clickhouse-server/clickhouse-server.err.log /var/log/clickhouse-server/clickhouse-server.final.log /var/log/clickhouse-server/clickhouse-server.initial.log /var/log/clickhouse-server/clickhouse-server.stress.log
+ echo -e 'No fatal messages in clickhouse-server.log\tOK\t\N\t'
+ '[' -s /test_output/fatal_messages.txt ']'
+ rm /test_output/fatal_messages.txt
+ rg -Faz '########################################' /test_output/gdb.log /test_output/stress_run_logs.tar.zst /test_output/test_results.tsv
+ rg -Fa ' received signal ' /test_output/gdb.log
+ dmesg -T
+ grep -q -F -e 'Out of memory: Killed process' -e 'oom_reaper: reaped process' -e oom-kill:constraint=CONSTRAINT_NONE /test_output/dmesg.log
+ echo -e 'No OOM in dmesg\tOK\t\N\t'
+ tar -chf /test_output/coordination.tar /var/lib/clickhouse/coordination
tar: Removing leading `/' from member names
tar: Removing leading `/' from hard link targets
+ collect_query_and_trace_logs
+ for table in query_log trace_log
+ clickhouse-local --path /var/lib/clickhouse/ --only-system-tables -q 'select * from system.query_log format TSVWithNamesAndTypes'
+ zstd --threads=0
+ for table in query_log trace_log
+ clickhouse-local --path /var/lib/clickhouse/ --only-system-tables -q 'select * from system.trace_log format TSVWithNamesAndTypes'
+ zstd --threads=0
+ mv /var/log/clickhouse-server/stderr.log /test_output/
+ clickhouse-local --structure 'test String, res String, time Nullable(Float32), desc String' -q 'SELECT '\''failure'\'', test FROM table WHERE res != '\''OK'\'' order by
(test like '\''%Sanitizer%'\'') DESC,
(test like '\''%Killed by signal%'\'') DESC,
(test like '\''%gdb.log%'\'') DESC,
(test ilike '\''%possible deadlock%'\'') DESC,
(test like '\''%start%'\'') DESC,
(test like '\''%dmesg%'\'') DESC,
(test like '\''%OOM%'\'') DESC,
(test like '\''%Signal 9%'\'') DESC,
(test like '\''%Fatal message%'\'') DESC,
rowNumberInAllBlocks()
LIMIT 1'
+ '[' -s /test_output/check_status.tsv ']'
+ echo -e 'success\tNo errors found'
+ rg 'OOM in dmesg|Signal 9' /test_output/check_status.tsv
+ collect_core_dumps
+ read core
+ find . -type f -maxdepth 1 -name 'core.*'