+ ln -s /usr/share/clickhouse-test/ci/stress.py /usr/bin/stress
+ ln -s /usr/share/clickhouse-test/clickhouse-test /usr/bin/clickhouse-test
+ source /attach_gdb.lib
++ source /utils.lib
+++ sysctl kernel.core_pattern=core.%e.%p-%P
kernel.core_pattern = core.%e.%p-%P
+++ sysctl fs.suid_dumpable=1
fs.suid_dumpable = 1
+ source /stress_tests.lib
++ OK='\tOK\t\N\t'
++ FAIL='\tFAIL\t\N\t'
++ FAILURE_CONTEXT_LINES=100
++ FAILURE_CONTEXT_MAX_LINE_WIDTH=300
+ source /utils.lib
++ sysctl kernel.core_pattern=core.%e.%p-%P
kernel.core_pattern = core.%e.%p-%P
++ sysctl fs.suid_dumpable=1
fs.suid_dumpable = 1
+ install_packages package_folder
+ dpkg -i package_folder/clickhouse-common-static_24.8.14.10550.altinitytest+ubsan_amd64.deb
Selecting previously unselected package clickhouse-common-static.
(Reading database ... 48695 files and directories currently installed.)
Preparing to unpack .../clickhouse-common-static_24.8.14.10550.altinitytest+ubsan_amd64.deb ...
Unpacking clickhouse-common-static (24.8.14.10550.altinitytest+ubsan) ...
Setting up clickhouse-common-static (24.8.14.10550.altinitytest+ubsan) ...
+ dpkg -i package_folder/clickhouse-common-static-dbg_24.8.14.10550.altinitytest+ubsan_amd64.deb
Selecting previously unselected package clickhouse-common-static-dbg.
(Reading database ... 48722 files and directories currently installed.)
Preparing to unpack .../clickhouse-common-static-dbg_24.8.14.10550.altinitytest+ubsan_amd64.deb ...
Unpacking clickhouse-common-static-dbg (24.8.14.10550.altinitytest+ubsan) ...
Setting up clickhouse-common-static-dbg (24.8.14.10550.altinitytest+ubsan) ...
+ dpkg -i package_folder/clickhouse-server_24.8.14.10550.altinitytest+ubsan_amd64.deb
Selecting previously unselected package clickhouse-server.
(Reading database ... 48729 files and directories currently installed.)
Preparing to unpack .../clickhouse-server_24.8.14.10550.altinitytest+ubsan_amd64.deb ...
Unpacking clickhouse-server (24.8.14.10550.altinitytest+ubsan) ...
Setting up clickhouse-server (24.8.14.10550.altinitytest+ubsan) ...
ClickHouse binary is already located at /usr/bin/clickhouse
Symlink /usr/bin/clickhouse-server already exists but it points to /clickhouse. Will replace the old symlink to /usr/bin/clickhouse.
Creating symlink /usr/bin/clickhouse-server to /usr/bin/clickhouse.
Creating symlink /usr/bin/clickhouse-client to /usr/bin/clickhouse.
Creating symlink /usr/bin/clickhouse-local to /usr/bin/clickhouse.
Creating symlink /usr/bin/clickhouse-benchmark to /usr/bin/clickhouse.
Creating symlink /usr/bin/clickhouse-obfuscator to /usr/bin/clickhouse.
Creating symlink /usr/bin/clickhouse-git-import to /usr/bin/clickhouse.
Creating symlink /usr/bin/clickhouse-compressor to /usr/bin/clickhouse.
Creating symlink /usr/bin/clickhouse-format to /usr/bin/clickhouse.
Symlink /usr/bin/clickhouse-extract-from-config already exists but it points to /clickhouse. Will replace the old symlink to /usr/bin/clickhouse.
Creating symlink /usr/bin/clickhouse-extract-from-config to /usr/bin/clickhouse.
Symlink /usr/bin/clickhouse-keeper already exists but it points to /clickhouse. Will replace the old symlink to /usr/bin/clickhouse.
Creating symlink /usr/bin/clickhouse-keeper to /usr/bin/clickhouse.
Symlink /usr/bin/clickhouse-keeper-converter already exists but it points to /clickhouse. Will replace the old symlink to /usr/bin/clickhouse.
Creating symlink /usr/bin/clickhouse-keeper-converter to /usr/bin/clickhouse.
Creating symlink /usr/bin/clickhouse-disks to /usr/bin/clickhouse.
Creating symlink /usr/bin/ch to /usr/bin/clickhouse.
Creating symlink /usr/bin/chl to /usr/bin/clickhouse.
Creating symlink /usr/bin/chc to /usr/bin/clickhouse.
Creating clickhouse group if it does not exist.
groupadd -r clickhouse
Creating clickhouse user if it does not exist.
useradd -r --shell /bin/false --home-dir /nonexistent -g clickhouse clickhouse
Will set ulimits for clickhouse user in /etc/security/limits.d/clickhouse.conf.
Creating config directory /etc/clickhouse-server/config.d that is used for tweaks of main server configuration.
Creating config directory /etc/clickhouse-server/users.d that is used for tweaks of users configuration.
Config file /etc/clickhouse-server/config.xml already exists, will keep it and extract path info from it.
/etc/clickhouse-server/config.xml has /var/lib/clickhouse/ as data path.
/etc/clickhouse-server/config.xml has /var/log/clickhouse-server/ as log path.
Users config file /etc/clickhouse-server/users.xml already exists, will keep it and extract users info from it.
Log directory /var/log/clickhouse-server/ already exists.
Creating data directory /var/lib/clickhouse/.
Creating pid directory /var/run/clickhouse-server.
chown -R clickhouse:clickhouse '/var/log/clickhouse-server/'
chown -R clickhouse:clickhouse '/var/run/clickhouse-server'
chown clickhouse:clickhouse '/var/lib/clickhouse/'
Password for the default user is an empty string. See /etc/clickhouse-server/users.xml and /etc/clickhouse-server/users.d to change it.
Setting capabilities for clickhouse binary. This is optional.
chown -R clickhouse:clickhouse '/etc/clickhouse-server'
ClickHouse has been successfully installed.
Start clickhouse-server with:
sudo clickhouse start
Start clickhouse-client with:
clickhouse-client
+ dpkg -i package_folder/clickhouse-client_24.8.14.10550.altinitytest+ubsan_amd64.deb
Selecting previously unselected package clickhouse-client.
(Reading database ... 48746 files and directories currently installed.)
Preparing to unpack .../clickhouse-client_24.8.14.10550.altinitytest+ubsan_amd64.deb ...
Unpacking clickhouse-client (24.8.14.10550.altinitytest+ubsan) ...
Setting up clickhouse-client (24.8.14.10550.altinitytest+ubsan) ...
+ export THREAD_FUZZER_CPU_TIME_PERIOD_US=1000
+ THREAD_FUZZER_CPU_TIME_PERIOD_US=1000
+ export THREAD_FUZZER_SLEEP_PROBABILITY=0.1
+ THREAD_FUZZER_SLEEP_PROBABILITY=0.1
+ export THREAD_FUZZER_SLEEP_TIME_US_MAX=100000
+ THREAD_FUZZER_SLEEP_TIME_US_MAX=100000
+ export THREAD_FUZZER_pthread_mutex_lock_BEFORE_MIGRATE_PROBABILITY=1
+ THREAD_FUZZER_pthread_mutex_lock_BEFORE_MIGRATE_PROBABILITY=1
+ export THREAD_FUZZER_pthread_mutex_lock_AFTER_MIGRATE_PROBABILITY=1
+ THREAD_FUZZER_pthread_mutex_lock_AFTER_MIGRATE_PROBABILITY=1
+ export THREAD_FUZZER_pthread_mutex_unlock_BEFORE_MIGRATE_PROBABILITY=1
+ THREAD_FUZZER_pthread_mutex_unlock_BEFORE_MIGRATE_PROBABILITY=1
+ export THREAD_FUZZER_pthread_mutex_unlock_AFTER_MIGRATE_PROBABILITY=1
+ THREAD_FUZZER_pthread_mutex_unlock_AFTER_MIGRATE_PROBABILITY=1
+ export THREAD_FUZZER_pthread_mutex_lock_BEFORE_SLEEP_PROBABILITY=0.001
+ THREAD_FUZZER_pthread_mutex_lock_BEFORE_SLEEP_PROBABILITY=0.001
+ export THREAD_FUZZER_pthread_mutex_lock_AFTER_SLEEP_PROBABILITY=0.001
+ THREAD_FUZZER_pthread_mutex_lock_AFTER_SLEEP_PROBABILITY=0.001
+ export THREAD_FUZZER_pthread_mutex_unlock_BEFORE_SLEEP_PROBABILITY=0.001
+ THREAD_FUZZER_pthread_mutex_unlock_BEFORE_SLEEP_PROBABILITY=0.001
+ export THREAD_FUZZER_pthread_mutex_unlock_AFTER_SLEEP_PROBABILITY=0.001
+ THREAD_FUZZER_pthread_mutex_unlock_AFTER_SLEEP_PROBABILITY=0.001
+ export THREAD_FUZZER_pthread_mutex_lock_BEFORE_SLEEP_TIME_US_MAX=10000
+ THREAD_FUZZER_pthread_mutex_lock_BEFORE_SLEEP_TIME_US_MAX=10000
+ export THREAD_FUZZER_pthread_mutex_lock_AFTER_SLEEP_TIME_US_MAX=10000
+ THREAD_FUZZER_pthread_mutex_lock_AFTER_SLEEP_TIME_US_MAX=10000
+ export THREAD_FUZZER_pthread_mutex_unlock_BEFORE_SLEEP_TIME_US_MAX=10000
+ THREAD_FUZZER_pthread_mutex_unlock_BEFORE_SLEEP_TIME_US_MAX=10000
+ export THREAD_FUZZER_pthread_mutex_unlock_AFTER_SLEEP_TIME_US_MAX=10000
+ THREAD_FUZZER_pthread_mutex_unlock_AFTER_SLEEP_TIME_US_MAX=10000
+ export THREAD_FUZZER_EXPLICIT_SLEEP_PROBABILITY=0.01
+ THREAD_FUZZER_EXPLICIT_SLEEP_PROBABILITY=0.01
+ export THREAD_FUZZER_EXPLICIT_MEMORY_EXCEPTION_PROBABILITY=0.01
+ THREAD_FUZZER_EXPLICIT_MEMORY_EXCEPTION_PROBABILITY=0.01
+ export ZOOKEEPER_FAULT_INJECTION=1
+ ZOOKEEPER_FAULT_INJECTION=1
+ configure
+ export USE_DATABASE_ORDINARY=1
+ USE_DATABASE_ORDINARY=1
+ export EXPORT_S3_STORAGE_POLICIES=1
+ EXPORT_S3_STORAGE_POLICIES=1
+ /usr/share/clickhouse-test/config/install.sh
+ DEST_SERVER_PATH=/etc/clickhouse-server
+ DEST_CLIENT_PATH=/etc/clickhouse-client
+++ dirname /usr/share/clickhouse-test/config/install.sh
++ cd /usr/share/clickhouse-test/config
++ pwd -P
Going to install test configs from /usr/share/clickhouse-test/config into /etc/clickhouse-server
+ SRC_PATH=/usr/share/clickhouse-test/config
+ echo 'Going to install test configs from /usr/share/clickhouse-test/config into /etc/clickhouse-server'
+ mkdir -p /etc/clickhouse-server/config.d/
+ mkdir -p /etc/clickhouse-server/users.d/
+ mkdir -p /etc/clickhouse-client
+ ln -sf /usr/share/clickhouse-test/config/config.d/zookeeper_write.xml /etc/clickhouse-server/config.d/
+ ln -sf /usr/share/clickhouse-test/config/config.d/max_num_to_warn.xml /etc/clickhouse-server/config.d/
+ ln -sf /usr/share/clickhouse-test/config/config.d/listen.xml /etc/clickhouse-server/config.d/
+ ln -sf /usr/share/clickhouse-test/config/config.d/text_log.xml /etc/clickhouse-server/config.d/
+ ln -sf /usr/share/clickhouse-test/config/config.d/blob_storage_log.xml /etc/clickhouse-server/config.d/
+ ln -sf /usr/share/clickhouse-test/config/config.d/custom_settings_prefixes.xml /etc/clickhouse-server/config.d/
+ ln -sf /usr/share/clickhouse-test/config/config.d/database_catalog_drop_table_concurrency.xml /etc/clickhouse-server/config.d/
+ ln -sf /usr/share/clickhouse-test/config/config.d/enable_access_control_improvements.xml /etc/clickhouse-server/config.d/
+ ln -sf /usr/share/clickhouse-test/config/config.d/macros.xml /etc/clickhouse-server/config.d/
+ ln -sf /usr/share/clickhouse-test/config/config.d/secure_ports.xml /etc/clickhouse-server/config.d/
+ ln -sf /usr/share/clickhouse-test/config/config.d/clusters.xml /etc/clickhouse-server/config.d/
+ ln -sf /usr/share/clickhouse-test/config/config.d/graphite.xml /etc/clickhouse-server/config.d/
+ ln -sf /usr/share/clickhouse-test/config/config.d/graphite_alternative.xml /etc/clickhouse-server/config.d/
+ ln -sf /usr/share/clickhouse-test/config/config.d/grpc_protocol.xml /etc/clickhouse-server/config.d/
+ ln -sf /usr/share/clickhouse-test/config/config.d/database_atomic.xml /etc/clickhouse-server/config.d/
+ ln -sf /usr/share/clickhouse-test/config/config.d/max_concurrent_queries.xml /etc/clickhouse-server/config.d/
+ ln -sf /usr/share/clickhouse-test/config/config.d/merge_tree_settings.xml /etc/clickhouse-server/config.d/
+ ln -sf /usr/share/clickhouse-test/config/config.d/backoff_failed_mutation.xml /etc/clickhouse-server/config.d/
+ ln -sf /usr/share/clickhouse-test/config/config.d/merge_tree_old_dirs_cleanup.xml /etc/clickhouse-server/config.d/
+ ln -sf /usr/share/clickhouse-test/config/config.d/test_cluster_with_incorrect_pw.xml /etc/clickhouse-server/config.d/
+ ln -sf /usr/share/clickhouse-test/config/config.d/keeper_port.xml /etc/clickhouse-server/config.d/
+ ln -sf /usr/share/clickhouse-test/config/config.d/logging_no_rotate.xml /etc/clickhouse-server/config.d/
+ ln -sf /usr/share/clickhouse-test/config/config.d/merge_tree.xml /etc/clickhouse-server/config.d/
+ ln -sf /usr/share/clickhouse-test/config/config.d/lost_forever_check.xml /etc/clickhouse-server/config.d/
+ ln -sf /usr/share/clickhouse-test/config/config.d/tcp_with_proxy.xml /etc/clickhouse-server/config.d/
+ ln -sf /usr/share/clickhouse-test/config/config.d/prometheus.xml /etc/clickhouse-server/config.d/
+ ln -sf /usr/share/clickhouse-test/config/config.d/top_level_domains_lists.xml /etc/clickhouse-server/config.d/
+ ln -sf /usr/share/clickhouse-test/config/config.d/top_level_domains_path.xml /etc/clickhouse-server/config.d/
+ ln -sf /usr/share/clickhouse-test/config/config.d/transactions.xml /etc/clickhouse-server/config.d/
+ ln -sf /usr/share/clickhouse-test/config/config.d/encryption.xml /etc/clickhouse-server/config.d/
+ ln -sf /usr/share/clickhouse-test/config/config.d/CORS.xml /etc/clickhouse-server/config.d/
+ ln -sf /usr/share/clickhouse-test/config/config.d/zookeeper_log.xml /etc/clickhouse-server/config.d/
+ ln -sf /usr/share/clickhouse-test/config/config.d/logger_trace.xml /etc/clickhouse-server/config.d/
+ ln -sf /usr/share/clickhouse-test/config/config.d/named_collection.xml /etc/clickhouse-server/config.d/
+ ln -sf /usr/share/clickhouse-test/config/config.d/ssl_certs.xml /etc/clickhouse-server/config.d/
+ ln -sf /usr/share/clickhouse-test/config/config.d/filesystem_cache_log.xml /etc/clickhouse-server/config.d/
+ ln -sf /usr/share/clickhouse-test/config/config.d/session_log.xml /etc/clickhouse-server/config.d/
+ ln -sf /usr/share/clickhouse-test/config/config.d/system_unfreeze.xml /etc/clickhouse-server/config.d/
+ ln -sf /usr/share/clickhouse-test/config/config.d/enable_zero_copy_replication.xml /etc/clickhouse-server/config.d/
+ ln -sf /usr/share/clickhouse-test/config/config.d/nlp.xml /etc/clickhouse-server/config.d/
+ ln -sf /usr/share/clickhouse-test/config/config.d/forbidden_headers.xml /etc/clickhouse-server/config.d/
+ ln -sf /usr/share/clickhouse-test/config/config.d/enable_keeper_map.xml /etc/clickhouse-server/config.d/
+ ln -sf /usr/share/clickhouse-test/config/config.d/custom_disks_base_path.xml /etc/clickhouse-server/config.d/
+ ln -sf /usr/share/clickhouse-test/config/config.d/display_name.xml /etc/clickhouse-server/config.d/
+ ln -sf /usr/share/clickhouse-test/config/config.d/compressed_marks_and_index.xml /etc/clickhouse-server/config.d/
+ ln -sf /usr/share/clickhouse-test/config/config.d/disable_s3_env_credentials.xml /etc/clickhouse-server/config.d/
+ ln -sf /usr/share/clickhouse-test/config/config.d/enable_wait_for_shutdown_replicated_tables.xml /etc/clickhouse-server/config.d/
+ ln -sf /usr/share/clickhouse-test/config/config.d/backups.xml /etc/clickhouse-server/config.d/
+ ln -sf /usr/share/clickhouse-test/config/config.d/filesystem_caches_path.xml /etc/clickhouse-server/config.d/
+ ln -sf /usr/share/clickhouse-test/config/config.d/validate_tcp_client_information.xml /etc/clickhouse-server/config.d/
+ ln -sf /usr/share/clickhouse-test/config/config.d/zero_copy_destructive_operations.xml /etc/clickhouse-server/config.d/
+ ln -sf /usr/share/clickhouse-test/config/config.d/block_number.xml /etc/clickhouse-server/config.d/
+ ln -sf /usr/share/clickhouse-test/config/config.d/handlers.yaml /etc/clickhouse-server/config.d/
+ ln -sf /usr/share/clickhouse-test/config/config.d/serverwide_trace_collector.xml /etc/clickhouse-server/config.d/
+ ln -sf /usr/share/clickhouse-test/config/config.d/rocksdb.xml /etc/clickhouse-server/config.d/
+ '[' /etc/clickhouse-server = /etc/clickhouse-server ']'
+ ln -sf /usr/share/clickhouse-test/config/config.d/legacy_geobase.xml /etc/clickhouse-server/config.d/
+ ln -sf /usr/share/clickhouse-test/config/users.d/log_queries.xml /etc/clickhouse-server/users.d/
+ ln -sf /usr/share/clickhouse-test/config/users.d/readonly.xml /etc/clickhouse-server/users.d/
+ ln -sf /usr/share/clickhouse-test/config/users.d/access_management.xml /etc/clickhouse-server/users.d/
+ ln -sf /usr/share/clickhouse-test/config/users.d/database_atomic_drop_detach_sync.xml /etc/clickhouse-server/users.d/
+ ln -sf /usr/share/clickhouse-test/config/users.d/opentelemetry.xml /etc/clickhouse-server/users.d/
+ ln -sf /usr/share/clickhouse-test/config/users.d/remote_queries.xml /etc/clickhouse-server/users.d/
+ ln -sf /usr/share/clickhouse-test/config/users.d/session_log_test.xml /etc/clickhouse-server/users.d/
+ ln -sf /usr/share/clickhouse-test/config/users.d/memory_profiler.xml /etc/clickhouse-server/users.d/
+ ln -sf /usr/share/clickhouse-test/config/users.d/no_fsync_metadata.xml /etc/clickhouse-server/users.d/
+ ln -sf /usr/share/clickhouse-test/config/users.d/filelog.xml /etc/clickhouse-server/users.d/
+ ln -sf /usr/share/clickhouse-test/config/users.d/enable_blobs_check.xml /etc/clickhouse-server/users.d/
+ ln -sf /usr/share/clickhouse-test/config/users.d/marks.xml /etc/clickhouse-server/users.d/
+ ln -sf /usr/share/clickhouse-test/config/users.d/insert_keeper_retries.xml /etc/clickhouse-server/users.d/
+ ln -sf /usr/share/clickhouse-test/config/users.d/prefetch_settings.xml /etc/clickhouse-server/users.d/
+ ln -sf /usr/share/clickhouse-test/config/users.d/nonconst_timezone.xml /etc/clickhouse-server/users.d/
+ ln -sf /usr/share/clickhouse-test/config/users.d/allow_introspection_functions.yaml /etc/clickhouse-server/users.d/
+ ln -sf /usr/share/clickhouse-test/config/users.d/replicated_ddl_entry.xml /etc/clickhouse-server/users.d/
+ [[ -n '' ]]
+ ln -sf /usr/share/clickhouse-test/config/users.d/timeouts.xml /etc/clickhouse-server/users.d/
+ ln -sf /usr/share/clickhouse-test/config/ints_dictionary.xml /etc/clickhouse-server/
+ ln -sf /usr/share/clickhouse-test/config/strings_dictionary.xml /etc/clickhouse-server/
+ ln -sf /usr/share/clickhouse-test/config/decimals_dictionary.xml /etc/clickhouse-server/
+ ln -sf /usr/share/clickhouse-test/config/executable_dictionary.xml /etc/clickhouse-server/
+ ln -sf /usr/share/clickhouse-test/config/executable_pool_dictionary.xml /etc/clickhouse-server/
+ ln -sf /usr/share/clickhouse-test/config/test_function.xml /etc/clickhouse-server/
+ ln -sf /usr/share/clickhouse-test/config/top_level_domains /etc/clickhouse-server/
+ ln -sf /usr/share/clickhouse-test/config/regions_hierarchy.txt /etc/clickhouse-server/config.d/
+ ln -sf /usr/share/clickhouse-test/config/regions_names_en.txt /etc/clickhouse-server/config.d/
+ ln -sf /usr/share/clickhouse-test/config/ext-en.txt /etc/clickhouse-server/config.d/
+ ln -sf /usr/share/clickhouse-test/config/ext-ru.txt /etc/clickhouse-server/config.d/
+ ln -sf /usr/share/clickhouse-test/config/lem-en.bin /etc/clickhouse-server/config.d/
+ ln -sf /usr/share/clickhouse-test/config/server.key /etc/clickhouse-server/
+ ln -sf /usr/share/clickhouse-test/config/server.crt /etc/clickhouse-server/
+ ln -sf /usr/share/clickhouse-test/config/dhparam.pem /etc/clickhouse-server/
+ ln -sf --backup=simple --suffix=_original.xml /usr/share/clickhouse-test/config/config.d/query_masking_rules.xml /etc/clickhouse-server/config.d/
+ [[ -n 1 ]]
+ [[ 1 -eq 1 ]]
+ rm -f /etc/clickhouse-server/config.d/zookeeper.xml
+ ln -sf /usr/share/clickhouse-test/config/config.d/zookeeper_fault_injection.xml /etc/clickhouse-server/config.d/
+ [[ -n '' ]]
+ rm -f /etc/clickhouse-server/config.d/cannot_allocate_thread_injection.xml
+ value=0
+ sed --follow-symlinks -i 's|[01]|0|' /etc/clickhouse-server/config.d/keeper_port.xml
+ value=49715200
+ sed --follow-symlinks -i 's|[[:digit:]]\+|49715200|' /etc/clickhouse-server/config.d/keeper_port.xml
+ value=13842432
+ sed --follow-symlinks -i 's|[[:digit:]]\+|13842432|' /etc/clickhouse-server/config.d/keeper_port.xml
+ [[ -n '' ]]
+ [[ -n 1 ]]
+ [[ 1 -eq 1 ]]
+ ln -sf /usr/share/clickhouse-test/config/users.d/database_ordinary.xml /etc/clickhouse-server/users.d/
+ [[ '' == \1 ]]
+ [[ '' == \1 ]]
+ [[ -n 1 ]]
+ ln -sf /usr/share/clickhouse-test/config/config.d/azure_storage_conf.xml /etc/clickhouse-server/config.d/
+ ln -sf /usr/share/clickhouse-test/config/config.d/storage_conf.xml /etc/clickhouse-server/config.d/
+ ln -sf /usr/share/clickhouse-test/config/config.d/storage_conf_02944.xml /etc/clickhouse-server/config.d/
+ ln -sf /usr/share/clickhouse-test/config/config.d/storage_conf_02963.xml /etc/clickhouse-server/config.d/
+ ln -sf /usr/share/clickhouse-test/config/config.d/storage_conf_02961.xml /etc/clickhouse-server/config.d/
+ ln -sf /usr/share/clickhouse-test/config/users.d/s3_cache.xml /etc/clickhouse-server/users.d/
+ ln -sf /usr/share/clickhouse-test/config/users.d/s3_cache_new.xml /etc/clickhouse-server/users.d/
+ [[ -n '' ]]
+ ln -sf /usr/share/clickhouse-test/config/client_config.xml /etc/clickhouse-client/config.xml
+ sudo cat /etc/clickhouse-server/config.d/keeper_port.xml
+ sed 's|100000|10000|'
+ sudo mv /etc/clickhouse-server/config.d/keeper_port.xml.tmp /etc/clickhouse-server/config.d/keeper_port.xml
+ [[ -n 1 ]]
+ [[ 1 -eq 1 ]]
+ randomize_config_boolean_value filtered_list keeper_port
+ value=1
+ sed 's|[01]|1|'
+ sudo cat /etc/clickhouse-server/config.d/keeper_port.xml
+ sudo mv /etc/clickhouse-server/config.d/keeper_port.xml.tmp /etc/clickhouse-server/config.d/keeper_port.xml
+ randomize_config_boolean_value multi_read keeper_port
+ value=1
+ sudo cat /etc/clickhouse-server/config.d/keeper_port.xml
+ sed 's|[01]|1|'
+ sudo mv /etc/clickhouse-server/config.d/keeper_port.xml.tmp /etc/clickhouse-server/config.d/keeper_port.xml
+ randomize_config_boolean_value check_not_exists keeper_port
+ value=0
+ sudo cat /etc/clickhouse-server/config.d/keeper_port.xml
+ sed 's|[01]|0|'
+ sudo mv /etc/clickhouse-server/config.d/keeper_port.xml.tmp /etc/clickhouse-server/config.d/keeper_port.xml
+ randomize_config_boolean_value create_if_not_exists keeper_port
+ value=0
+ sudo cat /etc/clickhouse-server/config.d/keeper_port.xml
+ sed 's|[01]|0|'
+ sudo mv /etc/clickhouse-server/config.d/keeper_port.xml.tmp /etc/clickhouse-server/config.d/keeper_port.xml
+ sudo chown clickhouse /etc/clickhouse-server/config.d/keeper_port.xml
+ sudo chgrp clickhouse /etc/clickhouse-server/config.d/keeper_port.xml
+ [[ -n 1 ]]
+ [[ 1 -eq 1 ]]
+ randomize_config_boolean_value use_compression zookeeper_fault_injection
+ value=1
+ sudo cat /etc/clickhouse-server/config.d/zookeeper_fault_injection.xml
+ sed 's|[01]|1|'
+ sudo mv /etc/clickhouse-server/config.d/zookeeper_fault_injection.xml.tmp /etc/clickhouse-server/config.d/zookeeper_fault_injection.xml
+ randomize_config_boolean_value enable_block_number_column block_number
+ value=1
+ sudo cat /etc/clickhouse-server/config.d/block_number.xml
+ sed 's|[01]|1|'
+ sudo mv /etc/clickhouse-server/config.d/block_number.xml.tmp /etc/clickhouse-server/config.d/block_number.xml
+ randomize_config_boolean_value enable_block_offset_column block_number
+ value=1
+ sudo cat /etc/clickhouse-server/config.d/block_number.xml
+ sed 's|[01]|1|'
+ sudo mv /etc/clickhouse-server/config.d/block_number.xml.tmp /etc/clickhouse-server/config.d/block_number.xml
+ echo 'ASAN_OPTIONS='\''malloc_context_size=10 verbosity=1 allocator_release_to_os_interval_ms=10000'\'''
+ export 'ASAN_OPTIONS=malloc_context_size=10 allocator_release_to_os_interval_ms=10000'
+ ASAN_OPTIONS='malloc_context_size=10 allocator_release_to_os_interval_ms=10000'
+ sudo chown root: /var/lib/clickhouse
+ local total_mem
++ awk '/MemTotal/ { print $(NF-1) }' /proc/meminfo
+ total_mem=32080792
+ total_mem=32850731008
+ max_server_memory_usage_to_ram_ratio=0.5
+ echo 'Setting max_server_memory_usage_to_ram_ratio to 0.5'
+ cat
Setting max_server_memory_usage_to_ram_ratio to 0.5
+ local max_users_mem
+ max_users_mem=9855219302
+ echo 'Setting max_memory_usage_for_user=9855219302 and max_memory_usage for queries to 10G'
+ cat
Setting max_memory_usage_for_user=9855219302 and max_memory_usage for queries to 10G
+ cat
+ ./setup_minio.sh stateless
+ azurite-blob --blobHost 0.0.0.0 --blobPort 10000 --debug /azurite_log
+ export MINIO_ROOT_USER=clickhouse
+ MINIO_ROOT_USER=clickhouse
+ export MINIO_ROOT_PASSWORD=clickhouse
+ MINIO_ROOT_PASSWORD=clickhouse
+ main stateless
+ local query_dir
++ check_arg stateless
++ local query_dir
++ '[' '!' 1 -eq 1 ']'
++ case "$1" in
++ query_dir=0_stateless
++ echo 0_stateless
+ query_dir=0_stateless
+ '[' '!' -f ./minio ']'
+ start_minio
+ mkdir -p ./minio_data
+ ./minio --version
minio version RELEASE.2024-08-03T04-33-23Z (commit-id=6efb56851c40da88d1ca15112e2d686a4ecec6b3)
Runtime: go1.22.5 linux/amd64
License: GNU AGPLv3 - https://www.gnu.org/licenses/agpl-3.0.html
Copyright: 2015-2024 MinIO, Inc.
+ wait_for_it
+ local counter=0
+ local max_counter=60
+ ./minio server --address :11111 ./minio_data
+ local url=http://localhost:11111
+ params=('--silent' '--verbose')
+ local params
+ curl --silent --verbose http://localhost:11111
+ grep AccessDenied
trying to connect to minio
+ [[ 0 == \6\0 ]]
+ echo 'trying to connect to minio'
+ sleep 1
INFO: Formatting 1st pool, 1 set(s), 1 drives per set.
INFO: WARNING: Host local has more than 0 drives of set. A host failure will result in data becoming unavailable.
Azurite Blob service is starting on 0.0.0.0:10000
MinIO Object Storage Server
Copyright: 2015-2026 MinIO, Inc.
License: GNU AGPLv3 - https://www.gnu.org/licenses/agpl-3.0.html
Version: RELEASE.2024-08-03T04-33-23Z (go1.22.5 linux/amd64)
API: http://172.17.0.2:11111 http://127.0.0.1:11111
WebUI: http://172.17.0.2:40089 http://127.0.0.1:40089
Docs: https://min.io/docs/minio/linux/index.html
Azurite Blob service successfully listens on http://0.0.0.0:10000
+ counter=1
+ curl --silent --verbose http://localhost:11111
+ grep AccessDenied
AccessDeniedAccess Denied./18E35CA4CEAA6C957dc7eb22d3288ec80374614e9088e31d3668a6922ead55932dd2a8e56373820f
+ lsof -i :11111
COMMAND PID USER FD TYPE DEVICE SIZE/OFF NODE NAME
minio 276 root 8u IPv6 33527 0t0 TCP *:11111 (LISTEN)
minio 276 root 9u IPv4 33526 0t0 TCP localhost:11111 (LISTEN)
minio 276 root 10u IPv6 33528 0t0 TCP localhost:11111 (LISTEN)
+ sleep 5
+ setup_minio stateless
+ local test_type=stateless
+ ./mc alias set clickminio http://localhost:11111 clickhouse clickhouse
Added `clickminio` successfully.
+ ./mc admin user add clickminio test testtest
Added user `test` successfully.
+ ./mc admin policy attach clickminio readwrite --user=test
Attached Policies: [readwrite]
To User: test
+ ./mc mb --ignore-existing clickminio/test
Bucket created successfully `clickminio/test`.
+ '[' stateless = stateless ']'
+ ./mc anonymous set public clickminio/test
Access permission for `clickminio/test` is set to `public`
+ upload_data 0_stateless /usr/share/clickhouse-test
+ local query_dir=0_stateless
+ local test_path=/usr/share/clickhouse-test
+ local data_path=/usr/share/clickhouse-test/queries/0_stateless/data_minio
+ '[' -d /usr/share/clickhouse-test/queries/0_stateless/data_minio ']'
+ ./mc cp --recursive /usr/share/clickhouse-test/queries/0_stateless/data_minio/ clickminio/test/
`/usr/share/clickhouse-test/queries/0_stateless/data_minio/02366_data.jsonl` -> `clickminio/test/02366_data.jsonl`
`/usr/share/clickhouse-test/queries/0_stateless/data_minio/02876.parquet` -> `clickminio/test/02876.parquet`
`/usr/share/clickhouse-test/queries/0_stateless/data_minio/02731.parquet` -> `clickminio/test/02731.parquet`
`/usr/share/clickhouse-test/queries/0_stateless/data_minio/02731.arrow` -> `clickminio/test/02731.arrow`
`/usr/share/clickhouse-test/queries/0_stateless/data_minio/03036_archive1.tar` -> `clickminio/test/03036_archive1.tar`
`/usr/share/clickhouse-test/queries/0_stateless/data_minio/03036_archive1.zip` -> `clickminio/test/03036_archive1.zip`
`/usr/share/clickhouse-test/queries/0_stateless/data_minio/03036_archive2.tar` -> `clickminio/test/03036_archive2.tar`
`/usr/share/clickhouse-test/queries/0_stateless/data_minio/03036_archive2.zip` -> `clickminio/test/03036_archive2.zip`
`/usr/share/clickhouse-test/queries/0_stateless/data_minio/03036_archive3.tar.gz` -> `clickminio/test/03036_archive3.tar.gz`
`/usr/share/clickhouse-test/queries/0_stateless/data_minio/03036_compressed_file_archive.zip` -> `clickminio/test/03036_compressed_file_archive.zip`
`/usr/share/clickhouse-test/queries/0_stateless/data_minio/03036_json_archive.zip` -> `clickminio/test/03036_json_archive.zip`
`/usr/share/clickhouse-test/queries/0_stateless/data_minio/a.tsv` -> `clickminio/test/a.tsv`
`/usr/share/clickhouse-test/queries/0_stateless/data_minio/b.tsv` -> `clickminio/test/b.tsv`
`/usr/share/clickhouse-test/queries/0_stateless/data_minio/c.tsv` -> `clickminio/test/c.tsv`
`/usr/share/clickhouse-test/queries/0_stateless/data_minio/hive_partitioning/column0=Elizabeth/column1=Gordon/sample.parquet` -> `clickminio/test/hive_partitioning/column0=Elizabeth/column1=Gordon/sample.parquet`
`/usr/share/clickhouse-test/queries/0_stateless/data_minio/hive_partitioning/column0=Elizabeth/column1=Schmidt/sample.parquet` -> `clickminio/test/hive_partitioning/column0=Elizabeth/column1=Schmidt/sample.parquet`
`/usr/share/clickhouse-test/queries/0_stateless/data_minio/hive_partitioning/column0=Elizabeth/sample.parquet` -> `clickminio/test/hive_partitioning/column0=Elizabeth/sample.parquet`
`/usr/share/clickhouse-test/queries/0_stateless/data_minio/hive_partitioning/non_existing_column=Elizabeth/sample.parquet` -> `clickminio/test/hive_partitioning/non_existing_column=Elizabeth/sample.parquet`
`/usr/share/clickhouse-test/queries/0_stateless/data_minio/json_data` -> `clickminio/test/json_data`
`/usr/share/clickhouse-test/queries/0_stateless/data_minio/tsv_with_header.tsv` -> `clickminio/test/tsv_with_header.tsv`
Total: 5.42 MiB, Transferred: 5.42 MiB, Speed: 150.86 MiB/s
+ setup_aws_credentials
+ local minio_root_user=clickhouse
+ local minio_root_password=clickhouse
+ mkdir -p /root/.aws
+ cat
+ config_logs_export_cluster /etc/clickhouse-server/config.d/system_logs_export.yaml
+ set +x
File /tmp/export-logs-config.sh does not exist, do not setup
+ export CLICKHOUSE_MAX_THREADS=8
+ CLICKHOUSE_MAX_THREADS=8
+ export CLICKHOUSE_MAX_CONCURRENT_QUERIES=4
+ CLICKHOUSE_MAX_CONCURRENT_QUERIES=4
+ start_server
+ counter=0
+ max_attempt=120
+ clickhouse-client --query 'SELECT 1'
Code: 210. DB::NetException: Connection refused (localhost:9000). (NETWORK_ERROR)
+ '[' 0 -gt 120 ']'
+ clickhouse start --user root
+ sleep 0.5
+ counter=1
+ clickhouse-client --query 'SELECT 1'
Code: 210. DB::NetException: Connection refused (localhost:9000). (NETWORK_ERROR)
+ '[' 1 -gt 120 ']'
+ clickhouse start --user root
+ sleep 0.5
+ counter=2
+ clickhouse-client --query 'SELECT 1'
Code: 210. DB::NetException: Connection refused (localhost:9000). (NETWORK_ERROR)
+ '[' 2 -gt 120 ']'
+ clickhouse start --user root
+ sleep 0.5
+ counter=3
+ clickhouse-client --query 'SELECT 1'
Code: 210. DB::NetException: Connection refused (localhost:9000). (NETWORK_ERROR)
+ '[' 3 -gt 120 ']'
+ clickhouse start --user root
+ sleep 0.5
+ counter=4
+ clickhouse-client --query 'SELECT 1'
Code: 210. DB::NetException: Connection refused (localhost:9000). (NETWORK_ERROR)
+ '[' 4 -gt 120 ']'
+ clickhouse start --user root
+ sleep 0.5
+ counter=5
+ clickhouse-client --query 'SELECT 1'
Code: 210. DB::NetException: Connection refused (localhost:9000). (NETWORK_ERROR)
+ '[' 5 -gt 120 ']'
+ clickhouse start --user root
+ sleep 0.5
+ counter=6
+ clickhouse-client --query 'SELECT 1'
Code: 210. DB::NetException: Connection refused (localhost:9000). (NETWORK_ERROR)
+ '[' 6 -gt 120 ']'
+ clickhouse start --user root
+ sleep 0.5
+ counter=7
+ clickhouse-client --query 'SELECT 1'
Code: 210. DB::NetException: Connection refused (localhost:9000). (NETWORK_ERROR)
+ '[' 7 -gt 120 ']'
+ clickhouse start --user root
+ sleep 0.5
127.0.0.1 - - [30/Oct/2026:16:49:14 +0000] "GET /devstoreaccount1/cont?restype=container HTTP/1.1" 404 -
+ counter=8
+ clickhouse-client --query 'SELECT 1'
127.0.0.1 - - [30/Oct/2026:16:49:14 +0000] "PUT /devstoreaccount1/cont?restype=container HTTP/1.1" 201 -
127.0.0.1 - - [30/Oct/2026:16:49:14 +0000] "PUT /devstoreaccount1/cont/gjpwuzjlnzaljbafzejhhpylocfyfsgj HTTP/1.1" 201 -
127.0.0.1 - - [30/Oct/2026:16:49:14 +0000] "GET /devstoreaccount1/cont/gjpwuzjlnzaljbafzejhhpylocfyfsgj HTTP/1.1" 206 4
127.0.0.1 - - [30/Oct/2026:16:49:14 +0000] "GET /devstoreaccount1/cont/gjpwuzjlnzaljbafzejhhpylocfyfsgj HTTP/1.1" 206 2
127.0.0.1 - - [30/Oct/2026:16:49:14 +0000] "DELETE /devstoreaccount1/cont/gjpwuzjlnzaljbafzejhhpylocfyfsgj HTTP/1.1" 202 -
1
+ attach_gdb_to_clickhouse
++ run_with_retry 5 clickhouse-client --query 'SELECT count() FROM system.build_options WHERE name = '\''CXX_FLAGS'\'' AND position('\''sanitize=address'\'' IN value)'
++ [[ hxB =~ e ]]
++ set_e=false
++ set +e
++ local total_retries=5
++ shift
++ local retry=0
++ '[' 0 -ge 5 ']'
++ clickhouse-client --query 'SELECT count() FROM system.build_options WHERE name = '\''CXX_FLAGS'\'' AND position('\''sanitize=address'\'' IN value)'
++ false
++ return
+ IS_ASAN=0
+ [[ 0 = \1 ]]
++ kill -l SIGRTMIN
+ RTMIN=34
+ echo '
set follow-fork-mode parent
handle SIGHUP nostop noprint pass
handle SIGINT nostop noprint pass
handle SIGQUIT nostop noprint pass
handle SIGPIPE nostop noprint pass
handle SIGTERM nostop noprint pass
handle SIGUSR1 nostop noprint pass
handle SIGUSR2 nostop noprint pass
handle SIG34 nostop noprint pass
info signals
continue
backtrace full
info registers
p top' 1 KiB of the 'stack:
p/x *(uint64_t[128]*)$sp
maintenance info sections
thread apply all backtrace full
disassemble /s
up
disassemble /s
up
disassemble /s
p "done"
detach
quit
'
+ sleep 5
+ ts '%Y-%m-%d %H:%M:%S'
++ cat /var/run/clickhouse-server/clickhouse-server.pid
+ gdb -batch -command script.gdb -p 403
+ run_with_retry 60 clickhouse-client --query 'SELECT '\''Connected to clickhouse-server after attaching gdb'\'''
+ [[ hxB =~ e ]]
+ set_e=false
+ set +e
+ local total_retries=60
+ shift
+ local retry=0
+ '[' 0 -ge 60 ']'
+ clickhouse-client --query 'SELECT '\''Connected to clickhouse-server after attaching gdb'\'''
Connected to clickhouse-server after attaching gdb
+ false
+ return
+ setup_logs_replication
+ set +x
File /tmp/export-logs-config.sh does not exist, do not setup
+ clickhouse-client --query 'CREATE DATABASE datasets'
+ clickhouse-client --multiquery
+ clickhouse-client --query 'SHOW TABLES FROM datasets'
hits_v1
visits_v1
+ clickhouse-client --query 'CREATE DATABASE IF NOT EXISTS test'
+ stop_server
+ local max_tries=90
+ local check_hang=true
+ local pid
++ cat /var/run/clickhouse-server/clickhouse-server.pid
+ pid=403
+ clickhouse stop --max-tries 90 --do-not-kill
script.gdb:13: Error in sourced command file:
No stack.
/var/run/clickhouse-server/clickhouse-server.pid file exists and contains pid = 403.
The process with pid = 403 is running.
Sent terminate signal to process with pid 403.
Waiting for server to stop
/var/run/clickhouse-server/clickhouse-server.pid file exists and contains pid = 403.
The process with pid = 403 is running.
Waiting for server to stop
/var/run/clickhouse-server/clickhouse-server.pid file exists and contains pid = 403.
The process with pid = 403 is running.
Waiting for server to stop
/var/run/clickhouse-server/clickhouse-server.pid file exists and contains pid = 403.
The process with pid = 403 is running.
Waiting for server to stop
/var/run/clickhouse-server/clickhouse-server.pid file exists and contains pid = 403.
The process with pid = 403 is running.
Waiting for server to stop
/var/run/clickhouse-server/clickhouse-server.pid file exists and contains pid = 403.
The process with pid = 403 is running.
Waiting for server to stop
/var/run/clickhouse-server/clickhouse-server.pid file exists and contains pid = 403.
The process with pid = 403 is running.
Waiting for server to stop
/var/run/clickhouse-server/clickhouse-server.pid file exists and contains pid = 403.
The process with pid = 403 is running.
Waiting for server to stop
/var/run/clickhouse-server/clickhouse-server.pid file exists and contains pid = 403.
The process with pid = 403 is running.
Waiting for server to stop
/var/run/clickhouse-server/clickhouse-server.pid file exists and contains pid = 403.
The process with pid = 403 is running.
Waiting for server to stop
/var/run/clickhouse-server/clickhouse-server.pid file exists and contains pid = 403.
The process with pid = 403 is running.
Waiting for server to stop
/var/run/clickhouse-server/clickhouse-server.pid file exists and contains pid = 403.
The process with pid = 403 is running.
Waiting for server to stop
Now there is no clickhouse-server process.
Server stopped
+ return
+ mv /var/log/clickhouse-server/clickhouse-server.log /var/log/clickhouse-server/clickhouse-server.initial.log
+ cache_policy=
+ '[' 0 -eq 1 ']'
+ cache_policy=LRU
+ echo 'Using cache policy: LRU'
+ '[' LRU = SLRU ']'
+ sudo cat /etc/clickhouse-server/users.d/stress_tests_overrides.xml
Using cache policy: LRU
cat: /etc/clickhouse-server/users.d/stress_tests_overrides.xml: No such file or directory
+ start_server
+ counter=0
+ max_attempt=120
+ clickhouse-client --query 'SELECT 1'
Code: 210. DB::NetException: Connection refused (localhost:9000). (NETWORK_ERROR)
+ '[' 0 -gt 120 ']'
+ clickhouse start --user root
+ sleep 0.5
+ counter=1
+ clickhouse-client --query 'SELECT 1'
Code: 210. DB::NetException: Connection refused (localhost:9000). (NETWORK_ERROR)
+ '[' 1 -gt 120 ']'
+ clickhouse start --user root
+ sleep 0.5
+ counter=2
+ clickhouse-client --query 'SELECT 1'
Code: 210. DB::NetException: Connection refused (localhost:9000). (NETWORK_ERROR)
+ '[' 2 -gt 120 ']'
+ clickhouse start --user root
+ sleep 0.5
+ counter=3
+ clickhouse-client --query 'SELECT 1'
Code: 210. DB::NetException: Connection refused (localhost:9000). (NETWORK_ERROR)
+ '[' 3 -gt 120 ']'
+ clickhouse start --user root
+ sleep 0.5
+ counter=4
+ clickhouse-client --query 'SELECT 1'
Code: 210. DB::NetException: Connection refused (localhost:9000). (NETWORK_ERROR)
+ '[' 4 -gt 120 ']'
+ clickhouse start --user root
+ sleep 0.5
+ counter=5
+ clickhouse-client --query 'SELECT 1'
Code: 210. DB::NetException: Connection refused (localhost:9000). (NETWORK_ERROR)
+ '[' 5 -gt 120 ']'
+ clickhouse start --user root
+ sleep 0.5
+ counter=6
+ clickhouse-client --query 'SELECT 1'
Code: 210. DB::NetException: Connection refused (localhost:9000). (NETWORK_ERROR)
+ '[' 6 -gt 120 ']'
+ clickhouse start --user root
+ sleep 0.5
127.0.0.1 - - [30/Oct/2026:16:50:06 +0000] "GET /devstoreaccount1/cont?restype=container HTTP/1.1" 200 -
127.0.0.1 - - [30/Oct/2026:16:50:06 +0000] "PUT /devstoreaccount1/cont/mqnabpkoopupsgdoxrkbwudbpasjdcgw HTTP/1.1" 201 -
127.0.0.1 - - [30/Oct/2026:16:50:06 +0000] "GET /devstoreaccount1/cont/mqnabpkoopupsgdoxrkbwudbpasjdcgw HTTP/1.1" 206 4
127.0.0.1 - - [30/Oct/2026:16:50:06 +0000] "GET /devstoreaccount1/cont/mqnabpkoopupsgdoxrkbwudbpasjdcgw HTTP/1.1" 206 2
127.0.0.1 - - [30/Oct/2026:16:50:06 +0000] "DELETE /devstoreaccount1/cont/mqnabpkoopupsgdoxrkbwudbpasjdcgw HTTP/1.1" 202 -
+ counter=7
+ clickhouse-client --query 'SELECT 1'
Code: 210. DB::NetException: Connection refused (localhost:9000). (NETWORK_ERROR)
+ '[' 7 -gt 120 ']'
+ clickhouse start --user root
+ sleep 0.5
+ counter=8
+ clickhouse-client --query 'SELECT 1'
Code: 210. DB::NetException: Connection refused (localhost:9000). (NETWORK_ERROR)
+ '[' 8 -gt 120 ']'
+ clickhouse start --user root
+ sleep 0.5
+ counter=9
+ clickhouse-client --query 'SELECT 1'
Code: 210. DB::NetException: Connection refused (localhost:9000). (NETWORK_ERROR)
+ '[' 9 -gt 120 ']'
+ clickhouse start --user root
+ sleep 0.5
+ counter=10
+ clickhouse-client --query 'SELECT 1'
Code: 210. DB::NetException: Connection refused (localhost:9000). (NETWORK_ERROR)
+ '[' 10 -gt 120 ']'
+ clickhouse start --user root
+ sleep 0.5
+ counter=11
+ clickhouse-client --query 'SELECT 1'
Code: 210. DB::NetException: Connection refused (localhost:9000). (NETWORK_ERROR)
+ '[' 11 -gt 120 ']'
+ clickhouse start --user root
+ sleep 0.5
+ counter=12
+ clickhouse-client --query 'SELECT 1'
Code: 210. DB::NetException: Connection refused (localhost:9000). (NETWORK_ERROR)
+ '[' 12 -gt 120 ']'
+ clickhouse start --user root
+ sleep 0.5
+ counter=13
+ clickhouse-client --query 'SELECT 1'
Code: 210. DB::NetException: Connection refused (localhost:9000). (NETWORK_ERROR)
+ '[' 13 -gt 120 ']'
+ clickhouse start --user root
+ sleep 0.5
+ counter=14
+ clickhouse-client --query 'SELECT 1'
Code: 210. DB::NetException: Connection refused (localhost:9000). (NETWORK_ERROR)
+ '[' 14 -gt 120 ']'
+ clickhouse start --user root
+ sleep 0.5
+ counter=15
+ clickhouse-client --query 'SELECT 1'
1
+ attach_gdb_to_clickhouse
++ run_with_retry 5 clickhouse-client --query 'SELECT count() FROM system.build_options WHERE name = '\''CXX_FLAGS'\'' AND position('\''sanitize=address'\'' IN value)'
++ [[ hxB =~ e ]]
++ set_e=false
++ set +e
++ local total_retries=5
++ shift
++ local retry=0
++ '[' 0 -ge 5 ']'
++ clickhouse-client --query 'SELECT count() FROM system.build_options WHERE name = '\''CXX_FLAGS'\'' AND position('\''sanitize=address'\'' IN value)'
++ false
++ return
+ IS_ASAN=0
+ [[ 0 = \1 ]]
++ kill -l SIGRTMIN
+ RTMIN=34
+ echo '
set follow-fork-mode parent
handle SIGHUP nostop noprint pass
handle SIGINT nostop noprint pass
handle SIGQUIT nostop noprint pass
handle SIGPIPE nostop noprint pass
handle SIGTERM nostop noprint pass
handle SIGUSR1 nostop noprint pass
handle SIGUSR2 nostop noprint pass
handle SIG34 nostop noprint pass
info signals
continue
backtrace full
info registers
p top' 1 KiB of the 'stack:
p/x *(uint64_t[128]*)$sp
maintenance info sections
thread apply all backtrace full
disassemble /s
up
disassemble /s
up
disassemble /s
p "done"
detach
quit
'
+ ts '%Y-%m-%d %H:%M:%S'
+ sleep 5
++ cat /var/run/clickhouse-server/clickhouse-server.pid
+ gdb -batch -command script.gdb -p 1255
+ run_with_retry 60 clickhouse-client --query 'SELECT '\''Connected to clickhouse-server after attaching gdb'\'''
+ [[ hxB =~ e ]]
+ set_e=false
+ set +e
+ local total_retries=60
+ shift
+ local retry=0
+ '[' 0 -ge 60 ']'
+ clickhouse-client --query 'SELECT '\''Connected to clickhouse-server after attaching gdb'\'''
Connected to clickhouse-server after attaching gdb
+ false
+ return
+ clickhouse-client --query 'SHOW TABLES FROM datasets'
hits_v1
visits_v1
+ clickhouse-client --query 'SHOW TABLES FROM test'
+ [[ '' == \1 ]]
+ [[ '' == \1 ]]
+ TEMP_POLICY=default
+ clickhouse-client --query 'CREATE TABLE test.hits_s3 (WatchID UInt64, JavaEnable UInt8, Title String, GoodEvent Int16,
EventTime DateTime, EventDate Date, CounterID UInt32, ClientIP UInt32, ClientIP6 FixedString(16), RegionID UInt32,
UserID UInt64, CounterClass Int8, OS UInt8, UserAgent UInt8, URL String, Referer String, URLDomain String, RefererDomain String,
Refresh UInt8, IsRobot UInt8, RefererCategories Array(UInt16), URLCategories Array(UInt16), URLRegions Array(UInt32),
RefererRegions Array(UInt32), ResolutionWidth UInt16, ResolutionHeight UInt16, ResolutionDepth UInt8, FlashMajor UInt8,
FlashMinor UInt8, FlashMinor2 String, NetMajor UInt8, NetMinor UInt8, UserAgentMajor UInt16, UserAgentMinor FixedString(2),
CookieEnable UInt8, JavascriptEnable UInt8, IsMobile UInt8, MobilePhone UInt8, MobilePhoneModel String, Params String,
IPNetworkID UInt32, TraficSourceID Int8, SearchEngineID UInt16, SearchPhrase String, AdvEngineID UInt8, IsArtifical UInt8,
WindowClientWidth UInt16, WindowClientHeight UInt16, ClientTimeZone Int16, ClientEventTime DateTime, SilverlightVersion1 UInt8,
SilverlightVersion2 UInt8, SilverlightVersion3 UInt32, SilverlightVersion4 UInt16, PageCharset String, CodeVersion UInt32,
IsLink UInt8, IsDownload UInt8, IsNotBounce UInt8, FUniqID UInt64, HID UInt32, IsOldCounter UInt8, IsEvent UInt8,
IsParameter UInt8, DontCountHits UInt8, WithHash UInt8, HitColor FixedString(1), UTCEventTime DateTime, Age UInt8,
Sex UInt8, Income UInt8, Interests UInt16, Robotness UInt8, GeneralInterests Array(UInt16), RemoteIP UInt32,
RemoteIP6 FixedString(16), WindowName Int32, OpenerName Int32, HistoryLength Int16, BrowserLanguage FixedString(2),
BrowserCountry FixedString(2), SocialNetwork String, SocialAction String, HTTPError UInt16, SendTiming Int32,
DNSTiming Int32, ConnectTiming Int32, ResponseStartTiming Int32, ResponseEndTiming Int32, FetchTiming Int32,
RedirectTiming Int32, DOMInteractiveTiming Int32, DOMContentLoadedTiming Int32, DOMCompleteTiming Int32,
LoadEventStartTiming Int32, LoadEventEndTiming Int32, NSToDOMContentLoadedTiming Int32, FirstPaintTiming Int32,
RedirectCount Int8, SocialSourceNetworkID UInt8, SocialSourcePage String, ParamPrice Int64, ParamOrderID String,
ParamCurrency FixedString(3), ParamCurrencyID UInt16, GoalsReached Array(UInt32), OpenstatServiceName String,
OpenstatCampaignID String, OpenstatAdID String, OpenstatSourceID String, UTMSource String, UTMMedium String,
UTMCampaign String, UTMContent String, UTMTerm String, FromTag String, HasGCLID UInt8, RefererHash UInt64,
URLHash UInt64, CLID UInt32, YCLID UInt64, ShareService String, ShareURL String, ShareTitle String,
ParsedParams Nested(Key1 String, Key2 String, Key3 String, Key4 String, Key5 String, ValueDouble Float64),
IslandID FixedString(16), RequestNum UInt32, RequestTry UInt8) ENGINE = MergeTree() PARTITION BY toYYYYMM(EventDate)
ORDER BY (CounterID, EventDate, intHash32(UserID)) SAMPLE BY intHash32(UserID) SETTINGS index_granularity = 8192, storage_policy='\''default'\'''
+ clickhouse-client --query 'CREATE TABLE test.hits (WatchID UInt64, JavaEnable UInt8, Title String, GoodEvent Int16,
EventTime DateTime, EventDate Date, CounterID UInt32, ClientIP UInt32, ClientIP6 FixedString(16), RegionID UInt32,
UserID UInt64, CounterClass Int8, OS UInt8, UserAgent UInt8, URL String, Referer String, URLDomain String,
RefererDomain String, Refresh UInt8, IsRobot UInt8, RefererCategories Array(UInt16), URLCategories Array(UInt16),
URLRegions Array(UInt32), RefererRegions Array(UInt32), ResolutionWidth UInt16, ResolutionHeight UInt16, ResolutionDepth UInt8,
FlashMajor UInt8, FlashMinor UInt8, FlashMinor2 String, NetMajor UInt8, NetMinor UInt8, UserAgentMajor UInt16,
UserAgentMinor FixedString(2), CookieEnable UInt8, JavascriptEnable UInt8, IsMobile UInt8, MobilePhone UInt8,
MobilePhoneModel String, Params String, IPNetworkID UInt32, TraficSourceID Int8, SearchEngineID UInt16,
SearchPhrase String, AdvEngineID UInt8, IsArtifical UInt8, WindowClientWidth UInt16, WindowClientHeight UInt16,
ClientTimeZone Int16, ClientEventTime DateTime, SilverlightVersion1 UInt8, SilverlightVersion2 UInt8, SilverlightVersion3 UInt32,
SilverlightVersion4 UInt16, PageCharset String, CodeVersion UInt32, IsLink UInt8, IsDownload UInt8, IsNotBounce UInt8,
FUniqID UInt64, HID UInt32, IsOldCounter UInt8, IsEvent UInt8, IsParameter UInt8, DontCountHits UInt8, WithHash UInt8,
HitColor FixedString(1), UTCEventTime DateTime, Age UInt8, Sex UInt8, Income UInt8, Interests UInt16, Robotness UInt8,
GeneralInterests Array(UInt16), RemoteIP UInt32, RemoteIP6 FixedString(16), WindowName Int32, OpenerName Int32,
HistoryLength Int16, BrowserLanguage FixedString(2), BrowserCountry FixedString(2), SocialNetwork String, SocialAction String,
HTTPError UInt16, SendTiming Int32, DNSTiming Int32, ConnectTiming Int32, ResponseStartTiming Int32, ResponseEndTiming Int32,
FetchTiming Int32, RedirectTiming Int32, DOMInteractiveTiming Int32, DOMContentLoadedTiming Int32, DOMCompleteTiming Int32,
LoadEventStartTiming Int32, LoadEventEndTiming Int32, NSToDOMContentLoadedTiming Int32, FirstPaintTiming Int32,
RedirectCount Int8, SocialSourceNetworkID UInt8, SocialSourcePage String, ParamPrice Int64, ParamOrderID String,
ParamCurrency FixedString(3), ParamCurrencyID UInt16, GoalsReached Array(UInt32), OpenstatServiceName String,
OpenstatCampaignID String, OpenstatAdID String, OpenstatSourceID String, UTMSource String, UTMMedium String,
UTMCampaign String, UTMContent String, UTMTerm String, FromTag String, HasGCLID UInt8, RefererHash UInt64,
URLHash UInt64, CLID UInt32, YCLID UInt64, ShareService String, ShareURL String, ShareTitle String,
ParsedParams Nested(Key1 String, Key2 String, Key3 String, Key4 String, Key5 String, ValueDouble Float64),
IslandID FixedString(16), RequestNum UInt32, RequestTry UInt8) ENGINE = MergeTree() PARTITION BY toYYYYMM(EventDate)
ORDER BY (CounterID, EventDate, intHash32(UserID)) SAMPLE BY intHash32(UserID) SETTINGS index_granularity = 8192, storage_policy='\''default'\'''
+ clickhouse-client --query 'CREATE TABLE test.visits (CounterID UInt32, StartDate Date, Sign Int8, IsNew UInt8,
VisitID UInt64, UserID UInt64, StartTime DateTime, Duration UInt32, UTCStartTime DateTime, PageViews Int32,
Hits Int32, IsBounce UInt8, Referer String, StartURL String, RefererDomain String, StartURLDomain String,
EndURL String, LinkURL String, IsDownload UInt8, TraficSourceID Int8, SearchEngineID UInt16, SearchPhrase String,
AdvEngineID UInt8, PlaceID Int32, RefererCategories Array(UInt16), URLCategories Array(UInt16), URLRegions Array(UInt32),
RefererRegions Array(UInt32), IsYandex UInt8, GoalReachesDepth Int32, GoalReachesURL Int32, GoalReachesAny Int32,
SocialSourceNetworkID UInt8, SocialSourcePage String, MobilePhoneModel String, ClientEventTime DateTime, RegionID UInt32,
ClientIP UInt32, ClientIP6 FixedString(16), RemoteIP UInt32, RemoteIP6 FixedString(16), IPNetworkID UInt32,
SilverlightVersion3 UInt32, CodeVersion UInt32, ResolutionWidth UInt16, ResolutionHeight UInt16, UserAgentMajor UInt16,
UserAgentMinor UInt16, WindowClientWidth UInt16, WindowClientHeight UInt16, SilverlightVersion2 UInt8, SilverlightVersion4 UInt16,
FlashVersion3 UInt16, FlashVersion4 UInt16, ClientTimeZone Int16, OS UInt8, UserAgent UInt8, ResolutionDepth UInt8,
FlashMajor UInt8, FlashMinor UInt8, NetMajor UInt8, NetMinor UInt8, MobilePhone UInt8, SilverlightVersion1 UInt8,
Age UInt8, Sex UInt8, Income UInt8, JavaEnable UInt8, CookieEnable UInt8, JavascriptEnable UInt8, IsMobile UInt8,
BrowserLanguage UInt16, BrowserCountry UInt16, Interests UInt16, Robotness UInt8, GeneralInterests Array(UInt16),
Params Array(String), Goals Nested(ID UInt32, Serial UInt32, EventTime DateTime, Price Int64, OrderID String, CurrencyID UInt32),
WatchIDs Array(UInt64), ParamSumPrice Int64, ParamCurrency FixedString(3), ParamCurrencyID UInt16, ClickLogID UInt64,
ClickEventID Int32, ClickGoodEvent Int32, ClickEventTime DateTime, ClickPriorityID Int32, ClickPhraseID Int32, ClickPageID Int32,
ClickPlaceID Int32, ClickTypeID Int32, ClickResourceID Int32, ClickCost UInt32, ClickClientIP UInt32, ClickDomainID UInt32,
ClickURL String, ClickAttempt UInt8, ClickOrderID UInt32, ClickBannerID UInt32, ClickMarketCategoryID UInt32, ClickMarketPP UInt32,
ClickMarketCategoryName String, ClickMarketPPName String, ClickAWAPSCampaignName String, ClickPageName String, ClickTargetType UInt16,
ClickTargetPhraseID UInt64, ClickContextType UInt8, ClickSelectType Int8, ClickOptions String, ClickGroupBannerID Int32,
OpenstatServiceName String, OpenstatCampaignID String, OpenstatAdID String, OpenstatSourceID String, UTMSource String,
UTMMedium String, UTMCampaign String, UTMContent String, UTMTerm String, FromTag String, HasGCLID UInt8, FirstVisit DateTime,
PredLastVisit Date, LastVisit Date, TotalVisits UInt32, TraficSource Nested(ID Int8, SearchEngineID UInt16, AdvEngineID UInt8,
PlaceID UInt16, SocialSourceNetworkID UInt8, Domain String, SearchPhrase String, SocialSourcePage String), Attendance FixedString(16),
CLID UInt32, YCLID UInt64, NormalizedRefererHash UInt64, SearchPhraseHash UInt64, RefererDomainHash UInt64, NormalizedStartURLHash UInt64,
StartURLDomainHash UInt64, NormalizedEndURLHash UInt64, TopLevelDomain UInt64, URLScheme UInt64, OpenstatServiceNameHash UInt64,
OpenstatCampaignIDHash UInt64, OpenstatAdIDHash UInt64, OpenstatSourceIDHash UInt64, UTMSourceHash UInt64, UTMMediumHash UInt64,
UTMCampaignHash UInt64, UTMContentHash UInt64, UTMTermHash UInt64, FromHash UInt64, WebVisorEnabled UInt8, WebVisorActivity UInt32,
ParsedParams Nested(Key1 String, Key2 String, Key3 String, Key4 String, Key5 String, ValueDouble Float64),
Market Nested(Type UInt8, GoalID UInt32, OrderID String, OrderPrice Int64, PP UInt32, DirectPlaceID UInt32, DirectOrderID UInt32,
DirectBannerID UInt32, GoodID String, GoodName String, GoodQuantity Int32, GoodPrice Int64), IslandID FixedString(16))
ENGINE = CollapsingMergeTree(Sign) PARTITION BY toYYYYMM(StartDate) ORDER BY (CounterID, StartDate, intHash32(UserID), VisitID)
SAMPLE BY intHash32(UserID) SETTINGS index_granularity = 8192, storage_policy='\''default'\'''
+ clickhouse-client --query 'INSERT INTO test.hits_s3 SELECT * FROM datasets.hits_v1 SETTINGS enable_filesystem_cache_on_write_operations=0, max_insert_threads=16'
Received exception from server (version 24.8.14):
Code: 241. DB::Exception: Received from localhost:9000. DB::Exception: Memory limit (for user) exceeded: would use 9.18 GiB (attempt to allocate chunk of 1129882 bytes), maximum: 9.18 GiB. OvercommitTracker decision: Query was selected to stop by OvercommitTracker.. (MEMORY_LIMIT_EXCEEDED)
(query: INSERT INTO test.hits_s3 SELECT * FROM datasets.hits_v1 SETTINGS enable_filesystem_cache_on_write_operations=0, max_insert_threads=16)
+ clickhouse-client --query 'INSERT INTO test.hits SELECT * FROM datasets.hits_v1 SETTINGS enable_filesystem_cache_on_write_operations=0, max_insert_threads=16'
Received exception from server (version 24.8.14):
Code: 241. DB::Exception: Received from localhost:9000. DB::Exception: Memory limit (for user) exceeded: would use 9.18 GiB (attempt to allocate chunk of 1146261 bytes), maximum: 9.18 GiB. OvercommitTracker decision: Query was selected to stop by OvercommitTracker.: (while reading column ShareService): (while reading from part store/78e/78ebf6a1-d987-4579-b3ec-00c1a087b1f3/201403_1_1_2/ in table datasets.hits_v1 (78ebf6a1-d987-4579-b3ec-00c1a087b1f3) located on disk __tmp_internal_262634248876485800814430204900764312493 of type web, from mark 292 with max_rows_to_read = 8192): While executing MergeTreeSelect(pool: ReadPool, algorithm: Thread). (MEMORY_LIMIT_EXCEEDED)
(query: INSERT INTO test.hits SELECT * FROM datasets.hits_v1 SETTINGS enable_filesystem_cache_on_write_operations=0, max_insert_threads=16)
+ clickhouse-client --query 'INSERT INTO test.visits SELECT * FROM datasets.visits_v1 SETTINGS enable_filesystem_cache_on_write_operations=0, max_insert_threads=16'
+ clickhouse-client --query 'DROP TABLE datasets.visits_v1 SYNC'
+ clickhouse-client --query 'DROP TABLE datasets.hits_v1 SYNC'
+ clickhouse-client --query 'SHOW TABLES FROM test'
hits
hits_s3
visits
+ clickhouse-client --query 'SYSTEM STOP THREAD FUZZER'
+ stop_server
+ local max_tries=90
+ local check_hang=true
+ local pid
++ cat /var/run/clickhouse-server/clickhouse-server.pid
+ pid=1255
+ clickhouse stop --max-tries 90 --do-not-kill
script.gdb:13: Error in sourced command file:
No stack.
/var/run/clickhouse-server/clickhouse-server.pid file exists and contains pid = 1255.
The process with pid = 1255 is running.
Sent terminate signal to process with pid 1255.
Waiting for server to stop
/var/run/clickhouse-server/clickhouse-server.pid file exists and contains pid = 1255.
The process with pid = 1255 is running.
Waiting for server to stop
/var/run/clickhouse-server/clickhouse-server.pid file exists and contains pid = 1255.
The process with pid = 1255 is running.
Waiting for server to stop
/var/run/clickhouse-server/clickhouse-server.pid file exists and contains pid = 1255.
The process with pid = 1255 is running.
Waiting for server to stop
/var/run/clickhouse-server/clickhouse-server.pid file exists and contains pid = 1255.
The process with pid = 1255 is running.
Waiting for server to stop
Found pid = 1255 in the list of running processes.
The process with pid = 1255 is running.
Waiting for server to stop
Now there is no clickhouse-server process.
Server stopped
+ return
+ export RANDOMIZE_OBJECT_KEY_TYPE=1
+ RANDOMIZE_OBJECT_KEY_TYPE=1
+ export ZOOKEEPER_FAULT_INJECTION=1
+ ZOOKEEPER_FAULT_INJECTION=1
+ export THREAD_POOL_FAULT_INJECTION=1
+ THREAD_POOL_FAULT_INJECTION=1
+ configure
+ export USE_DATABASE_ORDINARY=1
+ USE_DATABASE_ORDINARY=1
+ export EXPORT_S3_STORAGE_POLICIES=1
+ EXPORT_S3_STORAGE_POLICIES=1
+ /usr/share/clickhouse-test/config/install.sh
+ DEST_SERVER_PATH=/etc/clickhouse-server
+ DEST_CLIENT_PATH=/etc/clickhouse-client
+++ dirname /usr/share/clickhouse-test/config/install.sh
++ cd /usr/share/clickhouse-test/config
++ pwd -P
+ SRC_PATH=/usr/share/clickhouse-test/config
+ echo 'Going to install test configs from /usr/share/clickhouse-test/config into /etc/clickhouse-server'
+ mkdir -p /etc/clickhouse-server/config.d/
Going to install test configs from /usr/share/clickhouse-test/config into /etc/clickhouse-server
+ mkdir -p /etc/clickhouse-server/users.d/
+ mkdir -p /etc/clickhouse-client
+ ln -sf /usr/share/clickhouse-test/config/config.d/zookeeper_write.xml /etc/clickhouse-server/config.d/
+ ln -sf /usr/share/clickhouse-test/config/config.d/max_num_to_warn.xml /etc/clickhouse-server/config.d/
+ ln -sf /usr/share/clickhouse-test/config/config.d/listen.xml /etc/clickhouse-server/config.d/
+ ln -sf /usr/share/clickhouse-test/config/config.d/text_log.xml /etc/clickhouse-server/config.d/
+ ln -sf /usr/share/clickhouse-test/config/config.d/blob_storage_log.xml /etc/clickhouse-server/config.d/
+ ln -sf /usr/share/clickhouse-test/config/config.d/custom_settings_prefixes.xml /etc/clickhouse-server/config.d/
+ ln -sf /usr/share/clickhouse-test/config/config.d/database_catalog_drop_table_concurrency.xml /etc/clickhouse-server/config.d/
+ ln -sf /usr/share/clickhouse-test/config/config.d/enable_access_control_improvements.xml /etc/clickhouse-server/config.d/
+ ln -sf /usr/share/clickhouse-test/config/config.d/macros.xml /etc/clickhouse-server/config.d/
+ ln -sf /usr/share/clickhouse-test/config/config.d/secure_ports.xml /etc/clickhouse-server/config.d/
+ ln -sf /usr/share/clickhouse-test/config/config.d/clusters.xml /etc/clickhouse-server/config.d/
+ ln -sf /usr/share/clickhouse-test/config/config.d/graphite.xml /etc/clickhouse-server/config.d/
+ ln -sf /usr/share/clickhouse-test/config/config.d/graphite_alternative.xml /etc/clickhouse-server/config.d/
+ ln -sf /usr/share/clickhouse-test/config/config.d/grpc_protocol.xml /etc/clickhouse-server/config.d/
+ ln -sf /usr/share/clickhouse-test/config/config.d/database_atomic.xml /etc/clickhouse-server/config.d/
+ ln -sf /usr/share/clickhouse-test/config/config.d/max_concurrent_queries.xml /etc/clickhouse-server/config.d/
+ ln -sf /usr/share/clickhouse-test/config/config.d/merge_tree_settings.xml /etc/clickhouse-server/config.d/
+ ln -sf /usr/share/clickhouse-test/config/config.d/backoff_failed_mutation.xml /etc/clickhouse-server/config.d/
+ ln -sf /usr/share/clickhouse-test/config/config.d/merge_tree_old_dirs_cleanup.xml /etc/clickhouse-server/config.d/
+ ln -sf /usr/share/clickhouse-test/config/config.d/test_cluster_with_incorrect_pw.xml /etc/clickhouse-server/config.d/
+ ln -sf /usr/share/clickhouse-test/config/config.d/keeper_port.xml /etc/clickhouse-server/config.d/
+ ln -sf /usr/share/clickhouse-test/config/config.d/logging_no_rotate.xml /etc/clickhouse-server/config.d/
+ ln -sf /usr/share/clickhouse-test/config/config.d/merge_tree.xml /etc/clickhouse-server/config.d/
+ ln -sf /usr/share/clickhouse-test/config/config.d/lost_forever_check.xml /etc/clickhouse-server/config.d/
+ ln -sf /usr/share/clickhouse-test/config/config.d/tcp_with_proxy.xml /etc/clickhouse-server/config.d/
+ ln -sf /usr/share/clickhouse-test/config/config.d/prometheus.xml /etc/clickhouse-server/config.d/
+ ln -sf /usr/share/clickhouse-test/config/config.d/top_level_domains_lists.xml /etc/clickhouse-server/config.d/
+ ln -sf /usr/share/clickhouse-test/config/config.d/top_level_domains_path.xml /etc/clickhouse-server/config.d/
+ ln -sf /usr/share/clickhouse-test/config/config.d/transactions.xml /etc/clickhouse-server/config.d/
+ ln -sf /usr/share/clickhouse-test/config/config.d/encryption.xml /etc/clickhouse-server/config.d/
+ ln -sf /usr/share/clickhouse-test/config/config.d/CORS.xml /etc/clickhouse-server/config.d/
+ ln -sf /usr/share/clickhouse-test/config/config.d/zookeeper_log.xml /etc/clickhouse-server/config.d/
+ ln -sf /usr/share/clickhouse-test/config/config.d/logger_trace.xml /etc/clickhouse-server/config.d/
+ ln -sf /usr/share/clickhouse-test/config/config.d/named_collection.xml /etc/clickhouse-server/config.d/
+ ln -sf /usr/share/clickhouse-test/config/config.d/ssl_certs.xml /etc/clickhouse-server/config.d/
+ ln -sf /usr/share/clickhouse-test/config/config.d/filesystem_cache_log.xml /etc/clickhouse-server/config.d/
+ ln -sf /usr/share/clickhouse-test/config/config.d/session_log.xml /etc/clickhouse-server/config.d/
+ ln -sf /usr/share/clickhouse-test/config/config.d/system_unfreeze.xml /etc/clickhouse-server/config.d/
+ ln -sf /usr/share/clickhouse-test/config/config.d/enable_zero_copy_replication.xml /etc/clickhouse-server/config.d/
+ ln -sf /usr/share/clickhouse-test/config/config.d/nlp.xml /etc/clickhouse-server/config.d/
+ ln -sf /usr/share/clickhouse-test/config/config.d/forbidden_headers.xml /etc/clickhouse-server/config.d/
+ ln -sf /usr/share/clickhouse-test/config/config.d/enable_keeper_map.xml /etc/clickhouse-server/config.d/
+ ln -sf /usr/share/clickhouse-test/config/config.d/custom_disks_base_path.xml /etc/clickhouse-server/config.d/
+ ln -sf /usr/share/clickhouse-test/config/config.d/display_name.xml /etc/clickhouse-server/config.d/
+ ln -sf /usr/share/clickhouse-test/config/config.d/compressed_marks_and_index.xml /etc/clickhouse-server/config.d/
+ ln -sf /usr/share/clickhouse-test/config/config.d/disable_s3_env_credentials.xml /etc/clickhouse-server/config.d/
+ ln -sf /usr/share/clickhouse-test/config/config.d/enable_wait_for_shutdown_replicated_tables.xml /etc/clickhouse-server/config.d/
+ ln -sf /usr/share/clickhouse-test/config/config.d/backups.xml /etc/clickhouse-server/config.d/
+ ln -sf /usr/share/clickhouse-test/config/config.d/filesystem_caches_path.xml /etc/clickhouse-server/config.d/
+ ln -sf /usr/share/clickhouse-test/config/config.d/validate_tcp_client_information.xml /etc/clickhouse-server/config.d/
+ ln -sf /usr/share/clickhouse-test/config/config.d/zero_copy_destructive_operations.xml /etc/clickhouse-server/config.d/
+ ln -sf /usr/share/clickhouse-test/config/config.d/block_number.xml /etc/clickhouse-server/config.d/
+ ln -sf /usr/share/clickhouse-test/config/config.d/handlers.yaml /etc/clickhouse-server/config.d/
+ ln -sf /usr/share/clickhouse-test/config/config.d/serverwide_trace_collector.xml /etc/clickhouse-server/config.d/
+ ln -sf /usr/share/clickhouse-test/config/config.d/rocksdb.xml /etc/clickhouse-server/config.d/
+ '[' /etc/clickhouse-server = /etc/clickhouse-server ']'
+ ln -sf /usr/share/clickhouse-test/config/config.d/legacy_geobase.xml /etc/clickhouse-server/config.d/
+ ln -sf /usr/share/clickhouse-test/config/users.d/log_queries.xml /etc/clickhouse-server/users.d/
+ ln -sf /usr/share/clickhouse-test/config/users.d/readonly.xml /etc/clickhouse-server/users.d/
+ ln -sf /usr/share/clickhouse-test/config/users.d/access_management.xml /etc/clickhouse-server/users.d/
+ ln -sf /usr/share/clickhouse-test/config/users.d/database_atomic_drop_detach_sync.xml /etc/clickhouse-server/users.d/
+ ln -sf /usr/share/clickhouse-test/config/users.d/opentelemetry.xml /etc/clickhouse-server/users.d/
+ ln -sf /usr/share/clickhouse-test/config/users.d/remote_queries.xml /etc/clickhouse-server/users.d/
+ ln -sf /usr/share/clickhouse-test/config/users.d/session_log_test.xml /etc/clickhouse-server/users.d/
+ ln -sf /usr/share/clickhouse-test/config/users.d/memory_profiler.xml /etc/clickhouse-server/users.d/
+ ln -sf /usr/share/clickhouse-test/config/users.d/no_fsync_metadata.xml /etc/clickhouse-server/users.d/
+ ln -sf /usr/share/clickhouse-test/config/users.d/filelog.xml /etc/clickhouse-server/users.d/
+ ln -sf /usr/share/clickhouse-test/config/users.d/enable_blobs_check.xml /etc/clickhouse-server/users.d/
+ ln -sf /usr/share/clickhouse-test/config/users.d/marks.xml /etc/clickhouse-server/users.d/
+ ln -sf /usr/share/clickhouse-test/config/users.d/insert_keeper_retries.xml /etc/clickhouse-server/users.d/
+ ln -sf /usr/share/clickhouse-test/config/users.d/prefetch_settings.xml /etc/clickhouse-server/users.d/
+ ln -sf /usr/share/clickhouse-test/config/users.d/nonconst_timezone.xml /etc/clickhouse-server/users.d/
+ ln -sf /usr/share/clickhouse-test/config/users.d/allow_introspection_functions.yaml /etc/clickhouse-server/users.d/
+ ln -sf /usr/share/clickhouse-test/config/users.d/replicated_ddl_entry.xml /etc/clickhouse-server/users.d/
+ [[ -n '' ]]
+ ln -sf /usr/share/clickhouse-test/config/users.d/timeouts.xml /etc/clickhouse-server/users.d/
+ ln -sf /usr/share/clickhouse-test/config/ints_dictionary.xml /etc/clickhouse-server/
+ ln -sf /usr/share/clickhouse-test/config/strings_dictionary.xml /etc/clickhouse-server/
+ ln -sf /usr/share/clickhouse-test/config/decimals_dictionary.xml /etc/clickhouse-server/
+ ln -sf /usr/share/clickhouse-test/config/executable_dictionary.xml /etc/clickhouse-server/
+ ln -sf /usr/share/clickhouse-test/config/executable_pool_dictionary.xml /etc/clickhouse-server/
+ ln -sf /usr/share/clickhouse-test/config/test_function.xml /etc/clickhouse-server/
+ ln -sf /usr/share/clickhouse-test/config/top_level_domains /etc/clickhouse-server/
+ ln -sf /usr/share/clickhouse-test/config/regions_hierarchy.txt /etc/clickhouse-server/config.d/
+ ln -sf /usr/share/clickhouse-test/config/regions_names_en.txt /etc/clickhouse-server/config.d/
+ ln -sf /usr/share/clickhouse-test/config/ext-en.txt /etc/clickhouse-server/config.d/
+ ln -sf /usr/share/clickhouse-test/config/ext-ru.txt /etc/clickhouse-server/config.d/
+ ln -sf /usr/share/clickhouse-test/config/lem-en.bin /etc/clickhouse-server/config.d/
+ ln -sf /usr/share/clickhouse-test/config/server.key /etc/clickhouse-server/
+ ln -sf /usr/share/clickhouse-test/config/server.crt /etc/clickhouse-server/
+ ln -sf /usr/share/clickhouse-test/config/dhparam.pem /etc/clickhouse-server/
+ ln -sf --backup=simple --suffix=_original.xml /usr/share/clickhouse-test/config/config.d/query_masking_rules.xml /etc/clickhouse-server/config.d/
+ [[ -n 1 ]]
+ [[ 1 -eq 1 ]]
+ rm -f /etc/clickhouse-server/config.d/zookeeper.xml
+ ln -sf /usr/share/clickhouse-test/config/config.d/zookeeper_fault_injection.xml /etc/clickhouse-server/config.d/
+ [[ -n 1 ]]
+ [[ 1 -eq 1 ]]
+ ln -sf /usr/share/clickhouse-test/config/config.d/cannot_allocate_thread_injection.xml /etc/clickhouse-server/config.d/
+ value=0
+ sed --follow-symlinks -i 's|[01]|0|' /etc/clickhouse-server/config.d/keeper_port.xml
+ value=10297344
+ sed --follow-symlinks -i 's|[[:digit:]]\+|10297344|' /etc/clickhouse-server/config.d/keeper_port.xml
+ value=24137728
+ sed --follow-symlinks -i 's|[[:digit:]]\+|24137728|' /etc/clickhouse-server/config.d/keeper_port.xml
+ [[ -n '' ]]
+ [[ -n 1 ]]
+ [[ 1 -eq 1 ]]
+ ln -sf /usr/share/clickhouse-test/config/users.d/database_ordinary.xml /etc/clickhouse-server/users.d/
+ [[ '' == \1 ]]
+ [[ '' == \1 ]]
+ [[ -n 1 ]]
+ ln -sf /usr/share/clickhouse-test/config/config.d/azure_storage_conf.xml /etc/clickhouse-server/config.d/
+ ln -sf /usr/share/clickhouse-test/config/config.d/storage_conf.xml /etc/clickhouse-server/config.d/
+ ln -sf /usr/share/clickhouse-test/config/config.d/storage_conf_02944.xml /etc/clickhouse-server/config.d/
+ ln -sf /usr/share/clickhouse-test/config/config.d/storage_conf_02963.xml /etc/clickhouse-server/config.d/
+ ln -sf /usr/share/clickhouse-test/config/config.d/storage_conf_02961.xml /etc/clickhouse-server/config.d/
+ ln -sf /usr/share/clickhouse-test/config/users.d/s3_cache.xml /etc/clickhouse-server/users.d/
+ ln -sf /usr/share/clickhouse-test/config/users.d/s3_cache_new.xml /etc/clickhouse-server/users.d/
+ [[ -n '' ]]
+ ln -sf /usr/share/clickhouse-test/config/client_config.xml /etc/clickhouse-client/config.xml
+ sudo cat /etc/clickhouse-server/config.d/keeper_port.xml
+ sed 's|100000|10000|'
+ sudo mv /etc/clickhouse-server/config.d/keeper_port.xml.tmp /etc/clickhouse-server/config.d/keeper_port.xml
+ [[ -n 1 ]]
+ [[ 1 -eq 1 ]]
+ randomize_config_boolean_value filtered_list keeper_port
+ value=0
+ sudo cat /etc/clickhouse-server/config.d/keeper_port.xml
+ sed 's|[01]|0|'
+ sudo mv /etc/clickhouse-server/config.d/keeper_port.xml.tmp /etc/clickhouse-server/config.d/keeper_port.xml
+ randomize_config_boolean_value multi_read keeper_port
+ value=1
+ sudo cat /etc/clickhouse-server/config.d/keeper_port.xml
+ sed 's|[01]|1|'
+ sudo mv /etc/clickhouse-server/config.d/keeper_port.xml.tmp /etc/clickhouse-server/config.d/keeper_port.xml
+ randomize_config_boolean_value check_not_exists keeper_port
+ value=0
+ sudo cat /etc/clickhouse-server/config.d/keeper_port.xml
+ sed 's|[01]|0|'
+ sudo mv /etc/clickhouse-server/config.d/keeper_port.xml.tmp /etc/clickhouse-server/config.d/keeper_port.xml
+ randomize_config_boolean_value create_if_not_exists keeper_port
+ value=1
+ sudo cat /etc/clickhouse-server/config.d/keeper_port.xml
+ sed 's|[01]|1|'
+ sudo mv /etc/clickhouse-server/config.d/keeper_port.xml.tmp /etc/clickhouse-server/config.d/keeper_port.xml
+ sudo chown clickhouse /etc/clickhouse-server/config.d/keeper_port.xml
+ sudo chgrp clickhouse /etc/clickhouse-server/config.d/keeper_port.xml
+ [[ -n 1 ]]
+ [[ 1 -eq 1 ]]
+ randomize_config_boolean_value use_compression zookeeper_fault_injection
+ value=0
+ sudo cat /etc/clickhouse-server/config.d/zookeeper_fault_injection.xml
+ sed 's|[01]|0|'
+ sudo mv /etc/clickhouse-server/config.d/zookeeper_fault_injection.xml.tmp /etc/clickhouse-server/config.d/zookeeper_fault_injection.xml
+ randomize_config_boolean_value enable_block_number_column block_number
+ value=1
+ sudo cat /etc/clickhouse-server/config.d/block_number.xml
+ sed 's|[01]|1|'
+ sudo mv /etc/clickhouse-server/config.d/block_number.xml.tmp /etc/clickhouse-server/config.d/block_number.xml
+ randomize_config_boolean_value enable_block_offset_column block_number
+ value=0
+ sed 's|[01]|0|'
+ sudo cat /etc/clickhouse-server/config.d/block_number.xml
+ sudo mv /etc/clickhouse-server/config.d/block_number.xml.tmp /etc/clickhouse-server/config.d/block_number.xml
+ echo 'ASAN_OPTIONS='\''malloc_context_size=10 verbosity=1 allocator_release_to_os_interval_ms=10000'\'''
+ export 'ASAN_OPTIONS=malloc_context_size=10 allocator_release_to_os_interval_ms=10000'
+ ASAN_OPTIONS='malloc_context_size=10 allocator_release_to_os_interval_ms=10000'
+ sudo chown root: /var/lib/clickhouse
+ local total_mem
++ awk '/MemTotal/ { print $(NF-1) }' /proc/meminfo
+ total_mem=32080792
+ total_mem=32850731008
+ max_server_memory_usage_to_ram_ratio=0.5
+ echo 'Setting max_server_memory_usage_to_ram_ratio to 0.5'
+ cat
Setting max_server_memory_usage_to_ram_ratio to 0.5
Setting max_memory_usage_for_user=9855219302 and max_memory_usage for queries to 10G
+ local max_users_mem
+ max_users_mem=9855219302
+ echo 'Setting max_memory_usage_for_user=9855219302 and max_memory_usage for queries to 10G'
+ cat
+ cat
+ [[ '' == \1 ]]
+ [[ '' == \1 ]]
+ sudo cat /etc/clickhouse-server/config.d/logger_trace.xml
+ sed 's|trace|test|'
+ mv /etc/clickhouse-server/config.d/logger_trace.xml.tmp /etc/clickhouse-server/config.d/logger_trace.xml
+ '[' LRU = SLRU ']'
++ date +%-d
+ '[' 0 -eq 1 ']'
+ start_server
+ counter=0
+ max_attempt=120
+ clickhouse-client --query 'SELECT 1'
Code: 210. DB::NetException: Connection refused (localhost:9000). (NETWORK_ERROR)
+ '[' 0 -gt 120 ']'
+ clickhouse start --user root
+ sleep 0.5
+ counter=1
+ clickhouse-client --query 'SELECT 1'
Code: 210. DB::NetException: Connection refused (localhost:9000). (NETWORK_ERROR)
+ '[' 1 -gt 120 ']'
+ clickhouse start --user root
+ sleep 0.5
+ counter=2
+ clickhouse-client --query 'SELECT 1'
Code: 210. DB::NetException: Connection refused (localhost:9000). (NETWORK_ERROR)
+ '[' 2 -gt 120 ']'
+ clickhouse start --user root
+ sleep 0.5
+ counter=3
+ clickhouse-client --query 'SELECT 1'
Code: 210. DB::NetException: Connection refused (localhost:9000). (NETWORK_ERROR)
+ '[' 3 -gt 120 ']'
+ clickhouse start --user root
+ sleep 0.5
+ counter=4
+ clickhouse-client --query 'SELECT 1'
Code: 210. DB::NetException: Connection refused (localhost:9000). (NETWORK_ERROR)
+ '[' 4 -gt 120 ']'
+ clickhouse start --user root
+ sleep 0.5
+ counter=5
+ clickhouse-client --query 'SELECT 1'
Code: 210. DB::NetException: Connection refused (localhost:9000). (NETWORK_ERROR)
+ '[' 5 -gt 120 ']'
+ clickhouse start --user root
+ sleep 0.5
+ counter=6
+ clickhouse-client --query 'SELECT 1'
Code: 210. DB::NetException: Connection refused (localhost:9000). (NETWORK_ERROR)
+ '[' 6 -gt 120 ']'
+ clickhouse start --user root
+ sleep 0.5
127.0.0.1 - - [30/Oct/2026:16:52:12 +0000] "GET /devstoreaccount1/cont?restype=container HTTP/1.1" 200 -
+ counter=7
+ clickhouse-client --query 'SELECT 1'
127.0.0.1 - - [30/Oct/2026:16:52:12 +0000] "PUT /devstoreaccount1/cont/qcwwbbjcjmmyxfeakpagyeviqociwjrr HTTP/1.1" 201 -
127.0.0.1 - - [30/Oct/2026:16:52:12 +0000] "GET /devstoreaccount1/cont/qcwwbbjcjmmyxfeakpagyeviqociwjrr HTTP/1.1" 206 4
127.0.0.1 - - [30/Oct/2026:16:52:13 +0000] "GET /devstoreaccount1/cont/qcwwbbjcjmmyxfeakpagyeviqociwjrr HTTP/1.1" 206 2
127.0.0.1 - - [30/Oct/2026:16:52:13 +0000] "DELETE /devstoreaccount1/cont/qcwwbbjcjmmyxfeakpagyeviqociwjrr HTTP/1.1" 202 -
Code: 210. DB::NetException: Connection refused (localhost:9000). (NETWORK_ERROR)
+ '[' 7 -gt 120 ']'
+ clickhouse start --user root
+ sleep 0.5
+ counter=8
+ clickhouse-client --query 'SELECT 1'
Code: 210. DB::NetException: Connection refused (localhost:9000). (NETWORK_ERROR)
+ '[' 8 -gt 120 ']'
+ clickhouse start --user root
+ sleep 0.5
+ counter=9
+ clickhouse-client --query 'SELECT 1'
Code: 210. DB::NetException: Connection refused (localhost:9000). (NETWORK_ERROR)
+ '[' 9 -gt 120 ']'
+ clickhouse start --user root
+ sleep 0.5
+ counter=10
+ clickhouse-client --query 'SELECT 1'
Code: 210. DB::NetException: Connection refused (localhost:9000). (NETWORK_ERROR)
+ '[' 10 -gt 120 ']'
+ clickhouse start --user root
+ sleep 0.5
+ counter=11
+ clickhouse-client --query 'SELECT 1'
Code: 210. DB::NetException: Connection refused (localhost:9000). (NETWORK_ERROR)
+ '[' 11 -gt 120 ']'
+ clickhouse start --user root
+ sleep 0.5
+ counter=12
+ clickhouse-client --query 'SELECT 1'
Code: 210. DB::NetException: Connection refused (localhost:9000). (NETWORK_ERROR)
+ '[' 12 -gt 120 ']'
+ clickhouse start --user root
+ sleep 0.5
+ counter=13
+ clickhouse-client --query 'SELECT 1'
Code: 210. DB::NetException: Connection refused (localhost:9000). (NETWORK_ERROR)
+ '[' 13 -gt 120 ']'
+ clickhouse start --user root
+ sleep 0.5
+ counter=14
+ clickhouse-client --query 'SELECT 1'
Code: 210. DB::NetException: Connection refused (localhost:9000). (NETWORK_ERROR)
+ '[' 14 -gt 120 ']'
+ clickhouse start --user root
+ sleep 0.5
+ counter=15
+ clickhouse-client --query 'SELECT 1'
Code: 210. DB::NetException: Connection refused (localhost:9000). (NETWORK_ERROR)
+ '[' 15 -gt 120 ']'
+ clickhouse start --user root
+ sleep 0.5
+ counter=16
+ clickhouse-client --query 'SELECT 1'
1
+ attach_gdb_to_clickhouse
++ run_with_retry 5 clickhouse-client --query 'SELECT count() FROM system.build_options WHERE name = '\''CXX_FLAGS'\'' AND position('\''sanitize=address'\'' IN value)'
++ [[ hxB =~ e ]]
++ set_e=false
++ set +e
++ local total_retries=5
++ shift
++ local retry=0
++ '[' 0 -ge 5 ']'
++ clickhouse-client --query 'SELECT count() FROM system.build_options WHERE name = '\''CXX_FLAGS'\'' AND position('\''sanitize=address'\'' IN value)'
Received exception from server (version 24.8.14):
Code: 439. DB::Exception: Received from localhost:9000. DB::Exception: Cannot schedule a task: fault injected (threads=1, jobs=1). (CANNOT_SCHEDULE_TASK)
(query: SELECT count() FROM system.build_options WHERE name = 'CXX_FLAGS' AND position('sanitize=address' IN value))
++ retry=1
++ sleep 5
++ '[' 1 -ge 5 ']'
++ clickhouse-client --query 'SELECT count() FROM system.build_options WHERE name = '\''CXX_FLAGS'\'' AND position('\''sanitize=address'\'' IN value)'
++ false
++ return
+ IS_ASAN=0
+ [[ 0 = \1 ]]
++ kill -l SIGRTMIN
+ RTMIN=34
+ echo '
set follow-fork-mode parent
handle SIGHUP nostop noprint pass
handle SIGINT nostop noprint pass
handle SIGQUIT nostop noprint pass
handle SIGPIPE nostop noprint pass
handle SIGTERM nostop noprint pass
handle SIGUSR1 nostop noprint pass
handle SIGUSR2 nostop noprint pass
handle SIG34 nostop noprint pass
info signals
continue
backtrace full
info registers
p top' 1 KiB of the 'stack:
p/x *(uint64_t[128]*)$sp
maintenance info sections
thread apply all backtrace full
disassemble /s
up
disassemble /s
up
disassemble /s
p "done"
detach
quit
'
+ sleep 5
+ ts '%Y-%m-%d %H:%M:%S'
++ cat /var/run/clickhouse-server/clickhouse-server.pid
+ gdb -batch -command script.gdb -p 2625
+ run_with_retry 60 clickhouse-client --query 'SELECT '\''Connected to clickhouse-server after attaching gdb'\'''
+ [[ hxB =~ e ]]
+ set_e=false
+ set +e
+ local total_retries=60
+ shift
+ local retry=0
+ '[' 0 -ge 60 ']'
+ clickhouse-client --query 'SELECT '\''Connected to clickhouse-server after attaching gdb'\'''
Connected to clickhouse-server after attaching gdb
+ false
+ return
+ stress --hung-check --drop-databases --output-folder test_output --skip-func-tests '' --global-time-limit 1200
2026-10-30 17:52:37,698 Run func tests '/usr/bin/clickhouse-test --client-option http_make_head_request=0 ignore_drop_queries_probability=0.5 --global_time_limit=1200 '
2026-10-30 17:52:38,200 Run func tests '/usr/bin/clickhouse-test --order=random --database=test_1 --client-option join_use_nulls=1 join_algorithm='parallel_hash' memory_tracker_fault_probability=0.001 merge_tree_read_split_ranges_into_intersecting_and_non_intersecting_injection_probability=0.05 group_by_use_nulls=1 ignore_drop_queries_probability=0.5 --global_time_limit=1200 '
2026-10-30 17:52:38,702 Run func tests '/usr/bin/clickhouse-test --order=random --db-engine="Replicated('/test/db/test_2', 's1', 'r1')" --client-option enable_deflate_qpl_codec=1 enable_zstd_qat_codec=1 optimize_trivial_approximate_count_query=1 ignore_drop_queries_probability=0.5 --global_time_limit=1200 '
2026-10-30 17:52:39,203 Run func tests '/usr/bin/clickhouse-test --order=random --database=test_3 --client-option join_algorithm='partial_merge' use_query_cache=1 query_cache_nondeterministic_function_handling='ignore' query_cache_system_table_handling='ignore' group_by_use_nulls=1 ignore_drop_queries_probability=0.5 enable_parallel_replicas=1 max_parallel_replicas=3 cluster_for_parallel_replicas='parallel_replicas' parallel_replicas_for_non_replicated_merge_tree=1 --global_time_limit=1200 '
2026-10-30 17:52:39,705 Run func tests '/usr/bin/clickhouse-test --order=random --client-option join_use_nulls=1 ignore_drop_queries_probability=0.5 --global_time_limit=1200 '
2026-10-30 17:52:40,206 Run func tests '/usr/bin/clickhouse-test --order=random --db-engine="Replicated('/test/db/test_5', 's1', 'r1')" --database=test_5 --client-option enable_deflate_qpl_codec=1 enable_zstd_qat_codec=1 join_algorithm='full_sorting_merge' use_query_cache=1 query_cache_nondeterministic_function_handling='ignore' query_cache_system_table_handling='ignore' group_by_use_nulls=1 ignore_drop_queries_probability=0.5 --global_time_limit=1200 '
2026-10-30 17:52:40,707 Run func tests '/usr/bin/clickhouse-test --order=random --client-option memory_tracker_fault_probability=0.001 merge_tree_read_split_ranges_into_intersecting_and_non_intersecting_injection_probability=0.05 optimize_trivial_approximate_count_query=1 http_make_head_request=0 ignore_drop_queries_probability=0.5 --global_time_limit=1200 '
2026-10-30 17:52:41,209 Run func tests '/usr/bin/clickhouse-test --order=random --database=test_7 --client-option join_use_nulls=1 join_algorithm='grace_hash' use_query_cache=1 query_cache_nondeterministic_function_handling='ignore' query_cache_system_table_handling='ignore' group_by_use_nulls=1 http_make_head_request=1 ignore_drop_queries_probability=0.5 --global_time_limit=1200 '
2026-10-30 17:52:41,710 Run func tests '/usr/bin/clickhouse-test --order=random --db-engine="Replicated('/test/db/test_8', 's1', 'r1')" --client-option enable_deflate_qpl_codec=1 enable_zstd_qat_codec=1 http_make_head_request=0 ignore_drop_queries_probability=0.5 --global_time_limit=1200 '
2026-10-30 17:52:42,211 Run func tests '/usr/bin/clickhouse-test --order=random --database=test_9 --client-option join_algorithm='auto' max_rows_in_join=1000 use_query_cache=1 query_cache_nondeterministic_function_handling='ignore' query_cache_system_table_handling='ignore' group_by_use_nulls=1 ignore_drop_queries_probability=0.5 --global_time_limit=1200 '
2026-10-30 17:52:42,713 Run func tests '/usr/bin/clickhouse-test --order=random --client-option join_use_nulls=1 use_query_cache=1 query_cache_nondeterministic_function_handling='ignore' query_cache_system_table_handling='ignore' http_make_head_request=0 ignore_drop_queries_probability=0.5 --global_time_limit=1200 '
2026-10-30 17:52:43,214 Run func tests '/usr/bin/clickhouse-test --order=random --db-engine="Replicated('/test/db/test_11', 's1', 'r1')" --database=test_11 --client-option enable_deflate_qpl_codec=1 enable_zstd_qat_codec=1 join_algorithm='parallel_hash' memory_tracker_fault_probability=0.001 merge_tree_read_split_ranges_into_intersecting_and_non_intersecting_injection_probability=0.05 group_by_use_nulls=1 ignore_drop_queries_probability=0.5 --global_time_limit=1200 '
2026-10-30 17:52:43,715 Run func tests '/usr/bin/clickhouse-test --order=random --client-option implicit_transaction=1 throw_on_unsupported_query_inside_transaction=0 http_make_head_request=1 ignore_drop_queries_probability=0.5 enable_parallel_replicas=1 max_parallel_replicas=3 cluster_for_parallel_replicas='parallel_replicas' parallel_replicas_for_non_replicated_merge_tree=1 --global_time_limit=1200 '
2026-10-30 17:52:44,216 Run func tests '/usr/bin/clickhouse-test --order=random --database=test_13 --client-option join_use_nulls=1 join_algorithm='partial_merge' group_by_use_nulls=1 http_make_head_request=0 ignore_drop_queries_probability=0.5 enable_parallel_replicas=1 max_parallel_replicas=3 cluster_for_parallel_replicas='parallel_replicas' parallel_replicas_for_non_replicated_merge_tree=1 --global_time_limit=1200 '
2026-10-30 17:52:44,718 Run func tests '/usr/bin/clickhouse-test --order=random --db-engine="Replicated('/test/db/test_14', 's1', 'r1')" --client-option enable_deflate_qpl_codec=1 enable_zstd_qat_codec=1 use_query_cache=1 query_cache_nondeterministic_function_handling='ignore' query_cache_system_table_handling='ignore' http_make_head_request=1 ignore_drop_queries_probability=0.5 --global_time_limit=1200 '
2026-10-30 17:52:45,219 Run func tests '/usr/bin/clickhouse-test --order=random --database=test_15 --client-option join_algorithm='full_sorting_merge' use_query_cache=1 query_cache_nondeterministic_function_handling='ignore' query_cache_system_table_handling='ignore' group_by_use_nulls=1 ignore_drop_queries_probability=0.5 --global_time_limit=1200 '
2026-10-30 17:52:45,721 Will wait functests to finish
2026-10-30 17:52:45,721 Finished 9 from 16 processes
2026-10-30 17:52:50,726 Finished 9 from 16 processes
2026-10-30 17:52:55,730 Finished 9 from 16 processes
2026-10-30 17:53:00,731 Finished 9 from 16 processes
2026-10-30 17:53:05,735 Finished 9 from 16 processes
2026-10-30 17:53:10,740 Finished 9 from 16 processes
2026-10-30 17:53:15,743 Finished 9 from 16 processes
2026-10-30 17:53:20,747 Finished 9 from 16 processes
2026-10-30 17:53:25,751 Finished 9 from 16 processes
2026-10-30 17:53:30,756 Finished 9 from 16 processes
2026-10-30 17:53:35,761 Finished 9 from 16 processes
2026-10-30 17:53:40,763 Finished 10 from 16 processes
2026-10-30 17:53:45,767 Finished 11 from 16 processes
2026-10-30 17:53:50,771 Finished 11 from 16 processes
2026-10-30 17:53:55,775 Finished 11 from 16 processes
2026-10-30 17:54:00,779 Finished 11 from 16 processes
2026-10-30 17:54:05,783 Finished 11 from 16 processes
2026-10-30 17:54:10,787 Finished 11 from 16 processes
2026-10-30 17:54:15,791 Finished 11 from 16 processes
2026-10-30 17:54:20,795 Finished 11 from 16 processes
2026-10-30 17:54:25,799 Finished 11 from 16 processes
2026-10-30 17:54:30,803 Finished 11 from 16 processes
2026-10-30 17:54:35,808 Finished 11 from 16 processes
2026-10-30 17:54:40,812 Finished 11 from 16 processes
2026-10-30 17:54:45,815 Finished 11 from 16 processes
2026-10-30 17:54:50,819 Finished 11 from 16 processes
2026-10-30 17:54:55,823 Finished 11 from 16 processes
2026-10-30 17:55:00,827 Finished 11 from 16 processes
2026-10-30 17:55:05,831 Finished 11 from 16 processes
2026-10-30 17:55:10,835 Finished 11 from 16 processes
2026-10-30 17:55:15,839 Finished 11 from 16 processes
2026-10-30 17:55:20,843 Finished 11 from 16 processes
2026-10-30 17:55:25,847 Finished 11 from 16 processes
2026-10-30 17:55:30,851 Finished 11 from 16 processes
2026-10-30 17:55:35,855 Finished 11 from 16 processes
2026-10-30 17:55:40,859 Finished 11 from 16 processes
2026-10-30 17:55:45,864 Finished 11 from 16 processes
2026-10-30 17:55:50,867 Finished 11 from 16 processes
2026-10-30 17:55:55,871 Finished 11 from 16 processes
2026-10-30 17:56:00,875 Finished 11 from 16 processes
2026-10-30 17:56:05,879 Finished 11 from 16 processes
2026-10-30 17:56:10,883 Finished 11 from 16 processes
2026-10-30 17:56:15,884 Finished 11 from 16 processes
2026-10-30 17:56:20,887 Finished 11 from 16 processes
2026-10-30 17:56:25,891 Finished 11 from 16 processes
2026-10-30 17:56:30,895 Finished 11 from 16 processes
2026-10-30 17:56:35,899 Finished 11 from 16 processes
2026-10-30 17:56:40,903 Finished 11 from 16 processes
2026-10-30 17:56:45,907 Finished 11 from 16 processes
2026-10-30 17:56:50,911 Finished 11 from 16 processes
2026-10-30 17:56:55,915 Finished 11 from 16 processes
2026-10-30 17:57:00,919 Finished 11 from 16 processes
2026-10-30 17:57:05,923 Finished 11 from 16 processes
2026-10-30 17:57:10,927 Finished 11 from 16 processes
2026-10-30 17:57:15,931 Finished 11 from 16 processes
2026-10-30 17:57:20,935 Finished 11 from 16 processes
2026-10-30 17:57:25,939 Finished 11 from 16 processes
2026-10-30 17:57:30,943 Finished 11 from 16 processes
2026-10-30 17:57:35,947 Finished 11 from 16 processes
2026-10-30 17:57:40,951 Finished 11 from 16 processes
2026-10-30 17:57:45,955 Finished 11 from 16 processes
2026-10-30 17:57:50,959 Finished 11 from 16 processes
2026-10-30 17:57:55,963 Finished 11 from 16 processes
2026-10-30 17:58:00,967 Finished 11 from 16 processes
2026-10-30 17:58:05,971 Finished 11 from 16 processes
2026-10-30 17:58:10,975 Finished 11 from 16 processes
2026-10-30 17:58:15,979 Finished 11 from 16 processes
2026-10-30 17:58:20,983 Finished 11 from 16 processes
2026-10-30 17:58:25,987 Finished 11 from 16 processes
2026-10-30 17:58:30,991 Finished 11 from 16 processes
2026-10-30 17:58:35,995 Finished 11 from 16 processes
2026-10-30 17:58:40,999 Finished 11 from 16 processes
2026-10-30 17:58:46,003 Finished 11 from 16 processes
2026-10-30 17:58:51,007 Finished 11 from 16 processes
2026-10-30 17:58:56,011 Finished 11 from 16 processes
2026-10-30 17:59:01,015 Finished 11 from 16 processes
2026-10-30 17:59:06,019 Finished 11 from 16 processes
2026-10-30 17:59:11,023 Finished 11 from 16 processes
2026-10-30 17:59:16,027 Finished 11 from 16 processes
2026-10-30 17:59:21,031 Finished 11 from 16 processes
2026-10-30 17:59:26,035 Finished 11 from 16 processes
2026-10-30 17:59:31,039 Finished 11 from 16 processes
2026-10-30 17:59:36,043 Finished 11 from 16 processes
2026-10-30 17:59:41,047 Finished 11 from 16 processes
2026-10-30 17:59:46,051 Finished 11 from 16 processes
2026-10-30 17:59:51,055 Finished 11 from 16 processes
2026-10-30 17:59:56,059 Finished 11 from 16 processes
2026-10-30 18:00:01,063 Finished 11 from 16 processes
2026-10-30 18:00:06,067 Finished 11 from 16 processes
2026-10-30 18:00:11,071 Finished 11 from 16 processes
2026-10-30 18:00:16,075 Finished 11 from 16 processes
2026-10-30 18:00:21,079 Finished 11 from 16 processes
2026-10-30 18:00:26,083 Finished 11 from 16 processes
2026-10-30 18:00:31,087 Finished 11 from 16 processes
2026-10-30 18:00:36,091 Finished 11 from 16 processes
2026-10-30 18:00:41,095 Finished 11 from 16 processes
2026-10-30 18:00:46,099 Finished 11 from 16 processes
2026-10-30 18:00:51,103 Finished 11 from 16 processes
2026-10-30 18:00:56,107 Finished 11 from 16 processes
2026-10-30 18:01:01,111 Finished 11 from 16 processes
2026-10-30 18:01:06,115 Finished 11 from 16 processes
2026-10-30 18:01:11,119 Finished 11 from 16 processes
2026-10-30 18:01:16,123 Finished 11 from 16 processes
2026-10-30 18:01:21,127 Finished 11 from 16 processes
2026-10-30 18:01:26,131 Finished 11 from 16 processes
2026-10-30 18:01:31,135 Finished 11 from 16 processes
2026-10-30 18:01:36,139 Finished 11 from 16 processes
2026-10-30 18:01:41,143 Finished 11 from 16 processes
2026-10-30 18:01:46,148 Finished 11 from 16 processes
2026-10-30 18:01:51,151 Finished 11 from 16 processes
2026-10-30 18:01:56,155 Finished 11 from 16 processes
2026-10-30 18:02:01,159 Finished 11 from 16 processes
2026-10-30 18:02:06,163 Finished 11 from 16 processes
2026-10-30 18:02:11,167 Finished 11 from 16 processes
2026-10-30 18:02:16,171 Finished 11 from 16 processes
2026-10-30 18:02:21,175 Finished 11 from 16 processes
2026-10-30 18:02:26,179 Finished 11 from 16 processes
2026-10-30 18:02:31,183 Finished 11 from 16 processes
2026-10-30 18:02:36,187 Finished 11 from 16 processes
2026-10-30 18:02:41,191 Finished 11 from 16 processes
2026-10-30 18:02:46,195 Finished 11 from 16 processes
2026-10-30 18:02:51,199 Finished 11 from 16 processes
2026-10-30 18:02:56,203 Finished 11 from 16 processes
2026-10-30 18:03:01,207 Finished 11 from 16 processes
2026-10-30 18:03:06,211 Finished 11 from 16 processes
2026-10-30 18:03:11,216 Finished 11 from 16 processes
2026-10-30 18:03:16,219 Finished 11 from 16 processes
2026-10-30 18:03:21,223 Finished 11 from 16 processes
2026-10-30 18:03:26,227 Finished 11 from 16 processes
2026-10-30 18:03:31,229 Finished 11 from 16 processes
2026-10-30 18:03:36,231 Finished 11 from 16 processes
2026-10-30 18:03:41,235 Finished 11 from 16 processes
2026-10-30 18:03:46,239 Finished 11 from 16 processes
2026-10-30 18:03:51,243 Finished 11 from 16 processes
2026-10-30 18:03:56,248 Finished 11 from 16 processes
2026-10-30 18:04:01,251 Finished 11 from 16 processes
2026-10-30 18:04:06,256 Finished 11 from 16 processes
2026-10-30 18:04:11,259 Finished 11 from 16 processes
2026-10-30 18:04:16,263 Finished 11 from 16 processes
2026-10-30 18:04:21,267 Finished 11 from 16 processes
2026-10-30 18:04:26,272 Finished 11 from 16 processes
2026-10-30 18:04:31,275 Finished 11 from 16 processes
2026-10-30 18:04:36,279 Finished 11 from 16 processes
2026-10-30 18:04:41,283 Finished 11 from 16 processes
2026-10-30 18:04:46,287 Finished 11 from 16 processes
2026-10-30 18:04:51,288 Finished 11 from 16 processes
2026-10-30 18:04:56,293 Finished 11 from 16 processes
2026-10-30 18:05:01,295 Finished 11 from 16 processes
2026-10-30 18:05:06,300 Finished 11 from 16 processes
2026-10-30 18:05:11,301 Finished 11 from 16 processes
2026-10-30 18:05:16,303 Finished 11 from 16 processes
2026-10-30 18:05:21,308 Finished 11 from 16 processes
2026-10-30 18:05:26,311 Finished 11 from 16 processes
2026-10-30 18:05:31,316 Finished 11 from 16 processes
2026-10-30 18:05:36,319 Finished 11 from 16 processes
2026-10-30 18:05:41,323 Finished 11 from 16 processes
2026-10-30 18:05:46,327 Finished 11 from 16 processes
2026-10-30 18:05:51,331 Finished 11 from 16 processes
2026-10-30 18:05:56,336 Finished 11 from 16 processes
2026-10-30 18:06:01,339 Finished 11 from 16 processes
2026-10-30 18:06:06,343 Finished 11 from 16 processes
2026-10-30 18:06:11,347 Finished 11 from 16 processes
2026-10-30 18:06:16,351 Finished 11 from 16 processes
2026-10-30 18:06:21,356 Finished 11 from 16 processes
2026-10-30 18:06:26,359 Finished 11 from 16 processes
2026-10-30 18:06:31,363 Finished 11 from 16 processes
2026-10-30 18:06:36,367 Finished 11 from 16 processes
2026-10-30 18:06:41,371 Finished 11 from 16 processes
2026-10-30 18:06:46,375 Finished 11 from 16 processes
2026-10-30 18:06:51,379 Finished 11 from 16 processes
2026-10-30 18:06:56,383 Finished 11 from 16 processes
2026-10-30 18:07:01,387 Finished 11 from 16 processes
2026-10-30 18:07:06,391 Finished 11 from 16 processes
2026-10-30 18:07:11,395 Finished 11 from 16 processes
2026-10-30 18:07:16,399 Finished 11 from 16 processes
2026-10-30 18:07:21,403 Finished 11 from 16 processes
2026-10-30 18:07:26,407 Finished 11 from 16 processes
2026-10-30 18:07:31,411 Finished 11 from 16 processes
2026-10-30 18:07:36,416 Finished 11 from 16 processes
2026-10-30 18:07:41,419 Finished 11 from 16 processes
2026-10-30 18:07:46,423 Finished 11 from 16 processes
2026-10-30 18:07:51,427 Finished 11 from 16 processes
2026-10-30 18:07:56,431 Finished 11 from 16 processes
2026-10-30 18:08:01,435 Finished 11 from 16 processes
2026-10-30 18:08:06,439 Finished 11 from 16 processes
2026-10-30 18:08:11,443 Finished 11 from 16 processes
2026-10-30 18:08:16,448 Finished 11 from 16 processes
2026-10-30 18:08:21,451 Finished 11 from 16 processes
2026-10-30 18:08:26,455 Finished 11 from 16 processes
2026-10-30 18:08:31,459 Finished 11 from 16 processes
2026-10-30 18:08:36,463 Finished 11 from 16 processes
2026-10-30 18:08:41,467 Finished 11 from 16 processes
2026-10-30 18:08:46,471 Finished 11 from 16 processes
2026-10-30 18:08:51,478 Finished 11 from 16 processes
2026-10-30 18:08:56,483 Finished 11 from 16 processes
2026-10-30 18:09:01,487 Finished 11 from 16 processes
2026-10-30 18:09:06,491 Finished 11 from 16 processes
2026-10-30 18:09:11,495 Finished 11 from 16 processes
2026-10-30 18:09:16,499 Finished 11 from 16 processes
2026-10-30 18:09:21,503 Finished 11 from 16 processes
2026-10-30 18:09:26,508 Finished 11 from 16 processes
2026-10-30 18:09:31,511 Finished 11 from 16 processes
2026-10-30 18:09:36,515 Finished 11 from 16 processes
2026-10-30 18:09:41,519 Finished 11 from 16 processes
2026-10-30 18:09:46,523 Finished 11 from 16 processes
2026-10-30 18:09:51,527 Finished 11 from 16 processes
2026-10-30 18:09:56,531 Finished 11 from 16 processes
2026-10-30 18:10:01,535 Finished 11 from 16 processes
2026-10-30 18:10:06,539 Finished 11 from 16 processes
2026-10-30 18:10:11,543 Finished 11 from 16 processes
2026-10-30 18:10:16,547 Finished 11 from 16 processes
2026-10-30 18:10:21,551 Finished 11 from 16 processes
2026-10-30 18:10:26,555 Finished 11 from 16 processes
2026-10-30 18:10:31,559 Finished 11 from 16 processes
2026-10-30 18:10:36,563 Finished 11 from 16 processes
2026-10-30 18:10:41,564 Finished 11 from 16 processes
2026-10-30 18:10:46,567 Finished 11 from 16 processes
2026-10-30 18:10:51,571 Finished 11 from 16 processes
2026-10-30 18:10:56,575 Finished 11 from 16 processes
2026-10-30 18:11:01,579 Finished 11 from 16 processes
2026-10-30 18:11:06,583 Finished 11 from 16 processes
2026-10-30 18:11:11,587 Finished 11 from 16 processes
2026-10-30 18:11:16,591 Finished 11 from 16 processes
2026-10-30 18:11:21,594 Finished 11 from 16 processes
2026-10-30 18:11:26,599 Finished 11 from 16 processes
2026-10-30 18:11:31,603 Finished 11 from 16 processes
2026-10-30 18:11:36,607 Finished 11 from 16 processes
2026-10-30 18:11:41,611 Finished 11 from 16 processes
2026-10-30 18:11:46,616 Finished 11 from 16 processes
2026-10-30 18:11:51,619 Finished 11 from 16 processes
2026-10-30 18:11:56,623 Finished 11 from 16 processes
2026-10-30 18:12:01,627 Finished 11 from 16 processes
2026-10-30 18:12:06,631 Finished 11 from 16 processes
2026-10-30 18:12:11,635 Finished 11 from 16 processes
2026-10-30 18:12:16,639 Finished 11 from 16 processes
2026-10-30 18:12:21,643 Finished 11 from 16 processes
2026-10-30 18:12:26,647 Finished 11 from 16 processes
2026-10-30 18:12:31,651 Finished 11 from 16 processes
2026-10-30 18:12:36,652 Finished 11 from 16 processes
2026-10-30 18:12:41,655 Finished 11 from 16 processes
2026-10-30 18:12:46,659 Finished 12 from 16 processes
2026-10-30 18:12:51,663 Finished 12 from 16 processes
2026-10-30 18:12:56,667 Finished 12 from 16 processes
2026-10-30 18:13:01,671 Finished 12 from 16 processes
2026-10-30 18:13:06,675 Finished 12 from 16 processes
2026-10-30 18:13:11,679 Finished 12 from 16 processes
2026-10-30 18:13:16,683 Finished 12 from 16 processes
2026-10-30 18:13:21,687 Finished 12 from 16 processes
2026-10-30 18:13:26,691 Finished 12 from 16 processes
2026-10-30 18:13:31,695 Finished 12 from 16 processes
2026-10-30 18:13:36,699 Finished 12 from 16 processes
2026-10-30 18:13:41,703 Finished 12 from 16 processes
2026-10-30 18:13:46,707 Finished 12 from 16 processes
2026-10-30 18:13:51,711 Finished 12 from 16 processes
2026-10-30 18:13:56,715 Finished 12 from 16 processes
2026-10-30 18:14:01,719 Finished 12 from 16 processes
2026-10-30 18:14:06,724 Finished 13 from 16 processes
2026-10-30 18:14:11,728 Finished 13 from 16 processes
2026-10-30 18:14:16,729 Finished 13 from 16 processes
2026-10-30 18:14:21,731 Finished 13 from 16 processes
2026-10-30 18:14:26,735 Finished 13 from 16 processes
2026-10-30 18:14:31,740 Finished 13 from 16 processes
2026-10-30 18:14:36,743 Finished 13 from 16 processes
2026-10-30 18:14:41,747 Finished 13 from 16 processes
2026-10-30 18:14:46,752 Finished 13 from 16 processes
2026-10-30 18:14:51,755 Finished 13 from 16 processes
2026-10-30 18:14:56,759 Finished 13 from 16 processes
2026-10-30 18:15:01,765 Finished 13 from 16 processes
2026-10-30 18:15:06,769 Finished 13 from 16 processes
2026-10-30 18:15:11,771 Finished 13 from 16 processes
2026-10-30 18:15:16,775 Finished 13 from 16 processes
2026-10-30 18:15:21,779 Finished 13 from 16 processes
2026-10-30 18:15:26,781 Finished 14 from 16 processes
2026-10-30 18:15:31,783 Finished 14 from 16 processes
2026-10-30 18:15:36,787 Finished 14 from 16 processes
2026-10-30 18:15:41,789 Finished 14 from 16 processes
2026-10-30 18:15:46,794 Finished 14 from 16 processes
2026-10-30 18:15:51,800 Finished 14 from 16 processes
2026-10-30 18:15:56,803 Finished 14 from 16 processes
2026-10-30 18:16:01,807 Finished 14 from 16 processes
2026-10-30 18:16:06,812 Finished 14 from 16 processes
2026-10-30 18:16:11,815 Finished 14 from 16 processes
2026-10-30 18:16:16,819 Finished 14 from 16 processes
2026-10-30 18:16:21,824 Finished 14 from 16 processes
2026-10-30 18:16:26,830 Finished 14 from 16 processes
2026-10-30 18:16:31,831 Finished 14 from 16 processes
2026-10-30 18:16:36,835 Finished 14 from 16 processes
2026-10-30 18:16:41,839 Finished 14 from 16 processes
2026-10-30 18:16:46,843 Finished 14 from 16 processes
2026-10-30 18:16:51,847 Finished 14 from 16 processes
2026-10-30 18:16:56,851 Finished 14 from 16 processes
2026-10-30 18:17:01,855 Finished 14 from 16 processes
2026-10-30 18:17:06,859 Finished 14 from 16 processes
2026-10-30 18:17:11,863 Finished 14 from 16 processes
2026-10-30 18:17:16,864 Finished 14 from 16 processes
2026-10-30 18:17:21,869 Finished 14 from 16 processes
2026-10-30 18:17:26,873 Finished 14 from 16 processes
2026-10-30 18:17:31,875 Finished 14 from 16 processes
2026-10-30 18:17:36,877 Finished 14 from 16 processes
2026-10-30 18:17:41,883 Finished 14 from 16 processes
2026-10-30 18:17:46,887 Finished 14 from 16 processes
2026-10-30 18:17:51,890 Finished 14 from 16 processes
2026-10-30 18:17:56,895 Finished 15 from 16 processes
2026-10-30 18:18:01,898 Finished 15 from 16 processes
2026-10-30 18:18:06,903 All processes finished
2026-10-30 18:18:06,903 Compressing stress logs
2026-10-30 18:18:06,936 Logs compressed
2026-10-30 18:18:06,936 Will terminate gdb (if any)
2026-10-30 18:18:06,936 Running command: kill -TERM $(pidof gdb)
2026-10-30 18:18:06,944 Running command: timeout 50s tail --pid=$(pidof gdb) -f /dev/null || kill -9 $(pidof gdb) ||:
2026-10-30 18:18:07,961 Running command: kill -CONT $(cat /var/run/clickhouse-server/clickhouse-server.pid) && clickhouse client -q 'SELECT 1 FORMAT Null'
2026-10-30 18:18:08,378 Running command: clickhouse client -q "SYSTEM STOP THREAD FUZZER" --max_untracked_memory=1Gi --memory_profiler_step=1Gi --max_memory_usage_for_user=0 --max_memory_usage_in_client=1000000000
2026-10-30 18:18:08,743 Running command: clickhouse client -q "SYSTEM START MERGES" --max_untracked_memory=1Gi --memory_profiler_step=1Gi --max_memory_usage_for_user=0 --max_memory_usage_in_client=1000000000
2026-10-30 18:18:08,958 Running command: clickhouse client -q "SYSTEM START DISTRIBUTED SENDS" --max_untracked_memory=1Gi --memory_profiler_step=1Gi --max_memory_usage_for_user=0 --max_memory_usage_in_client=1000000000
2026-10-30 18:18:09,223 Running command: clickhouse client -q "SYSTEM START TTL MERGES" --max_untracked_memory=1Gi --memory_profiler_step=1Gi --max_memory_usage_for_user=0 --max_memory_usage_in_client=1000000000
2026-10-30 18:18:09,488 Running command: clickhouse client -q "SYSTEM START MOVES" --max_untracked_memory=1Gi --memory_profiler_step=1Gi --max_memory_usage_for_user=0 --max_memory_usage_in_client=1000000000
2026-10-30 18:18:09,754 Running command: clickhouse client -q "SYSTEM START FETCHES" --max_untracked_memory=1Gi --memory_profiler_step=1Gi --max_memory_usage_for_user=0 --max_memory_usage_in_client=1000000000
2026-10-30 18:18:10,019 Running command: clickhouse client -q "SYSTEM START REPLICATED SENDS" --max_untracked_memory=1Gi --memory_profiler_step=1Gi --max_memory_usage_for_user=0 --max_memory_usage_in_client=1000000000
2026-10-30 18:18:10,284 Running command: clickhouse client -q "SYSTEM START REPLICATION QUEUES" --max_untracked_memory=1Gi --memory_profiler_step=1Gi --max_memory_usage_for_user=0 --max_memory_usage_in_client=1000000000
2026-10-30 18:18:10,549 Running command: clickhouse client -q "SYSTEM DROP MARK CACHE" --max_untracked_memory=1Gi --memory_profiler_step=1Gi --max_memory_usage_for_user=0 --max_memory_usage_in_client=1000000000
2026-10-30 18:18:10,815 Running command: clickhouse client -q "KILL QUERY WHERE upper(query) LIKE 'WATCH %'" --max_untracked_memory=1Gi --memory_profiler_step=1Gi --max_memory_usage_for_user=0 --max_memory_usage_in_client=1000000000
2026-10-30 18:18:11,080 Running command: clickhouse client -q "KILL QUERY WHERE query LIKE 'insert into tableB select %'" --max_untracked_memory=1Gi --memory_profiler_step=1Gi --max_memory_usage_for_user=0 --max_memory_usage_in_client=1000000000
2026-10-30 18:18:11,345 Running command: clickhouse client -q "KILL QUERY WHERE query LIKE 'SELECT URL, uniq(SearchPhrase) AS u FROM test.hits GROUP BY URL ORDER BY u %'" --max_untracked_memory=1Gi --memory_profiler_step=1Gi --max_memory_usage_for_user=0 --max_memory_usage_in_client=1000000000
2026-10-30 18:18:11,560 Running command: clickhouse client -q "KILL QUERY WHERE query LIKE 'SELECT (SELECT number FROM system.numbers WHERE number = 1000000000000)%'" --max_untracked_memory=1Gi --memory_profiler_step=1Gi --max_memory_usage_for_user=0 --max_memory_usage_in_client=1000000000
Received exception from server (version 24.8.14):
Code: 159. DB::Exception: Received from localhost:9000. DB::Exception: Timeout exceeded: elapsed 60.017332717 seconds, maximum: 60. (TIMEOUT_EXCEEDED)
(query: SELECT sleepEachRow((
SELECT maxOrDefault(300 - elapsed) + 1
FROM system.processes
WHERE query NOT LIKE '%FROM system.processes%' AND elapsed < 300
) / 300)
FROM numbers(300)
FORMAT Null
SETTINGS function_sleep_max_microseconds_per_block = 0
)
2026-10-30 18:19:12,803 Checking if some queries hung
Using queries from '/usr/share/clickhouse-test/queries' directory
Connecting to ClickHouse server... OK
Connected to server 24.8.14.10550.altinitytest @ 77bb5f60cb900b3241b66f4d944f121e7fd44637 HEAD
Running 1 stateless tests (MainProcess).
00001_select_1: [ OK ]
1 tests passed. 0 tests skipped. 0.33 s elapsed (MainProcess).
Won't run stateful tests because test data wasn't loaded.
Checking the hung queries: done
No queries hung.
All tests have finished.
Top patterns of log messages:
count count_% size size_% uniq_loggers uniq_threads levels background_% message_format_string
1. 12811 0.075 1.30 MiB 0.042 1 75 ['Trace'] 0.19 Checking existence of path: {}
2. 9138 0.053 232.08 KiB 0.007 1 88 ['Trace'] 0.003 Query to stage {}{}
3. 9016 0.053 442.16 KiB 0.014 1 88 ['Trace'] 0.003 Query from stage {} to stage {}{}
4. 6949 0.041 1.43 MiB 0.046 1 59 ['Debug'] 0 (from {}{}{}){}{} {} (stage: {})
5. 6924 0.04 1.05 MiB 0.034 3895 59 ['Trace'] 1 {} Creating query context from {} context, user_id: {}, parent context user: {}
6. 5204 0.03 146.84 KiB 0.005 1 59 ['Debug'] 0 Processed in {} sec.
7. 4656 0.027 327.47 KiB 0.01 1 611 ['Trace'] 0.86 Reserved {} on local disk {}, having unreserved {}.
8. 4636 0.027 196.74 KiB 0.006 1 78 ['Trace'] 1 is disk {} eligible for search: {}
9. 4315 0.025 401.65 KiB 0.013 1 41 ['Debug'] 0 Reading {} marks from part {}, total {} rows starting from the beginning of the part
10. 4024 0.023 192.59 KiB 0.006 1 169 ['Trace'] 0.63 filled checksums {}
11. 4013 0.023 210.11 KiB 0.007 4013 70 ['Debug'] 0.997 Authenticating user '{}' from {}
12. 4009 0.023 477.35 KiB 0.015 164 164 ['Trace'] 0.633 Renaming temporary part {} to {} with tid {}.
13. 3988 0.023 447.87 KiB 0.014 3988 70 ['Debug'] 0.997 {} Authenticated with global context as user {}
14. 3972 0.023 290.92 KiB 0.009 3972 59 ['Debug'] 1 Creating session context with user_id: {}
15. 3970 0.023 348.93 KiB 0.011 3970 69 ['Debug'] 0.997 {} Logout, user_id: {}
16. 3956 0.023 274.38 KiB 0.009 163 586 ['Trace'] 0.846 Trying to reserve {} using storage policy from min volume index {}
17. 3909 0.023 206.36 KiB 0.006 1 82 ['Debug'] 0.356 Peak memory usage{}: {}.
18. 2960 0.017 235.62 KiB 0.007 1 51 ['Debug'] 0 Read {} rows, {} in {} sec., {} rows/sec., {}/sec.
19. 2538 0.015 145.36 KiB 0.005 16 39 ['Trace'] 1 Flushing system log, {} entries to flush up to offset {}
20. 2534 0.015 90.07 KiB 0.003 16 39 ['Trace'] 1 Flushed system log up to offset {}
21. 2334 0.014 216.40 KiB 0.007 1 59 ['Debug'] 1 Connected {} version {}.{}.{}, revision: {}{}{}.
22. 2334 0.014 77.13 KiB 0.002 1 59 ['Trace'] 1 TCP Request. Address: {}
23. 2288 0.013 60.33 KiB 0.002 1 57 ['Debug'] 1 Done processing connection.
24. 1870 0.011 219.67 KiB 0.007 1 21 ['Debug'] 0 Reading {} marks from part {}, total {} rows starting from the beginning of the part, column {}
25. 1670 0.01 335.60 KiB 0.011 2 37 ['Trace'] 1 HTTP Request for {}. Method: {}, Address: {}, User-Agent: {}{}, Content Type: {}, Transfer Encoding: {}, X-Forwarded-For: {}
26. 1666 0.01 3.15 MiB 0.101 2 37 ['Trace'] 1 Request URI: {}
27. 1584 0.009 162.03 KiB 0.005 1 7 ['Trace'] 0.5 Adding file: {}, size: {}
28. 1526 0.009 90.90 KiB 0.003 219 99 ['Debug'] 0.227 There are {} detached tables. Start searching non used tables.
29. 1526 0.009 64.08 KiB 0.002 219 99 ['Debug'] 0.227 Found {} non used tables in detached tables.
30. 1467 0.009 30.08 KiB 0.001 2 37 ['Debug'] 0.001 Done processing query
31. 1405 0.008 62.57 KiB 0.002 1 3 ['Trace'] 1 Processing requests batch, size: {}, bytes: {}
32. 1253 0.007 151.98 KiB 0.005 1 6 ['Trace'] 1 MemoryTracking: was {}, peak {}, free memory in arenas {}, will set to {} (RSS), difference: {}
33. 1020 0.006 8.16 MiB 0.262 3 16 ['Error'] 1 Cannot parse string {} as {}: syntax error {}
34. 887 0.005 79.78 KiB 0.002 1 119 ['Trace'] 0 Aggregated. {} to {} rows (from {}) in {} sec. ({:.3f} rows/sec., {}/sec.)
35. 844 0.005 28.83 KiB 0.001 1 41 ['Debug'] 0 Selected MergeAlgorithm: {}
36. 844 0.005 70.11 KiB 0.002 1 41 ['Debug'] 0 Merging {} parts: from {} to {} into {} with storage {}
37. 842 0.005 45.20 KiB 0.001 47 454 ['Debug'] 0.958 Selected {} parts from {} to {}
38. 829 0.005 23.32 KiB 0.001 126 74 ['Debug'] 0.017 Key condition: {}
39. 811 0.005 35.64 KiB 0.001 125 74 ['Trace'] 0.017 Filtering marks by primary and secondary keys
40. 806 0.005 105.60 KiB 0.003 1 40 ['Debug'] 0 Merge sorted {} rows, containing {} columns ({} merged, {} gathered) in {} sec., {} rows/sec., {}/sec.
41. 805 0.005 52.87 KiB 0.002 45 41 ['Trace'] 0 Merged {} parts: [{}, {}] -> {}
42. 787 0.005 89.87 KiB 0.003 124 72 ['Debug'] 0.018 Selected {}/{} parts by partition key, {} parts by primary key, {}/{} marks by primary key, {} marks to read from {} ranges
43. 768 0.004 22.97 KiB 0.001 1 118 ['Trace'] 0 Aggregation method: {}
44. 729 0.004 29.19 KiB 0.001 27 92 ['Debug'] 0.093 Will use old analyzer to prepare mutation
45. 704 0.004 15.81 KiB 0 1 119 ['Trace'] 0 Merging aggregated data
46. 704 0.004 36.44 KiB 0.001 106 71 ['Trace'] 0.02 Spreading mark ranges among streams (default reading)
47. 701 0.004 76.90 KiB 0.002 104 74 ['Debug'] 0.98 Removing {} parts from filesystem (serially): Parts: [{}]
48. 688 0.004 53.08 KiB 0.002 1 49 ['Trace'] 0 Query span trace_id for opentelemetry log: {}
49. 635 0.004 60.70 KiB 0.002 37 21 ['Trace'] 0.967 Found {} old parts to remove. Parts: [{}]
50. 635 0.004 61.32 KiB 0.002 37 21 ['Debug'] 0.967 Removing {} parts from memory: Parts: [{}]
51. 618 0.004 27.18 KiB 0.001 1 16 ['Trace'] 0 Mutating part {} to mutation version {}
52. 603 0.004 33.78 KiB 0.001 1 69 ['Trace'] 0 Handling request from replica {}, minimal marks size is {}
53. 603 0.004 74.72 KiB 0.002 1 69 ['Debug'] 0 Going to respond to replica {} with {}; mine_marks={}, stolen_by_hash={}, stolen_rest={}
54. 582 0.003 44.86 KiB 0.001 7 50 ['Trace'] 1 Part {} is not stored on zero-copy replicated disk, blobs can be removed
55. 580 0.003 60.21 KiB 0.002 53 16 ['Trace'] 1 Mutating part {} with mutation commands from {} mutations ({}): {}
56. 580 0.003 32.26 KiB 0.001 53 16 ['Trace'] 1 Executing log entry to mutate part {} to {}
57. 565 0.003 22.62 KiB 0.001 12 88 ['Trace'] 0 Sending external_roles with query: [{}] ({})
58. 536 0.003 20.97 KiB 0.001 1 137 ['Debug'] 0.591 Spawn loader worker #{} in {}
59. 536 0.003 15.20 KiB 0 1 168 ['Debug'] 1 Stop worker in {}
60. 535 0.003 40.32 KiB 0.001 1 38 ['Debug'] 0.155 Schedule load job '{}' into {}
61. 535 0.003 38.75 KiB 0.001 1 138 ['Debug'] 1 Execute load job '{}' in {}
62. 535 0.003 36.64 KiB 0.001 1 138 ['Debug'] 1 Finish load job '{}' with status {}
63. 534 0.003 2.09 MiB 0.067 18 68 ['Error'] 0.15 Cannot schedule a task: {} (threads={}, jobs={})
64. 524 0.003 48.23 KiB 0.002 1 39 ['Debug'] 0.107 Prioritize load job '{}': {} -> {}
65. 518 0.003 5.56 KiB 0 1 104 ['Trace'] 0 Aggregating
66. 510 0.003 23.87 KiB 0.001 1 317 ['Trace'] 1 Part {} in zookeeper: {}, locally: {}
67. 510 0.003 12.91 KiB 0 1 317 ['Information'] 1 Part {} looks good.
68. 510 0.003 11.42 KiB 0 1 317 ['Information'] 1 Checking part {}
69. 510 0.003 19.39 KiB 0.001 1 16 ['Trace'] 0 Enqueueing {} for check after {}s
70. 510 0.003 15.90 KiB 0 1 317 ['Information'] 1 Checking data of part {}.
71. 463 0.003 15.36 KiB 0 1 143 ['Debug'] 0.527 Change current priority: {} -> {}
72. 458 0.003 36.72 KiB 0.001 82 56 ['Trace'] 0.009 Reading {} ranges in{}order from part {}, approx. {} rows starting from {}
73. 448 0.003 36.92 KiB 0.001 1 39 ['Debug'] 0 mark_segment_size={}, min_marks_per_task*threads={}, sum_marks/number_of_replicas^2={}
74. 448 0.003 10.56 KiB 0 1 39 ['Debug'] 0 Chosen segment size: {}
75. 446 0.003 3.92 KiB 0 2 38 ['Trace'] 0.018 No tables
76. 436 0.003 17.88 KiB 0.001 1 67 ['Debug'] 0 Sent initial requests: {} Replicas count: {}
77. 436 0.003 52.19 KiB 0.002 1 67 ['Debug'] 0 Initial request: {}
78. 371 0.002 29.57 KiB 0.001 1 101 ['Trace'] 0 Statistics updated for key={}: new sum_of_sizes={}, median_size={}
79. 344 0.002 28.04 KiB 0.001 1 101 ['Trace'] 0 An entry for key={} found in cache: sum_of_sizes={}, median_size={}
80. 340 0.002 10.56 KiB 0 20 9 ['Debug'] 0 Requested flush up to offset {}
81. 313 0.002 22.02 KiB 0.001 1 40 ['Trace'] 0.013 Condition {} moved to PREWHERE
82. 297 0.002 12.77 KiB 0 1 3 ['Information'] 1 {} for session {} took {} ms
83. 294 0.002 52.18 KiB 0.002 1 44 ['Trace'] 0.014 PREWHERE condition was split into {} steps: {}
84. 274 0.002 11.17 KiB 0 30 51 ['Debug'] 0 MinMax index condition: {}
85. 263 0.002 21.23 KiB 0.001 1 3 ['Debug'] 1 Merging configuration file '{}'.
86. 239 0.001 17.43 KiB 0.001 1 41 ['Trace'] 0.017 The min valid primary key position for moving to the tail of PREWHERE is {}
87. 239 0.001 13.97 KiB 0 18 81 ['Trace'] 0.979 Finished loading {} part {} on disk {}
88. 239 0.001 12.33 KiB 0 18 81 ['Trace'] 0.979 Loading {} part {} from disk {}
89. 236 0.001 753.98 KiB 0.024 2 13 ['Error'] 0 Table {}.{} does not exist
90. 235 0.001 4.13 KiB 0 201 76 ['Debug'] 0.209 Loading data parts
91. 233 0.001 12.50 KiB 0 7 39 ['Trace'] 0.931 List of all grants: {}
92. 233 0.001 20.43 KiB 0.001 7 39 ['Trace'] 0.931 List of all grants including implicit: {}
93. 233 0.001 17.75 KiB 0.001 7 39 ['Trace'] 0.931 Settings: readonly = {}, allow_ddl = {}, allow_introspection_functions = {}
94. 229 0.001 18.73 KiB 0.001 220 38 ['Information'] 0.044 Metadata processed, database {} has {} tables and {} dictionaries in total.
95. 227 0.001 15.74 KiB 0 1 39 ['Debug'] 0.035 Wait load job '{}' in {}
96. 225 0.001 13.38 KiB 0 1 38 ['Information'] 0.027 Parsed metadata of {} tables in {} databases in {} sec
97. 225 0.001 37.83 KiB 0.001 1 21 ['Trace'] 0 No query result found for query {}
98. 214 0.001 29.70 KiB 0.001 7 177 ['Trace'] 1 Checked {} partitions, found {} partitions with parts that may be merged: [{}] (max_total_size_to_merge={}, merge_with_ttl_allowed={})
99. 210 0.001 10.85 KiB 0 14 71 ['Trace'] 0 Connecting. Database: {}. User: {}{}{}
100. 205 0.001 23.62 KiB 0.001 1 33 ['Debug'] 0 Done waiting for the table {} to be dropped. The outcome: {}
count count_% size size_% uniq_loggers uniq_threads levels background_% message_format_string
Top messages without format string (fmt::runtime):
count pattern runtime_message line
1. 52 CodeDBExceptionReceivedfromDBExc Code: 439. DB::Exception: Received from 127.0.0.7:9000. DB::Exception: Cannot schedule a task: fault injected (threads=0, jobs=0).: While executing Remote. (CANNOT_SCHEDULE_TASK) (version 24.8.14.10550.altinitytest (altinity build)) (from [::1]:47466) (com ('/executeQuery.cpp',221)
2. 12 CodeDBExceptionSyntaxerrorfailed Code: 62. DB::Exception: Syntax error: failed at position 17 ('0.019286'): 0.019286. Expected one of: token sequence, Dot, token, OR, AND, IS NOT DISTINCT FROM, IS NULL, IS NOT NULL, BETWEEN, NOT BETWEEN, LIKE, ILIKE, NOT LIKE, NOT ILIKE, REGEXP, IN, NOT I ('/executeQuery.cpp',221)
3. 6 configatindexiscommittedprevconf config at index 1 is committed, prev config log idx 0 ('/LoggerWrapper.h',43)
4. 3 Connectiontomysqlfailedtimes Connection to mysql failed 1 times ('',0)
5. 3 Electiontimeoutinitiateleaderele Election timeout, initiate leader election ('/LoggerWrapper.h',43)
6. 3 waitforHBforms wait for HB, for 50 + [0, 0] ms ('/LoggerWrapper.h',43)
7. 3 StartingClickHousealtinitytestre Starting ClickHouse 24.8.14.10550.altinitytest (revision: 4294967295, git hash: 77bb5f60cb900b3241b66f4d944f121e7fd44637, build id: ACC682D82FA66BFC06DB278BEEEA60477C5CE971), PID 403 ('',0)
8. 3 newconfigurationlogidxprevlogidx new configuration: log idx 1, prev log idx 0
peer 1, DC ID 0, localhost:9234, voting member, 1
my id: 1, leader: 1, term: 1 ('/LoggerWrapper.h',43)
9. 3 invalidelectiontimeoutupperbound invalid election timeout upper bound detected, adjusted to 0 ('/LoggerWrapper.h',43)
10. 3 ConnectiontosystemasuserMYSQLUSE Connection to system@127.0.0.1:9004 as user 02833_MYSQL_USER_66986 failed: mysqlxx::ConnectionFailed: 02833_MYSQL_USER_66986: Authentication failed: password is incorrect, or there is no user with such name. ((nullptr):9004) ('',0)
11. 3 statemachinecommitindexprecommit state machine commit index 0, precommit index 0, last log index 0 ('/LoggerWrapper.h',43)
12. 3 Forkedachildprocesstowatch Forked a child process to watch ('',0)
13. 3 skippedconfiglatestconfig skipped config 1, latest config 1 ('/LoggerWrapper.h',43)
14. 3 INITRAFTSERVERcommitindextermele === INIT RAFT SERVER ===
commit index 0
term 0
election timer allowed
log store start 1, end 0
config log idx 0, prev log idx 0
-- ASYNC REPLICATION -- ('/LoggerWrapper.h',43)
15. 3 peerDCIDlocalhostvotingmembermyi peer 1: DC ID 0, localhost:9234, voting member, 1
my id: 1, voting_member
num peers: 0 ('/LoggerWrapper.h',43)
16. 3 invalidelectiontimeoutlowerbound invalid election timeout lower bound detected, adjusted to 0 ('/LoggerWrapper.h',43)
17. 3 bgappendentriesthreadinitiated bg append_entries thread initiated ('/LoggerWrapper.h',43)
18. 3 RaftASIOlistenerinitiatedonunsec Raft ASIO listener initiated on :::9234, unsecured ('/LoggerWrapper.h',43)
19. 3 startingup starting up ('',0)
20. 3 newelectiontimeoutrange new election timeout range: 0 - 0 ('/LoggerWrapper.h',43)
21. 3 VOTEINITmyidmyrolecandidateterml [VOTE INIT] my id 1, my role candidate, term 1, log idx 0, log term 0, priority (target 1 / mine 1) ('/LoggerWrapper.h',43)
22. 3 BECOMELEADERappendednewconfigat [BECOME LEADER] appended new config at 1 ('/LoggerWrapper.h',43)
23. 3 globalmanagerdoesnotexistwilluse global manager does not exist. will use local thread for commit and append ('/LoggerWrapper.h',43)
24. 3 ELECTIONTIMEOUTcurrentrolefollow [ELECTION TIMEOUT] current role: follower, log last term 0, state term 0, target p 1, my p 1, hb dead, pre-vote NOT done ('/LoggerWrapper.h',43)
25. 3 DBExceptionMYSQLUSERAuthenticati DB::Exception: 02833_MYSQL_USER_66986: Authentication failed: password is incorrect, or there is no user with such name. ('',0)
26. 3 PRIORITYdecaytargetmine [PRIORITY] decay, target 1 -> 1, mine 1 ('/LoggerWrapper.h',43)
27. 3 newconfiglogidxprevlogidxcurconf new config log idx 1, prev log idx 0, cur config log idx 0, prev log idx 0 ('/LoggerWrapper.h',43)
28. 3 parameterselectiontimeoutrangehe parameters: election timeout range 0 - 0, heartbeat 0, leadership expiry 0, max batch 100, backoff 50, snapshot distance 10000, enable randomized snapshot creation NO, log sync stop gap 99999, reserved logs 2147483647, client timeout 10000, auto forwarding ('/LoggerWrapper.h',43)
29. 3 numberofpendingcommitelements number of pending commit elements: 0 ('/LoggerWrapper.h',43)
30. 2 prevotetermisdifferentresetitto pre-vote term (0) is different, reset it to 1 ('/LoggerWrapper.h',43)
Top messages not matching their format strings:
message_format_string count() any_message
1. 87 Forked a child process to watch
2. {} is in use (by merge/mutation/INSERT) (consider increasing temporary_directories_lifetime setting) 1 /var/lib/clickhouse/store/5ba/5ba554c3-c16f-49d8-96c2-d0743ca803b1/tmp_insert_201403_11_11_0/ is in use (by merge/mutation/INSERT) (consider increasing temporary_directories_lifetime setting) (skipped 9 similar messages)
Top short messages:
c message_format_string substr(any(toValidUTF8(message)), 1, 120) min_length_without_exception_boilerplate
1. 18 Cannot TRUNCATE dictionary Code: 62. DB::Exception: Cannot TRUNCATE dictionary. (SYNTAX_ERROR) (version 24.8.14.10550.altinitytest (altinity build) 27
2. 17 {} ThreadFuzzer is enabled. Application will run slowly and unstable. 40
3. 5 Creating {}: {} Creating table test_deuvc1zl.tbl: CREATE TABLE IF NOT EXISTS test_deuvc1zl.tbl UUID '9b59ef51-70d2-4674-930d-8431c1032e8 108
4. 2 Found {} on {} Found changelog_1_100000.bin on LocalLogDisk 18
5. 1 Froze {} parts Froze 1 parts -13
Top messages by level:
(0.005949776883366874,'Cannot parse string {} as {}: syntax error {}') Error
(0.00018082655233762066,'Client has gone away.') Warning
(0.002974888441683437,'Part {} looks good.') Information
(0.04053431329658471,'(from {}{}{}){}{} {} (stage: {})') Debug
(0.07472803103216963,'Checking existence of path: {}') Trace
2026-10-30 18:19:14,325 Stress test finished
+ echo -e 'Test script exit code\tOK\t\N\t'
+ rg -Fa 'No queries hung' /test_output/test_results.tsv
+ grep -Fa OK
No queries hung OK \N
+ stop_server
+ local max_tries=90
+ local check_hang=true
+ local pid
++ cat /var/run/clickhouse-server/clickhouse-server.pid
+ pid=2625
+ clickhouse stop --max-tries 90 --do-not-kill
/var/run/clickhouse-server/clickhouse-server.pid file exists and contains pid = 2625.
The process with pid = 2625 is running.
Sent terminate signal to process with pid 2625.
Waiting for server to stop
/var/run/clickhouse-server/clickhouse-server.pid file exists and contains pid = 2625.
The process with pid = 2625 is running.
Waiting for server to stop
/var/run/clickhouse-server/clickhouse-server.pid file exists and contains pid = 2625.
The process with pid = 2625 is running.
Waiting for server to stop
/var/run/clickhouse-server/clickhouse-server.pid file exists and contains pid = 2625.
The process with pid = 2625 is running.
Waiting for server to stop
/var/run/clickhouse-server/clickhouse-server.pid file exists and contains pid = 2625.
The process with pid = 2625 is running.
Waiting for server to stop
/var/run/clickhouse-server/clickhouse-server.pid file exists and contains pid = 2625.
The process with pid = 2625 is running.
Waiting for server to stop
/var/run/clickhouse-server/clickhouse-server.pid file exists and contains pid = 2625.
The process with pid = 2625 is running.
Waiting for server to stop
/var/run/clickhouse-server/clickhouse-server.pid file exists and contains pid = 2625.
The process with pid = 2625 is running.
Waiting for server to stop
/var/run/clickhouse-server/clickhouse-server.pid file exists and contains pid = 2625.
The process with pid = 2625 does not exist.
Server stopped
+ return
+ mv /var/log/clickhouse-server/clickhouse-server.log /var/log/clickhouse-server/clickhouse-server.stress.log
+ unset THREAD_FUZZER_CPU_TIME_PERIOD_US THREAD_FUZZER_EXPLICIT_MEMORY_EXCEPTION_PROBABILITY THREAD_FUZZER_EXPLICIT_SLEEP_PROBABILITY THREAD_FUZZER_SLEEP_PROBABILITY THREAD_FUZZER_SLEEP_TIME_US_MAX THREAD_FUZZER_pthread_mutex_lock_AFTER_MIGRATE_PROBABILITY THREAD_FUZZER_pthread_mutex_lock_AFTER_SLEEP_PROBABILITY THREAD_FUZZER_pthread_mutex_lock_AFTER_SLEEP_TIME_US_MAX THREAD_FUZZER_pthread_mutex_lock_BEFORE_MIGRATE_PROBABILITY THREAD_FUZZER_pthread_mutex_lock_BEFORE_SLEEP_PROBABILITY THREAD_FUZZER_pthread_mutex_lock_BEFORE_SLEEP_TIME_US_MAX THREAD_FUZZER_pthread_mutex_unlock_AFTER_MIGRATE_PROBABILITY THREAD_FUZZER_pthread_mutex_unlock_AFTER_SLEEP_PROBABILITY THREAD_FUZZER_pthread_mutex_unlock_AFTER_SLEEP_TIME_US_MAX THREAD_FUZZER_pthread_mutex_unlock_BEFORE_MIGRATE_PROBABILITY THREAD_FUZZER_pthread_mutex_unlock_BEFORE_SLEEP_PROBABILITY THREAD_FUZZER_pthread_mutex_unlock_BEFORE_SLEEP_TIME_US_MAX THREAD_POOL_FAULT_INJECTION
+ start_server
+ counter=0
+ max_attempt=120
+ clickhouse-client --query 'SELECT 1'
Code: 210. DB::NetException: Connection refused (localhost:9000). (NETWORK_ERROR)
+ '[' 0 -gt 120 ']'
+ clickhouse start --user root
+ sleep 0.5
+ counter=1
+ clickhouse-client --query 'SELECT 1'
Code: 210. DB::NetException: Connection refused (localhost:9000). (NETWORK_ERROR)
+ '[' 1 -gt 120 ']'
+ clickhouse start --user root
127.0.0.1 - - [30/Oct/2026:17:19:22 +0000] "GET /devstoreaccount1/cont?restype=container HTTP/1.1" 200 -
127.0.0.1 - - [30/Oct/2026:17:19:22 +0000] "PUT /devstoreaccount1/cont/dcmhkmgghuwfeawarwswrvkpzpjbqavk HTTP/1.1" 201 -
127.0.0.1 - - [30/Oct/2026:17:19:22 +0000] "GET /devstoreaccount1/cont/dcmhkmgghuwfeawarwswrvkpzpjbqavk HTTP/1.1" 206 4
127.0.0.1 - - [30/Oct/2026:17:19:23 +0000] "GET /devstoreaccount1/cont/dcmhkmgghuwfeawarwswrvkpzpjbqavk HTTP/1.1" 206 2
127.0.0.1 - - [30/Oct/2026:17:19:23 +0000] "DELETE /devstoreaccount1/cont/dcmhkmgghuwfeawarwswrvkpzpjbqavk HTTP/1.1" 202 -
+ sleep 0.5
+ counter=2
+ clickhouse-client --query 'SELECT 1'
Code: 210. DB::NetException: Connection refused (localhost:9000). (NETWORK_ERROR)
+ '[' 2 -gt 120 ']'
+ clickhouse start --user root
+ sleep 0.5
+ counter=3
+ clickhouse-client --query 'SELECT 1'
1
+ attach_gdb_to_clickhouse
++ run_with_retry 5 clickhouse-client --query 'SELECT count() FROM system.build_options WHERE name = '\''CXX_FLAGS'\'' AND position('\''sanitize=address'\'' IN value)'
++ [[ hxB =~ e ]]
++ set_e=false
++ set +e
++ local total_retries=5
++ shift
++ local retry=0
++ '[' 0 -ge 5 ']'
++ clickhouse-client --query 'SELECT count() FROM system.build_options WHERE name = '\''CXX_FLAGS'\'' AND position('\''sanitize=address'\'' IN value)'
Received exception from server (version 24.8.14):
Code: 439. DB::Exception: Received from localhost:9000. DB::Exception: Cannot schedule a task: failed to start the thread (threads=1, jobs=1). (CANNOT_SCHEDULE_TASK)
(query: SELECT count() FROM system.build_options WHERE name = 'CXX_FLAGS' AND position('sanitize=address' IN value))
++ retry=1
++ sleep 5
++ '[' 1 -ge 5 ']'
++ clickhouse-client --query 'SELECT count() FROM system.build_options WHERE name = '\''CXX_FLAGS'\'' AND position('\''sanitize=address'\'' IN value)'
Received exception from server (version 24.8.14):
Code: 439. DB::Exception: Received from localhost:9000. DB::Exception: Cannot schedule a task: fault injected (threads=0, jobs=0). (CANNOT_SCHEDULE_TASK)
(query: SELECT count() FROM system.build_options WHERE name = 'CXX_FLAGS' AND position('sanitize=address' IN value))
++ retry=2
++ sleep 5
++ '[' 2 -ge 5 ']'
++ clickhouse-client --query 'SELECT count() FROM system.build_options WHERE name = '\''CXX_FLAGS'\'' AND position('\''sanitize=address'\'' IN value)'
Received exception from server (version 24.8.14):
Code: 439. DB::Exception: Received from localhost:9000. DB::Exception: Cannot schedule a task: fault injected (threads=14, jobs=14). (CANNOT_SCHEDULE_TASK)
(query: SELECT count() FROM system.build_options WHERE name = 'CXX_FLAGS' AND position('sanitize=address' IN value))
++ retry=3
++ sleep 5
++ '[' 3 -ge 5 ']'
++ clickhouse-client --query 'SELECT count() FROM system.build_options WHERE name = '\''CXX_FLAGS'\'' AND position('\''sanitize=address'\'' IN value)'
Received exception from server (version 24.8.14):
Code: 439. DB::Exception: Received from localhost:9000. DB::Exception: Cannot schedule a task: fault injected (threads=11, jobs=11). (CANNOT_SCHEDULE_TASK)
(query: SELECT count() FROM system.build_options WHERE name = 'CXX_FLAGS' AND position('sanitize=address' IN value))
++ retry=4
++ sleep 5
++ '[' 4 -ge 5 ']'
++ clickhouse-client --query 'SELECT count() FROM system.build_options WHERE name = '\''CXX_FLAGS'\'' AND position('\''sanitize=address'\'' IN value)'
++ false
++ return
+ IS_ASAN=0
+ [[ 0 = \1 ]]
++ kill -l SIGRTMIN
+ RTMIN=34
+ echo '
set follow-fork-mode parent
handle SIGHUP nostop noprint pass
handle SIGINT nostop noprint pass
handle SIGQUIT nostop noprint pass
handle SIGPIPE nostop noprint pass
handle SIGTERM nostop noprint pass
handle SIGUSR1 nostop noprint pass
handle SIGUSR2 nostop noprint pass
handle SIG34 nostop noprint pass
info signals
continue
backtrace full
info registers
p top' 1 KiB of the 'stack:
p/x *(uint64_t[128]*)$sp
maintenance info sections
thread apply all backtrace full
disassemble /s
up
disassemble /s
up
disassemble /s
p "done"
detach
quit
'
+ sleep 5
+ ts '%Y-%m-%d %H:%M:%S'
++ cat /var/run/clickhouse-server/clickhouse-server.pid
+ gdb -batch -command script.gdb -p 75697
+ run_with_retry 60 clickhouse-client --query 'SELECT '\''Connected to clickhouse-server after attaching gdb'\'''
+ [[ hxB =~ e ]]
+ set_e=false
+ set +e
+ local total_retries=60
+ shift
+ local retry=0
+ '[' 0 -ge 60 ']'
+ clickhouse-client --query 'SELECT '\''Connected to clickhouse-server after attaching gdb'\'''
Connected to clickhouse-server after attaching gdb
+ false
+ return
+ check_server_start
+ clickhouse-client --query 'SELECT '\''Server successfully started'\'', '\''OK'\'', NULL, '\'''\'''
+ '[' -s /test_output/application_errors.txt ']'
+ rm /test_output/application_errors.txt
rm: cannot remove '/test_output/application_errors.txt': No such file or directory
+ stop_server
+ local max_tries=90
+ local check_hang=true
+ local pid
++ cat /var/run/clickhouse-server/clickhouse-server.pid
+ pid=75697
+ clickhouse stop --max-tries 90 --do-not-kill
script.gdb:13: Error in sourced command file:
No stack.
/var/run/clickhouse-server/clickhouse-server.pid file exists and contains pid = 75697.
The process with pid = 75697 is running.
Sent terminate signal to process with pid 75697.
Waiting for server to stop
/var/run/clickhouse-server/clickhouse-server.pid file exists and contains pid = 75697.
The process with pid = 75697 is running.
Waiting for server to stop
/var/run/clickhouse-server/clickhouse-server.pid file exists and contains pid = 75697.
The process with pid = 75697 is running.
Waiting for server to stop
/var/run/clickhouse-server/clickhouse-server.pid file exists and contains pid = 75697.
The process with pid = 75697 is running.
Waiting for server to stop
/var/run/clickhouse-server/clickhouse-server.pid file exists and contains pid = 75697.
The process with pid = 75697 is running.
Waiting for server to stop
Now there is no clickhouse-server process.
Server stopped
+ return
+ '[' -f /var/log/clickhouse-server/clickhouse-server.log ']'
+ '[' -f /var/log/clickhouse-server/stderr.log ']'
+ mv /var/log/clickhouse-server/clickhouse-server.log /var/log/clickhouse-server/clickhouse-server.final.log
+ check_logs_for_critical_errors
+ sed -n '/WARNING:.*anitizer/,/^$/p' /var/log/clickhouse-server/stderr.log
+ rg -Fav -e 'ASan doesn'\''t fully support makecontext/swapcontext functions' -e DB::Exception /test_output/tmp
+ echo -e 'No sanitizer asserts\tOK\t\N\t'
+ rm -f /test_output/tmp
+ rg -Fa ' Application: Child process was terminated by signal 9' /var/log/clickhouse-server/clickhouse-server.err.log /var/log/clickhouse-server/clickhouse-server.final.log /var/log/clickhouse-server/clickhouse-server.initial.log /var/log/clickhouse-server/clickhouse-server.stress.log
+ echo -e 'No OOM messages in clickhouse-server.log\tOK\t\N\t'
+ rg -Fa 'Code: 49. DB::Exception: ' /var/log/clickhouse-server/clickhouse-server.err.log /var/log/clickhouse-server/clickhouse-server.final.log /var/log/clickhouse-server/clickhouse-server.initial.log /var/log/clickhouse-server/clickhouse-server.stress.log
+ echo -e 'No logical errors\tOK\t\N\t'
+ '[' -s /test_output/logical_errors.txt ']'
+ rm /test_output/logical_errors.txt
+ rg --text 'Code: 499.*The specified key does not exist' /var/log/clickhouse-server/clickhouse-server.err.log /var/log/clickhouse-server/clickhouse-server.final.log /var/log/clickhouse-server/clickhouse-server.initial.log /var/log/clickhouse-server/clickhouse-server.stress.log
+ grep -v a.myext
+ echo -e 'No lost s3 keys\tOK\t\N\t'
+ rg -Fa 'it is lost forever' /var/log/clickhouse-server/clickhouse-server.err.log /var/log/clickhouse-server/clickhouse-server.final.log /var/log/clickhouse-server/clickhouse-server.initial.log /var/log/clickhouse-server/clickhouse-server.stress.log
+ grep SharedMergeTreePartCheckThread
+ echo -e 'No SharedMergeTree lost forever in clickhouse-server.log\tOK\t\N\t'
+ '[' -s /test_output/no_such_key_errors.txt ']'
+ rm /test_output/no_such_key_errors.txt
+ rg -Fa '########################################' /var/log/clickhouse-server/clickhouse-server.err.log /var/log/clickhouse-server/clickhouse-server.final.log /var/log/clickhouse-server/clickhouse-server.initial.log /var/log/clickhouse-server/clickhouse-server.stress.log
+ echo -e 'Not crashed\tOK\t\N\t'
+ rg -Fa ' ' /var/log/clickhouse-server/clickhouse-server.err.log /var/log/clickhouse-server/clickhouse-server.final.log /var/log/clickhouse-server/clickhouse-server.initial.log /var/log/clickhouse-server/clickhouse-server.stress.log
+ echo -e 'No fatal messages in clickhouse-server.log\tOK\t\N\t'
+ '[' -s /test_output/fatal_messages.txt ']'
+ rm /test_output/fatal_messages.txt
+ rg -Faz '########################################' /test_output/gdb.log /test_output/stress_run_logs.tar.zst /test_output/test_results.tsv
+ rg -v 'rg -Fa'
+ rg -Fa ' received signal ' /test_output/gdb.log
+ dmesg -T
+ grep -q -F -e 'Out of memory: Killed process' -e 'oom_reaper: reaped process' -e oom-kill:constraint=CONSTRAINT_NONE /test_output/dmesg.log
+ echo -e 'No OOM in dmesg\tOK\t\N\t'
+ tar -chf /test_output/coordination.tar /var/lib/clickhouse/coordination
tar: Removing leading `/' from member names
tar: Removing leading `/' from hard link targets
+ collect_query_and_trace_logs
+ for table in query_log trace_log metric_log
+ clickhouse-local --config-file=/etc/clickhouse-server/config.xml --only-system-tables -q 'select * from system.query_log format TSVWithNamesAndTypes'
+ zstd --threads=0
Logging trace to /var/log/clickhouse-server/clickhouse-server.log
Logging errors to /var/log/clickhouse-server/clickhouse-server.err.log
127.0.0.1 - - [30/Oct/2026:17:20:00 +0000] "GET /devstoreaccount1/cont?restype=container HTTP/1.1" 200 -
+ for table in query_log trace_log metric_log
+ clickhouse-local --config-file=/etc/clickhouse-server/config.xml --only-system-tables -q 'select * from system.trace_log format TSVWithNamesAndTypes'
+ zstd --threads=0
Logging trace to /var/log/clickhouse-server/clickhouse-server.log
Logging errors to /var/log/clickhouse-server/clickhouse-server.err.log
127.0.0.1 - - [30/Oct/2026:17:20:01 +0000] "GET /devstoreaccount1/cont?restype=container HTTP/1.1" 200 -
+ for table in query_log trace_log metric_log
+ clickhouse-local --config-file=/etc/clickhouse-server/config.xml --only-system-tables -q 'select * from system.metric_log format TSVWithNamesAndTypes'
+ zstd --threads=0
Logging trace to /var/log/clickhouse-server/clickhouse-server.log
Logging errors to /var/log/clickhouse-server/clickhouse-server.err.log
127.0.0.1 - - [30/Oct/2026:17:20:03 +0000] "GET /devstoreaccount1/cont?restype=container HTTP/1.1" 200 -
+ mv /var/log/clickhouse-server/stderr.log /test_output/
+ clickhouse-local --structure 'test String, res String, time Nullable(Float32), desc String' -q 'SELECT '\''failure'\'', test FROM table WHERE res != '\''OK'\'' order by
(test like '\''%Sanitizer%'\'') DESC,
(test like '\''%Killed by signal%'\'') DESC,
(test like '\''%gdb.log%'\'') DESC,
(test ilike '\''%possible deadlock%'\'') DESC,
(test like '\''%start%'\'') DESC,
(test like '\''%dmesg%'\'') DESC,
(test like '\''%OOM%'\'') DESC,
(test like '\''%Signal 9%'\'') DESC,
(test like '\''%Fatal message%'\'') DESC,
rowNumberInAllBlocks()
LIMIT 1'
+ '[' -s /test_output/check_status.tsv ']'
+ echo -e 'success\tNo errors found'
+ rg 'OOM in dmesg|Signal 9' /test_output/check_status.tsv
+ collect_core_dumps
+ find . -type f -maxdepth 1 -name 'core.*'
+ read -r core