+ dmesg --clear
+ source /setup_export_logs.sh
++ CLICKHOUSE_CI_LOGS_CREDENTIALS=/tmp/export-logs-config.sh
++ CLICKHOUSE_CI_LOGS_USER=ci
++ CLICKHOUSE_CI_LOGS_CLUSTER=system_logs_export
++ EXTRA_COLUMNS='pull_request_number UInt32, commit_sha String, check_start_time DateTime('\''UTC'\''), check_name LowCardinality(String), instance_type LowCardinality(String), instance_id String, INDEX ix_pr (pull_request_number) TYPE set(100), INDEX ix_commit (commit_sha) TYPE set(100), INDEX ix_check_time (check_start_time) TYPE minmax, '
++ EXTRA_COLUMNS_EXPRESSION='CAST(0 AS UInt32) AS pull_request_number, '\'''\'' AS commit_sha, now() AS check_start_time, toLowCardinality('\'''\'') AS check_name, toLowCardinality('\'''\'') AS instance_type, '\'''\'' AS instance_id'
++ EXTRA_ORDER_BY_COLUMNS=check_name
++ EXTRA_COLUMNS_COVERAGE_LOG='pull_request_number UInt32, commit_sha String, check_start_time DateTime('\''UTC'\''), check_name LowCardinality(String), instance_type LowCardinality(String), instance_id String, INDEX ix_pr (pull_request_number) TYPE set(100), INDEX ix_commit (commit_sha) TYPE set(100), INDEX ix_check_time (check_start_time) TYPE minmax, symbols Array(LowCardinality(String)), '
++ EXTRA_COLUMNS_EXPRESSION_COVERAGE_LOG='CAST(0 AS UInt32) AS pull_request_number, '\'''\'' AS commit_sha, now() AS check_start_time, toLowCardinality('\'''\'') AS check_name, toLowCardinality('\'''\'') AS instance_type, '\'''\'' AS instance_id, arrayDistinct(arrayMap(x -> demangle(addressToSymbol(x)), coverage))::Array(LowCardinality(String)) AS symbols'
+ ln -s /repo/tests/clickhouse-test /usr/bin/clickhouse-test
+ source /repo/tests/docker_scripts/attach_gdb.lib
++ source /repo/tests/docker_scripts/utils.lib
+++ sysctl kernel.core_pattern=core.%e.%p-%P
kernel.core_pattern = core.%e.%p-%P
+++ sysctl fs.suid_dumpable=1
fs.suid_dumpable = 1
++ source /basic_helpers.sh
+ source /repo/tests/docker_scripts/stress_tests.lib
++ OK='\tOK\t\N\t'
++ FAIL='\tFAIL\t\N\t'
++ FAILURE_CONTEXT_LINES=100
++ FAILURE_CONTEXT_MAX_LINE_WIDTH=3000
++ source /basic_helpers.sh
+ source /repo/tests/docker_scripts/utils.lib
++ sysctl kernel.core_pattern=core.%e.%p-%P
kernel.core_pattern = core.%e.%p-%P
++ sysctl fs.suid_dumpable=1
fs.suid_dumpable = 1
+ install_packages package_folder
+ run_with_retry 3 dpkg -i package_folder/clickhouse-common-static_25.3.14.10001.altinitystable+msan_amd64.deb
+ local retries=3
+ shift
+ local retry=0
+ '[' 0 -ge 3 ']'
+ dpkg -i package_folder/clickhouse-common-static_25.3.14.10001.altinitystable+msan_amd64.deb
Selecting previously unselected package clickhouse-common-static.
(Reading database ... 48718 files and directories currently installed.)
Preparing to unpack .../clickhouse-common-static_25.3.14.10001.altinitystable+msan_amd64.deb ...
Unpacking clickhouse-common-static (25.3.14.10001.altinitystable+msan) ...
Setting up clickhouse-common-static (25.3.14.10001.altinitystable+msan) ...
+ return
+ run_with_retry 3 dpkg -i package_folder/clickhouse-common-static-dbg_25.3.14.10001.altinitystable+msan_amd64.deb
+ local retries=3
+ shift
+ local retry=0
+ '[' 0 -ge 3 ']'
+ dpkg -i package_folder/clickhouse-common-static-dbg_25.3.14.10001.altinitystable+msan_amd64.deb
Selecting previously unselected package clickhouse-common-static-dbg.
(Reading database ... 48745 files and directories currently installed.)
Preparing to unpack .../clickhouse-common-static-dbg_25.3.14.10001.altinitystable+msan_amd64.deb ...
Unpacking clickhouse-common-static-dbg (25.3.14.10001.altinitystable+msan) ...
Setting up clickhouse-common-static-dbg (25.3.14.10001.altinitystable+msan) ...
+ return
+ run_with_retry 3 dpkg -i package_folder/clickhouse-server_25.3.14.10001.altinitystable+msan_amd64.deb
+ local retries=3
+ shift
+ local retry=0
+ '[' 0 -ge 3 ']'
+ dpkg -i package_folder/clickhouse-server_25.3.14.10001.altinitystable+msan_amd64.deb
Selecting previously unselected package clickhouse-server.
(Reading database ... 48752 files and directories currently installed.)
Preparing to unpack .../clickhouse-server_25.3.14.10001.altinitystable+msan_amd64.deb ...
Unpacking clickhouse-server (25.3.14.10001.altinitystable+msan) ...
Setting up clickhouse-server (25.3.14.10001.altinitystable+msan) ...
ClickHouse binary is already located at /usr/bin/clickhouse
Symlink /usr/bin/clickhouse-server already exists but it points to /clickhouse. Will replace the old symlink to /usr/bin/clickhouse.
Creating symlink /usr/bin/clickhouse-server to /usr/bin/clickhouse.
Creating symlink /usr/bin/clickhouse-client to /usr/bin/clickhouse.
Creating symlink /usr/bin/clickhouse-local to /usr/bin/clickhouse.
Creating symlink /usr/bin/clickhouse-benchmark to /usr/bin/clickhouse.
Creating symlink /usr/bin/clickhouse-obfuscator to /usr/bin/clickhouse.
Creating symlink /usr/bin/clickhouse-git-import to /usr/bin/clickhouse.
Creating symlink /usr/bin/clickhouse-compressor to /usr/bin/clickhouse.
Creating symlink /usr/bin/clickhouse-format to /usr/bin/clickhouse.
Symlink /usr/bin/clickhouse-extract-from-config already exists but it points to /clickhouse. Will replace the old symlink to /usr/bin/clickhouse.
Creating symlink /usr/bin/clickhouse-extract-from-config to /usr/bin/clickhouse.
Symlink /usr/bin/clickhouse-keeper already exists but it points to /clickhouse. Will replace the old symlink to /usr/bin/clickhouse.
Creating symlink /usr/bin/clickhouse-keeper to /usr/bin/clickhouse.
Symlink /usr/bin/clickhouse-keeper-converter already exists but it points to /clickhouse. Will replace the old symlink to /usr/bin/clickhouse.
Creating symlink /usr/bin/clickhouse-keeper-converter to /usr/bin/clickhouse.
Creating symlink /usr/bin/clickhouse-disks to /usr/bin/clickhouse.
Creating symlink /usr/bin/ch to /usr/bin/clickhouse.
Creating symlink /usr/bin/chl to /usr/bin/clickhouse.
Creating symlink /usr/bin/chc to /usr/bin/clickhouse.
Creating clickhouse group if it does not exist.
groupadd -r clickhouse
Creating clickhouse user if it does not exist.
useradd -r --shell /bin/false --home-dir /nonexistent -g clickhouse clickhouse
Will set ulimits for clickhouse user in /etc/security/limits.d/clickhouse.conf.
Creating config directory /etc/clickhouse-server/config.d that is used for tweaks of main server configuration.
Creating config directory /etc/clickhouse-server/users.d that is used for tweaks of users configuration.
Config file /etc/clickhouse-server/config.xml already exists, will keep it and extract path info from it.
/etc/clickhouse-server/config.xml has /var/lib/clickhouse/ as data path.
/etc/clickhouse-server/config.xml has /var/log/clickhouse-server/ as log path.
Users config file /etc/clickhouse-server/users.xml already exists, will keep it and extract users info from it.
Log directory /var/log/clickhouse-server/ already exists.
Creating data directory /var/lib/clickhouse/.
Creating pid directory /var/run/clickhouse-server.
chown -R clickhouse:clickhouse '/var/log/clickhouse-server/'
chown -R clickhouse:clickhouse '/var/run/clickhouse-server'
chown clickhouse:clickhouse '/var/lib/clickhouse/'
groupadd -r clickhouse-bridge
useradd -r --shell /bin/false --home-dir /nonexistent -g clickhouse-bridge clickhouse-bridge
chown -R clickhouse-bridge:clickhouse-bridge '/usr/bin/clickhouse-odbc-bridge'
chown -R clickhouse-bridge:clickhouse-bridge '/usr/bin/clickhouse-library-bridge'
Password for the default user is an empty string. See /etc/clickhouse-server/users.xml and /etc/clickhouse-server/users.d to change it.
Setting capabilities for clickhouse binary. This is optional.
chown -R clickhouse:clickhouse '/etc/clickhouse-server'
ClickHouse has been successfully installed.
Start clickhouse-server with:
sudo clickhouse start
Start clickhouse-client with:
clickhouse-client
+ return
+ run_with_retry 3 dpkg -i package_folder/clickhouse-client_25.3.14.10001.altinitystable+msan_amd64.deb
+ local retries=3
+ shift
+ local retry=0
+ '[' 0 -ge 3 ']'
+ dpkg -i package_folder/clickhouse-client_25.3.14.10001.altinitystable+msan_amd64.deb
Selecting previously unselected package clickhouse-client.
(Reading database ... 48769 files and directories currently installed.)
Preparing to unpack .../clickhouse-client_25.3.14.10001.altinitystable+msan_amd64.deb ...
Unpacking clickhouse-client (25.3.14.10001.altinitystable+msan) ...
Setting up clickhouse-client (25.3.14.10001.altinitystable+msan) ...
+ return
+ export THREAD_FUZZER_CPU_TIME_PERIOD_US=1000
+ THREAD_FUZZER_CPU_TIME_PERIOD_US=1000
+ export THREAD_FUZZER_SLEEP_PROBABILITY=0.1
+ THREAD_FUZZER_SLEEP_PROBABILITY=0.1
+ export THREAD_FUZZER_SLEEP_TIME_US_MAX=100000
+ THREAD_FUZZER_SLEEP_TIME_US_MAX=100000
+ export THREAD_FUZZER_pthread_mutex_lock_BEFORE_MIGRATE_PROBABILITY=1
+ THREAD_FUZZER_pthread_mutex_lock_BEFORE_MIGRATE_PROBABILITY=1
+ export THREAD_FUZZER_pthread_mutex_lock_AFTER_MIGRATE_PROBABILITY=1
+ THREAD_FUZZER_pthread_mutex_lock_AFTER_MIGRATE_PROBABILITY=1
+ export THREAD_FUZZER_pthread_mutex_unlock_BEFORE_MIGRATE_PROBABILITY=1
+ THREAD_FUZZER_pthread_mutex_unlock_BEFORE_MIGRATE_PROBABILITY=1
+ export THREAD_FUZZER_pthread_mutex_unlock_AFTER_MIGRATE_PROBABILITY=1
+ THREAD_FUZZER_pthread_mutex_unlock_AFTER_MIGRATE_PROBABILITY=1
+ export THREAD_FUZZER_pthread_mutex_lock_BEFORE_SLEEP_PROBABILITY=0.001
+ THREAD_FUZZER_pthread_mutex_lock_BEFORE_SLEEP_PROBABILITY=0.001
+ export THREAD_FUZZER_pthread_mutex_lock_AFTER_SLEEP_PROBABILITY=0.001
+ THREAD_FUZZER_pthread_mutex_lock_AFTER_SLEEP_PROBABILITY=0.001
+ export THREAD_FUZZER_pthread_mutex_unlock_BEFORE_SLEEP_PROBABILITY=0.001
+ THREAD_FUZZER_pthread_mutex_unlock_BEFORE_SLEEP_PROBABILITY=0.001
+ export THREAD_FUZZER_pthread_mutex_unlock_AFTER_SLEEP_PROBABILITY=0.001
+ THREAD_FUZZER_pthread_mutex_unlock_AFTER_SLEEP_PROBABILITY=0.001
+ export THREAD_FUZZER_pthread_mutex_lock_BEFORE_SLEEP_TIME_US_MAX=10000
+ THREAD_FUZZER_pthread_mutex_lock_BEFORE_SLEEP_TIME_US_MAX=10000
+ export THREAD_FUZZER_pthread_mutex_lock_AFTER_SLEEP_TIME_US_MAX=10000
+ THREAD_FUZZER_pthread_mutex_lock_AFTER_SLEEP_TIME_US_MAX=10000
+ export THREAD_FUZZER_pthread_mutex_unlock_BEFORE_SLEEP_TIME_US_MAX=10000
+ THREAD_FUZZER_pthread_mutex_unlock_BEFORE_SLEEP_TIME_US_MAX=10000
+ export THREAD_FUZZER_pthread_mutex_unlock_AFTER_SLEEP_TIME_US_MAX=10000
+ THREAD_FUZZER_pthread_mutex_unlock_AFTER_SLEEP_TIME_US_MAX=10000
+ export THREAD_FUZZER_EXPLICIT_SLEEP_PROBABILITY=0.01
+ THREAD_FUZZER_EXPLICIT_SLEEP_PROBABILITY=0.01
+ export THREAD_FUZZER_EXPLICIT_MEMORY_EXCEPTION_PROBABILITY=0.01
+ THREAD_FUZZER_EXPLICIT_MEMORY_EXCEPTION_PROBABILITY=0.01
+ export ZOOKEEPER_FAULT_INJECTION=1
+ ZOOKEEPER_FAULT_INJECTION=1
+ configure
+ export USE_DATABASE_ORDINARY=1
+ USE_DATABASE_ORDINARY=1
+ export EXPORT_S3_STORAGE_POLICIES=1
+ EXPORT_S3_STORAGE_POLICIES=1
+ /repo/tests/config/install.sh
+ DEST_SERVER_PATH=/etc/clickhouse-server
+ DEST_CLIENT_PATH=/etc/clickhouse-client
+++ dirname /repo/tests/config/install.sh
++ cd /repo/tests/config
++ pwd -P
+ SRC_PATH=/repo/tests/config
+ '[' 0 -ge 2 ']'
+ FAST_TEST=0
+ NO_AZURE=0
+ [[ 0 -gt 0 ]]
+ echo 'Going to install test configs from /repo/tests/config into /etc/clickhouse-server'
Going to install test configs from /repo/tests/config into /etc/clickhouse-server
+ mkdir -p /etc/clickhouse-server/config.d/
+ mkdir -p /etc/clickhouse-server/users.d/
+ mkdir -p /etc/clickhouse-client
+ ln -sf /repo/tests/config/config.d/tmp.xml /etc/clickhouse-server/config.d/
+ ln -sf /repo/tests/config/config.d/zookeeper_write.xml /etc/clickhouse-server/config.d/
+ ln -sf /repo/tests/config/config.d/max_num_to_warn.xml /etc/clickhouse-server/config.d/
+ ln -sf /repo/tests/config/config.d/listen.xml /etc/clickhouse-server/config.d/
+ ln -sf /repo/tests/config/config.d/text_log.xml /etc/clickhouse-server/config.d/
+ ln -sf /repo/tests/config/config.d/blob_storage_log.xml /etc/clickhouse-server/config.d/
+ ln -sf /repo/tests/config/config.d/custom_settings_prefixes.xml /etc/clickhouse-server/config.d/
+ ln -sf /repo/tests/config/config.d/database_catalog_drop_table_concurrency.xml /etc/clickhouse-server/config.d/
+ ln -sf /repo/tests/config/config.d/enable_access_control_improvements.xml /etc/clickhouse-server/config.d/
+ ln -sf /repo/tests/config/config.d/macros.xml /etc/clickhouse-server/config.d/
+ ln -sf /repo/tests/config/config.d/secure_ports.xml /etc/clickhouse-server/config.d/
+ ln -sf /repo/tests/config/config.d/clusters.xml /etc/clickhouse-server/config.d/
+ ln -sf /repo/tests/config/config.d/graphite.xml /etc/clickhouse-server/config.d/
+ ln -sf /repo/tests/config/config.d/graphite_alternative.xml /etc/clickhouse-server/config.d/
+ ln -sf /repo/tests/config/config.d/grpc_protocol.xml /etc/clickhouse-server/config.d/
+ ln -sf /repo/tests/config/config.d/database_atomic.xml /etc/clickhouse-server/config.d/
+ ln -sf /repo/tests/config/config.d/max_concurrent_queries.xml /etc/clickhouse-server/config.d/
+ ln -sf /repo/tests/config/config.d/merge_tree_settings.xml /etc/clickhouse-server/config.d/
+ ln -sf /repo/tests/config/config.d/backoff_failed_mutation.xml /etc/clickhouse-server/config.d/
+ ln -sf /repo/tests/config/config.d/merge_tree_old_dirs_cleanup.xml /etc/clickhouse-server/config.d/
+ ln -sf /repo/tests/config/config.d/test_cluster_with_incorrect_pw.xml /etc/clickhouse-server/config.d/
+ ln -sf /repo/tests/config/config.d/keeper_port.xml /etc/clickhouse-server/config.d/
+ ln -sf /repo/tests/config/config.d/logging_no_rotate.xml /etc/clickhouse-server/config.d/
+ ln -sf /repo/tests/config/config.d/merge_tree.xml /etc/clickhouse-server/config.d/
+ ln -sf /repo/tests/config/config.d/lost_forever_check.xml /etc/clickhouse-server/config.d/
+ ln -sf /repo/tests/config/config.d/tcp_with_proxy.xml /etc/clickhouse-server/config.d/
+ ln -sf /repo/tests/config/config.d/prometheus.xml /etc/clickhouse-server/config.d/
+ ln -sf /repo/tests/config/config.d/top_level_domains_lists.xml /etc/clickhouse-server/config.d/
+ ln -sf /repo/tests/config/config.d/top_level_domains_path.xml /etc/clickhouse-server/config.d/
+ ln -sf /repo/tests/config/config.d/transactions.xml /etc/clickhouse-server/config.d/
+ ln -sf /repo/tests/config/config.d/encryption.xml /etc/clickhouse-server/config.d/
+ ln -sf /repo/tests/config/config.d/zookeeper_log.xml /etc/clickhouse-server/config.d/
+ ln -sf /repo/tests/config/config.d/logger_trace.xml /etc/clickhouse-server/config.d/
+ ln -sf /repo/tests/config/config.d/named_collection.xml /etc/clickhouse-server/config.d/
+ ln -sf /repo/tests/config/config.d/ssl_certs.xml /etc/clickhouse-server/config.d/
+ ln -sf /repo/tests/config/config.d/filesystem_cache_log.xml /etc/clickhouse-server/config.d/
+ ln -sf /repo/tests/config/config.d/session_log.xml /etc/clickhouse-server/config.d/
+ ln -sf /repo/tests/config/config.d/system_unfreeze.xml /etc/clickhouse-server/config.d/
+ ln -sf /repo/tests/config/config.d/enable_zero_copy_replication.xml /etc/clickhouse-server/config.d/
+ ln -sf /repo/tests/config/config.d/nlp.xml /etc/clickhouse-server/config.d/
+ ln -sf /repo/tests/config/config.d/forbidden_headers.xml /etc/clickhouse-server/config.d/
+ ln -sf /repo/tests/config/config.d/enable_keeper_map.xml /etc/clickhouse-server/config.d/
+ ln -sf /repo/tests/config/config.d/custom_disks_base_path.xml /etc/clickhouse-server/config.d/
+ ln -sf /repo/tests/config/config.d/display_name.xml /etc/clickhouse-server/config.d/
+ ln -sf /repo/tests/config/config.d/compressed_marks_and_index.xml /etc/clickhouse-server/config.d/
+ ln -sf /repo/tests/config/config.d/disable_s3_env_credentials.xml /etc/clickhouse-server/config.d/
+ ln -sf /repo/tests/config/config.d/enable_wait_for_shutdown_replicated_tables.xml /etc/clickhouse-server/config.d/
+ ln -sf /repo/tests/config/config.d/backups.xml /etc/clickhouse-server/config.d/
+ ln -sf /repo/tests/config/config.d/filesystem_caches_path.xml /etc/clickhouse-server/config.d/
+ ln -sf /repo/tests/config/config.d/validate_tcp_client_information.xml /etc/clickhouse-server/config.d/
+ ln -sf /repo/tests/config/config.d/zero_copy_destructive_operations.xml /etc/clickhouse-server/config.d/
+ ln -sf /repo/tests/config/config.d/handlers.yaml /etc/clickhouse-server/config.d/
+ ln -sf /repo/tests/config/config.d/threadpool_writer_pool_size.yaml /etc/clickhouse-server/config.d/
+ ln -sf /repo/tests/config/config.d/serverwide_trace_collector.xml /etc/clickhouse-server/config.d/
+ ln -sf /repo/tests/config/config.d/rocksdb.xml /etc/clickhouse-server/config.d/
+ '[' 0 '!=' 1 ']'
+ ln -sf /repo/tests/config/config.d/legacy_geobase.xml /etc/clickhouse-server/config.d/
+ ln -sf /repo/tests/config/users.d/log_queries.xml /etc/clickhouse-server/users.d/
+ ln -sf /repo/tests/config/users.d/readonly.xml /etc/clickhouse-server/users.d/
+ ln -sf /repo/tests/config/users.d/ci_logs_sender.yaml /etc/clickhouse-server/users.d/
+ ln -sf /repo/tests/config/users.d/access_management.xml /etc/clickhouse-server/users.d/
+ ln -sf /repo/tests/config/users.d/database_atomic_drop_detach_sync.xml /etc/clickhouse-server/users.d/
+ ln -sf /repo/tests/config/users.d/opentelemetry.xml /etc/clickhouse-server/users.d/
+ ln -sf /repo/tests/config/users.d/remote_queries.xml /etc/clickhouse-server/users.d/
+ ln -sf /repo/tests/config/users.d/session_log_test.xml /etc/clickhouse-server/users.d/
+ ln -sf /repo/tests/config/users.d/memory_profiler.xml /etc/clickhouse-server/users.d/
+ ln -sf /repo/tests/config/users.d/no_fsync_metadata.xml /etc/clickhouse-server/users.d/
+ ln -sf /repo/tests/config/users.d/filelog.xml /etc/clickhouse-server/users.d/
+ ln -sf /repo/tests/config/users.d/enable_blobs_check.xml /etc/clickhouse-server/users.d/
+ ln -sf /repo/tests/config/users.d/marks.xml /etc/clickhouse-server/users.d/
+ ln -sf /repo/tests/config/users.d/insert_keeper_retries.xml /etc/clickhouse-server/users.d/
+ ln -sf /repo/tests/config/users.d/prefetch_settings.xml /etc/clickhouse-server/users.d/
+ ln -sf /repo/tests/config/users.d/nonconst_timezone.xml /etc/clickhouse-server/users.d/
+ ln -sf /repo/tests/config/users.d/allow_introspection_functions.yaml /etc/clickhouse-server/users.d/
+ ln -sf /repo/tests/config/users.d/replicated_ddl_entry.xml /etc/clickhouse-server/users.d/
+ ln -sf /repo/tests/config/users.d/limits.yaml /etc/clickhouse-server/users.d/
+ [[ -n '' ]]
+ ln -sf /repo/tests/config/users.d/timeouts.xml /etc/clickhouse-server/users.d/
+ ln -sf /repo/tests/config/ints_dictionary.xml /etc/clickhouse-server/
+ ln -sf /repo/tests/config/strings_dictionary.xml /etc/clickhouse-server/
+ ln -sf /repo/tests/config/decimals_dictionary.xml /etc/clickhouse-server/
+ ln -sf /repo/tests/config/executable_dictionary.xml /etc/clickhouse-server/
+ ln -sf /repo/tests/config/executable_pool_dictionary.xml /etc/clickhouse-server/
+ ln -sf /repo/tests/config/test_function.xml /etc/clickhouse-server/
+ ln -sf /repo/tests/config/top_level_domains /etc/clickhouse-server/
+ ln -sf /repo/tests/config/regions_hierarchy.txt /etc/clickhouse-server/config.d/
+ ln -sf /repo/tests/config/regions_names_en.txt /etc/clickhouse-server/config.d/
+ ln -sf /repo/tests/config/regions_names_es.txt /etc/clickhouse-server/config.d/
+ ln -sf /repo/tests/config/ext-en.txt /etc/clickhouse-server/config.d/
+ ln -sf /repo/tests/config/ext-ru.txt /etc/clickhouse-server/config.d/
+ ln -sf /repo/tests/config/lem-en.bin /etc/clickhouse-server/config.d/
+ ln -sf /repo/tests/config/server.key /etc/clickhouse-server/
+ ln -sf /repo/tests/config/server.crt /etc/clickhouse-server/
+ ln -sf /repo/tests/config/dhparam.pem /etc/clickhouse-server/
+ ln -sf --backup=simple --suffix=_original.xml /repo/tests/config/config.d/query_masking_rules.xml /etc/clickhouse-server/config.d/
+ [[ -n 1 ]]
+ [[ 1 -eq 1 ]]
+ rm -f /etc/clickhouse-server/config.d/zookeeper.xml
+ ln -sf /repo/tests/config/config.d/zookeeper_fault_injection.xml /etc/clickhouse-server/config.d/
+ [[ -n '' ]]
+ rm -f /etc/clickhouse-server/config.d/cannot_allocate_thread_injection.xml
+ value=0
+ sed --follow-symlinks -i 's|[01]|0|' /etc/clickhouse-server/config.d/keeper_port.xml
+ value=39817216
+ sed --follow-symlinks -i 's|[[:digit:]]\+|39817216|' /etc/clickhouse-server/config.d/keeper_port.xml
+ value=34691072
+ sed --follow-symlinks -i 's|[[:digit:]]\+|34691072|' /etc/clickhouse-server/config.d/keeper_port.xml
+ value=0
+ sed --follow-symlinks -i 's|[01]|0|' /etc/clickhouse-server/config.d/keeper_port.xml
+ [[ -n '' ]]
+ [[ -n 1 ]]
+ [[ 1 -eq 1 ]]
+ ln -sf /repo/tests/config/users.d/database_ordinary.xml /etc/clickhouse-server/users.d/
+ [[ '' == \1 ]]
+ [[ '' == \1 ]]
+ [[ 1 == \1 ]]
+ [[ 0 != \1 ]]
+ ln -sf /repo/tests/config/config.d/azure_storage_conf.xml /etc/clickhouse-server/config.d/
+ ln -sf /repo/tests/config/config.d/storage_conf.xml /etc/clickhouse-server/config.d/
+ ln -sf /repo/tests/config/config.d/storage_conf_02944.xml /etc/clickhouse-server/config.d/
+ ln -sf /repo/tests/config/config.d/storage_conf_02963.xml /etc/clickhouse-server/config.d/
+ ln -sf /repo/tests/config/config.d/storage_conf_02961.xml /etc/clickhouse-server/config.d/
+ ln -sf /repo/tests/config/users.d/s3_cache.xml /etc/clickhouse-server/users.d/
+ ln -sf /repo/tests/config/users.d/s3_cache_new.xml /etc/clickhouse-server/users.d/
+ [[ '' == \1 ]]
+ [[ '' == \1 ]]
+ ln -sf /repo/tests/config/client_config.xml /etc/clickhouse-client/config.xml
+ sudo cat /etc/clickhouse-server/config.d/keeper_port.xml
+ sed 's|100000|10000|'
+ sudo mv /etc/clickhouse-server/config.d/keeper_port.xml.tmp /etc/clickhouse-server/config.d/keeper_port.xml
+ [[ -n 1 ]]
+ [[ 1 -eq 1 ]]
+ randomize_config_boolean_value filtered_list keeper_port
+ value=1
+ sudo cat /etc/clickhouse-server/config.d/keeper_port.xml
+ sed 's|[01]|1|'
+ sudo mv /etc/clickhouse-server/config.d/keeper_port.xml.tmp /etc/clickhouse-server/config.d/keeper_port.xml
+ randomize_config_boolean_value multi_read keeper_port
+ value=0
+ sudo cat /etc/clickhouse-server/config.d/keeper_port.xml
+ sed 's|[01]|0|'
+ sudo mv /etc/clickhouse-server/config.d/keeper_port.xml.tmp /etc/clickhouse-server/config.d/keeper_port.xml
+ randomize_config_boolean_value check_not_exists keeper_port
+ value=0
+ sudo cat /etc/clickhouse-server/config.d/keeper_port.xml
+ sed 's|[01]|0|'
+ sudo mv /etc/clickhouse-server/config.d/keeper_port.xml.tmp /etc/clickhouse-server/config.d/keeper_port.xml
+ randomize_config_boolean_value create_if_not_exists keeper_port
+ value=1
+ sudo cat /etc/clickhouse-server/config.d/keeper_port.xml
+ sed 's|[01]|1|'
+ sudo mv /etc/clickhouse-server/config.d/keeper_port.xml.tmp /etc/clickhouse-server/config.d/keeper_port.xml
+ randomize_config_boolean_value remove_recursive keeper_port
+ value=1
+ sudo cat /etc/clickhouse-server/config.d/keeper_port.xml
+ sed 's|[01]|1|'
+ sudo mv /etc/clickhouse-server/config.d/keeper_port.xml.tmp /etc/clickhouse-server/config.d/keeper_port.xml
+ sudo chown clickhouse /etc/clickhouse-server/config.d/keeper_port.xml
+ sudo chgrp clickhouse /etc/clickhouse-server/config.d/keeper_port.xml
+ [[ -n 1 ]]
+ [[ 1 -eq 1 ]]
+ randomize_config_boolean_value use_compression zookeeper_fault_injection
+ value=0
+ sudo cat /etc/clickhouse-server/config.d/zookeeper_fault_injection.xml
+ sed 's|[01]|0|'
+ sudo mv /etc/clickhouse-server/config.d/zookeeper_fault_injection.xml.tmp /etc/clickhouse-server/config.d/zookeeper_fault_injection.xml
+ randomize_config_boolean_value use_xid_64 zookeeper_fault_injection
+ value=1
+ sudo cat /etc/clickhouse-server/config.d/zookeeper_fault_injection.xml
+ sed 's|[01]|1|'
+ sudo mv /etc/clickhouse-server/config.d/zookeeper_fault_injection.xml.tmp /etc/clickhouse-server/config.d/zookeeper_fault_injection.xml
+ echo 'ASAN_OPTIONS='\''malloc_context_size=10 verbosity=1 allocator_release_to_os_interval_ms=10000'\'''
+ export 'ASAN_OPTIONS=malloc_context_size=10 allocator_release_to_os_interval_ms=10000'
+ ASAN_OPTIONS='malloc_context_size=10 allocator_release_to_os_interval_ms=10000'
+ sudo chown root: /var/lib/clickhouse
+ local total_mem
++ awk '/MemTotal/ { print $(NF-1) }' /proc/meminfo
+ total_mem=32086440
+ total_mem=32856514560
+ max_server_memory_usage_to_ram_ratio=0.5
Setting max_server_memory_usage_to_ram_ratio to 0.5
+ echo 'Setting max_server_memory_usage_to_ram_ratio to 0.5'
+ cat
Setting max_memory_usage_for_user=9856954368 and max_memory_usage for queries to 10G
+ local max_users_mem
+ max_users_mem=9856954368
+ echo 'Setting max_memory_usage_for_user=9856954368 and max_memory_usage for queries to 10G'
+ cat
+ cat
+ /repo/tests/docker_scripts/setup_minio.sh stateless
+ export MINIO_ROOT_USER=clickhouse
+ MINIO_ROOT_USER=clickhouse
+ export MINIO_ROOT_PASSWORD=clickhouse
+ MINIO_ROOT_PASSWORD=clickhouse
+ main stateless
+ local query_dir
++ check_arg stateless
++ local query_dir
++ '[' '!' 1 -eq 1 ']'
++ case "$1" in
++ query_dir=0_stateless
++ echo 0_stateless
+ query_dir=0_stateless
+ '[' '!' -f ./minio ']'
+ start_minio
+ mkdir -p ./minio_data
+ ./minio --version
minio version RELEASE.2024-08-03T04-33-23Z (commit-id=6efb56851c40da88d1ca15112e2d686a4ecec6b3)
Runtime: go1.22.5 linux/amd64
License: GNU AGPLv3 - https://www.gnu.org/licenses/agpl-3.0.html
Copyright: 2015-2024 MinIO, Inc.
+ wait_for_it
+ local counter=0
+ local max_counter=60
+ ./minio server --address :11111 ./minio_data
+ local url=http://localhost:11111
+ params=('--silent' '--verbose')
+ local params
+ curl --silent --verbose http://localhost:11111
+ grep AccessDenied
+ [[ 0 == \6\0 ]]
+ echo 'trying to connect to minio'
+ sleep 1
trying to connect to minio
INFO: Formatting 1st pool, 1 set(s), 1 drives per set.
INFO: WARNING: Host local has more than 0 drives of set. A host failure will result in data becoming unavailable.
MinIO Object Storage Server
Copyright: 2015-2026 MinIO, Inc.
License: GNU AGPLv3 - https://www.gnu.org/licenses/agpl-3.0.html
Version: RELEASE.2024-08-03T04-33-23Z (go1.22.5 linux/amd64)
API: http://172.17.0.2:11111 http://127.0.0.1:11111
WebUI: http://172.17.0.2:45463 http://127.0.0.1:45463
Docs: https://min.io/docs/minio/linux/index.html
+ counter=1
+ curl --silent --verbose http://localhost:11111
+ grep AccessDenied
AccessDeniedAccess Denied./18D72AF7445507507dc7eb22d3288ec80374614e9088e31d3668a6922ead55932dd2a8e56373820f
+ lsof -i :11111
COMMAND PID USER FD TYPE DEVICE SIZE/OFF NODE NAME
minio 289 root 8u IPv4 28481 0t0 TCP localhost:11111 (LISTEN)
minio 289 root 9u IPv6 28482 0t0 TCP *:11111 (LISTEN)
minio 289 root 10u IPv6 28483 0t0 TCP localhost:11111 (LISTEN)
+ sleep 5
+ setup_minio stateless
+ local test_type=stateless
+ ./mc alias set clickminio http://localhost:11111 clickhouse clickhouse
Added `clickminio` successfully.
+ ./mc admin user add clickminio test testtest
Added user `test` successfully.
+ ./mc admin policy attach clickminio readwrite --user=test
Attached Policies: [readwrite]
To User: test
+ ./mc mb --ignore-existing clickminio/test
Bucket created successfully `clickminio/test`.
+ '[' stateless = stateless ']'
+ ./mc anonymous set public clickminio/test
Access permission for `clickminio/test` is set to `public`
+ upload_data 0_stateless /repo/tests/
+ local query_dir=0_stateless
+ local test_path=/repo/tests/
+ local data_path=/repo/tests//queries/0_stateless/data_minio
+ '[' -d /repo/tests//queries/0_stateless/data_minio ']'
+ ./mc cp --recursive /repo/tests//queries/0_stateless/data_minio/ clickminio/test/
`/repo/tests/queries/0_stateless/data_minio/02731.parquet` -> `clickminio/test/02731.parquet`
`/repo/tests/queries/0_stateless/data_minio/02366_data.jsonl` -> `clickminio/test/02366_data.jsonl`
`/repo/tests/queries/0_stateless/data_minio/02876.parquet` -> `clickminio/test/02876.parquet`
`/repo/tests/queries/0_stateless/data_minio/02731.arrow` -> `clickminio/test/02731.arrow`
`/repo/tests/queries/0_stateless/data_minio/03036_archive1.tar` -> `clickminio/test/03036_archive1.tar`
`/repo/tests/queries/0_stateless/data_minio/03036_archive1.zip` -> `clickminio/test/03036_archive1.zip`
`/repo/tests/queries/0_stateless/data_minio/03036_archive2.tar` -> `clickminio/test/03036_archive2.tar`
`/repo/tests/queries/0_stateless/data_minio/03036_archive2.zip` -> `clickminio/test/03036_archive2.zip`
`/repo/tests/queries/0_stateless/data_minio/03036_archive3.tar.gz` -> `clickminio/test/03036_archive3.tar.gz`
`/repo/tests/queries/0_stateless/data_minio/03036_compressed_file_archive.zip` -> `clickminio/test/03036_compressed_file_archive.zip`
`/repo/tests/queries/0_stateless/data_minio/03036_json_archive.zip` -> `clickminio/test/03036_json_archive.zip`
`/repo/tests/queries/0_stateless/data_minio/03322_a.parquet` -> `clickminio/test/03322_a.parquet`
`/repo/tests/queries/0_stateless/data_minio/03322_b.parquet` -> `clickminio/test/03322_b.parquet`
`/repo/tests/queries/0_stateless/data_minio/a.tsv` -> `clickminio/test/a.tsv`
`/repo/tests/queries/0_stateless/data_minio/b.tsv` -> `clickminio/test/b.tsv`
`/repo/tests/queries/0_stateless/data_minio/c.tsv` -> `clickminio/test/c.tsv`
`/repo/tests/queries/0_stateless/data_minio/est/data/00000-0-52725061-398c-41fa-a222-0981e71942b0-0-00001.parquet` -> `clickminio/test/est/data/00000-0-52725061-398c-41fa-a222-0981e71942b0-0-00001.parquet`
`/repo/tests/queries/0_stateless/data_minio/est/metadata/83521e92-07a7-450d-ba44-3a179b730c85-m0.avro` -> `clickminio/test/est/metadata/83521e92-07a7-450d-ba44-3a179b730c85-m0.avro`
`/repo/tests/queries/0_stateless/data_minio/est/metadata/snap-3858160944799047644-1-83521e92-07a7-450d-ba44-3a179b730c85.avro` -> `clickminio/test/est/metadata/snap-3858160944799047644-1-83521e92-07a7-450d-ba44-3a179b730c85.avro`
`/repo/tests/queries/0_stateless/data_minio/est/metadata/v2.metadata.json` -> `clickminio/test/est/metadata/v2.metadata.json`
`/repo/tests/queries/0_stateless/data_minio/hive_partitioning/column0=Elizabeth/column1=Gordon/sample.parquet` -> `clickminio/test/hive_partitioning/column0=Elizabeth/column1=Gordon/sample.parquet`
`/repo/tests/queries/0_stateless/data_minio/hive_partitioning/column0=Elizabeth/column1=Schmidt/sample.parquet` -> `clickminio/test/hive_partitioning/column0=Elizabeth/column1=Schmidt/sample.parquet`
`/repo/tests/queries/0_stateless/data_minio/hive_partitioning/column0=Elizabeth/sample.parquet` -> `clickminio/test/hive_partitioning/column0=Elizabeth/sample.parquet`
`/repo/tests/queries/0_stateless/data_minio/hive_partitioning/non_existing_column=Elizabeth/sample.parquet` -> `clickminio/test/hive_partitioning/non_existing_column=Elizabeth/sample.parquet`
`/repo/tests/queries/0_stateless/data_minio/json_data` -> `clickminio/test/json_data`
`/repo/tests/queries/0_stateless/data_minio/tsv_with_header.tsv` -> `clickminio/test/tsv_with_header.tsv`
Total: 5.43 MiB, Transferred: 5.43 MiB, Speed: 145.01 MiB/s
+ setup_aws_credentials
+ local minio_root_user=clickhouse
+ local minio_root_password=clickhouse
+ mkdir -p /root/.aws
+ cat
+ config_logs_export_cluster /etc/clickhouse-server/config.d/system_logs_export.yaml
+ azurite-blob --blobHost 0.0.0.0 --blobPort 10000 --silent --inMemoryPersistence
+ set +x
File /tmp/export-logs-config.sh does not exist, do not setup
+ export CLICKHOUSE_MAX_THREADS=8
+ CLICKHOUSE_MAX_THREADS=8
+ export CLICKHOUSE_MAX_CONCURRENT_QUERIES=4
+ CLICKHOUSE_MAX_CONCURRENT_QUERIES=4
+ start_server
+ counter=0
+ max_attempt=120
+ clickhouse-client --query 'SELECT 1'
Code: 210. DB::NetException: Connection refused (localhost:9000). (NETWORK_ERROR)
+ '[' 0 -gt 120 ']'
+ clickhouse start --user root
In-memory extent storage is enabled with a limit of 15667.21 MB (16428257280 bytes, 50% of total memory).
Azurite Blob service is starting on 0.0.0.0:10000
Azurite Blob service successfully listens on http://0.0.0.0:10000
+ sleep 0.5
+ counter=1
+ clickhouse-client --query 'SELECT 1'
Code: 210. DB::NetException: Connection refused (localhost:9000). (NETWORK_ERROR)
+ '[' 1 -gt 120 ']'
+ clickhouse start --user root
+ sleep 0.5
+ counter=2
+ clickhouse-client --query 'SELECT 1'
Code: 210. DB::NetException: Connection refused (localhost:9000). (NETWORK_ERROR)
+ '[' 2 -gt 120 ']'
+ clickhouse start --user root
+ sleep 0.5
+ counter=3
+ clickhouse-client --query 'SELECT 1'
Code: 210. DB::NetException: Connection refused (localhost:9000). (NETWORK_ERROR)
+ '[' 3 -gt 120 ']'
+ clickhouse start --user root
+ sleep 0.5
+ counter=4
+ clickhouse-client --query 'SELECT 1'
Code: 210. DB::NetException: Connection refused (localhost:9000). (NETWORK_ERROR)
+ '[' 4 -gt 120 ']'
+ clickhouse start --user root
+ sleep 0.5
+ counter=5
+ clickhouse-client --query 'SELECT 1'
Code: 210. DB::NetException: Connection refused (localhost:9000). (NETWORK_ERROR)
+ '[' 5 -gt 120 ']'
+ clickhouse start --user root
+ sleep 0.5
+ counter=6
+ clickhouse-client --query 'SELECT 1'
Code: 210. DB::NetException: Connection refused (localhost:9000). (NETWORK_ERROR)
+ '[' 6 -gt 120 ']'
+ clickhouse start --user root
+ sleep 0.5
+ counter=7
+ clickhouse-client --query 'SELECT 1'
Code: 210. DB::NetException: Connection refused (localhost:9000). (NETWORK_ERROR)
+ '[' 7 -gt 120 ']'
+ clickhouse start --user root
+ sleep 0.5
+ counter=8
+ clickhouse-client --query 'SELECT 1'
Code: 210. DB::NetException: Connection refused (localhost:9000). (NETWORK_ERROR)
+ '[' 8 -gt 120 ']'
+ clickhouse start --user root
+ sleep 0.5
+ counter=9
+ clickhouse-client --query 'SELECT 1'
Code: 210. DB::NetException: Connection refused (localhost:9000). (NETWORK_ERROR)
+ '[' 9 -gt 120 ']'
+ clickhouse start --user root
+ sleep 0.5
+ counter=10
+ clickhouse-client --query 'SELECT 1'
Code: 210. DB::NetException: Connection refused (localhost:9000). (NETWORK_ERROR)
+ '[' 10 -gt 120 ']'
+ clickhouse start --user root
+ sleep 0.5
+ counter=11
+ clickhouse-client --query 'SELECT 1'
1
+ attach_gdb_to_clickhouse
++ clickhouse local --query 'SELECT count() FROM system.build_options WHERE name = '\''CXX_FLAGS'\'' AND position('\''sanitize=address'\'' IN value)'
+ IS_ASAN=0
+ [[ 0 = \1 ]]
++ kill -l SIGRTMIN
+ RTMIN=34
+ echo '
set follow-fork-mode parent
handle SIGHUP nostop noprint pass
handle SIGINT nostop noprint pass
handle SIGQUIT nostop noprint pass
handle SIGPIPE nostop noprint pass
handle SIGTERM nostop noprint pass
handle SIGUSR1 nostop noprint pass
handle SIGUSR2 nostop noprint pass
handle SIG34 nostop noprint pass
info signals
# safeExit is called if graceful shutdown times out. Print stack traces in that case.
break safeExit
continue
backtrace full
info registers
p top' 1 KiB of the 'stack:
p/x *(uint64_t[128]*)$sp
maintenance info sections
thread apply all backtrace full
disassemble /s
up
disassemble /s
up
disassemble /s
p "done"
detach
quit
'
+ sleep 5
+ ts '%Y-%m-%d %H:%M:%S'
++ cat /var/run/clickhouse-server/clickhouse-server.pid
+ gdb -batch -command script.gdb -p 430
aarch64-binfmt-P: Could not open '/lib/ld-linux-aarch64.so.1': No such file or directory
+ run_with_retry 60 clickhouse-client --query 'SELECT '\''Connected to clickhouse-server after attaching gdb'\'''
+ local retries=60
+ shift
+ local retry=0
+ '[' 0 -ge 60 ']'
+ clickhouse-client --query 'SELECT '\''Connected to clickhouse-server after attaching gdb'\'''
Connected to clickhouse-server after attaching gdb
+ return
+ setup_logs_replication
File /tmp/export-logs-config.sh does not exist, do not setup
+ set +x
+ clickhouse-client --query 'CREATE DATABASE datasets'
+ clickhouse-client
+ clickhouse-client --query 'SHOW TABLES FROM datasets'
hits_v1
visits_v1
+ clickhouse-client --query 'CREATE DATABASE IF NOT EXISTS test'
+ stop_server
+ local max_tries=90
+ local check_hang=true
+ local pid
++ cat /var/run/clickhouse-server/clickhouse-server.pid
+ pid=430
+ for i in {1..30}
+ clickhouse client -q 'SYSTEM STOP DISTRIBUTED SENDS'
+ break
+ clickhouse stop --max-tries 90 --do-not-kill
/var/run/clickhouse-server/clickhouse-server.pid file exists and contains pid = 430.
The process with pid = 430 is running.
Sent terminate signal to process with pid 430.
Waiting for server to stop
/var/run/clickhouse-server/clickhouse-server.pid file exists and contains pid = 430.
The process with pid = 430 is running.
Waiting for server to stop
/var/run/clickhouse-server/clickhouse-server.pid file exists and contains pid = 430.
The process with pid = 430 is running.
Waiting for server to stop
/var/run/clickhouse-server/clickhouse-server.pid file exists and contains pid = 430.
The process with pid = 430 is running.
Waiting for server to stop
/var/run/clickhouse-server/clickhouse-server.pid file exists and contains pid = 430.
The process with pid = 430 is running.
Waiting for server to stop
/var/run/clickhouse-server/clickhouse-server.pid file exists and contains pid = 430.
The process with pid = 430 is running.
Waiting for server to stop
/var/run/clickhouse-server/clickhouse-server.pid file exists and contains pid = 430.
The process with pid = 430 is running.
Waiting for server to stop
/var/run/clickhouse-server/clickhouse-server.pid file exists and contains pid = 430.
The process with pid = 430 is running.
Waiting for server to stop
/var/run/clickhouse-server/clickhouse-server.pid file exists and contains pid = 430.
The process with pid = 430 is running.
Waiting for server to stop
Now there is no clickhouse-server process.
Server stopped
+ return
+ mv /var/log/clickhouse-server/clickhouse-server.log /var/log/clickhouse-server/clickhouse-server.initial.log
+ cache_policy=
+ '[' 1 -eq 1 ']'
+ cache_policy=SLRU
+ echo 'Using cache policy: SLRU'
Using cache policy: SLRU
+ '[' SLRU = SLRU ']'
+ sudo cat /etc/clickhouse-server/config.d/storage_conf.xml
+ sed 's|LRU|SLRU|'
+ mv /etc/clickhouse-server/config.d/storage_conf.xml.tmp /etc/clickhouse-server/config.d/storage_conf.xml
+ sudo cat /etc/clickhouse-server/users.d/stress_tests_overrides.xml
cat: /etc/clickhouse-server/users.d/stress_tests_overrides.xml: No such file or directory
+ start_server
+ counter=0
+ max_attempt=120
+ clickhouse-client --query 'SELECT 1'
Code: 210. DB::NetException: Connection refused (localhost:9000). (NETWORK_ERROR)
+ '[' 0 -gt 120 ']'
+ clickhouse start --user root
+ sleep 0.5
+ counter=1
+ clickhouse-client --query 'SELECT 1'
Code: 210. DB::NetException: Connection refused (localhost:9000). (NETWORK_ERROR)
+ '[' 1 -gt 120 ']'
+ clickhouse start --user root
+ sleep 0.5
+ counter=2
+ clickhouse-client --query 'SELECT 1'
Code: 210. DB::NetException: Connection refused (localhost:9000). (NETWORK_ERROR)
+ '[' 2 -gt 120 ']'
+ clickhouse start --user root
+ sleep 0.5
+ counter=3
+ clickhouse-client --query 'SELECT 1'
Code: 210. DB::NetException: Connection refused (localhost:9000). (NETWORK_ERROR)
+ '[' 3 -gt 120 ']'
+ clickhouse start --user root
+ sleep 0.5
+ counter=4
+ clickhouse-client --query 'SELECT 1'
Code: 210. DB::NetException: Connection refused (localhost:9000). (NETWORK_ERROR)
+ '[' 4 -gt 120 ']'
+ clickhouse start --user root
+ sleep 0.5
+ counter=5
+ clickhouse-client --query 'SELECT 1'
Code: 210. DB::NetException: Connection refused (localhost:9000). (NETWORK_ERROR)
+ '[' 5 -gt 120 ']'
+ clickhouse start --user root
+ sleep 0.5
+ counter=6
+ clickhouse-client --query 'SELECT 1'
Code: 210. DB::NetException: Connection refused (localhost:9000). (NETWORK_ERROR)
+ '[' 6 -gt 120 ']'
+ clickhouse start --user root
+ sleep 0.5
+ counter=7
+ clickhouse-client --query 'SELECT 1'
Code: 210. DB::NetException: Connection refused (localhost:9000). (NETWORK_ERROR)
+ '[' 7 -gt 120 ']'
+ clickhouse start --user root
+ sleep 0.5
+ counter=8
+ clickhouse-client --query 'SELECT 1'
Code: 210. DB::NetException: Connection refused (localhost:9000). (NETWORK_ERROR)
+ '[' 8 -gt 120 ']'
+ clickhouse start --user root
+ sleep 0.5
+ counter=9
+ clickhouse-client --query 'SELECT 1'
Code: 210. DB::NetException: Connection refused (localhost:9000). (NETWORK_ERROR)
+ '[' 9 -gt 120 ']'
+ clickhouse start --user root
+ sleep 0.5
+ counter=10
+ clickhouse-client --query 'SELECT 1'
Code: 210. DB::NetException: Connection refused (localhost:9000). (NETWORK_ERROR)
+ '[' 10 -gt 120 ']'
+ clickhouse start --user root
+ sleep 0.5
+ counter=11
+ clickhouse-client --query 'SELECT 1'
Code: 210. DB::NetException: Connection refused (localhost:9000). (NETWORK_ERROR)
+ '[' 11 -gt 120 ']'
+ clickhouse start --user root
+ sleep 0.5
+ counter=12
+ clickhouse-client --query 'SELECT 1'
1
+ attach_gdb_to_clickhouse
++ clickhouse local --query 'SELECT count() FROM system.build_options WHERE name = '\''CXX_FLAGS'\'' AND position('\''sanitize=address'\'' IN value)'
+ IS_ASAN=0
+ [[ 0 = \1 ]]
++ kill -l SIGRTMIN
+ RTMIN=34
+ echo '
set follow-fork-mode parent
handle SIGHUP nostop noprint pass
handle SIGINT nostop noprint pass
handle SIGQUIT nostop noprint pass
handle SIGPIPE nostop noprint pass
handle SIGTERM nostop noprint pass
handle SIGUSR1 nostop noprint pass
handle SIGUSR2 nostop noprint pass
handle SIG34 nostop noprint pass
info signals
# safeExit is called if graceful shutdown times out. Print stack traces in that case.
break safeExit
continue
backtrace full
info registers
p top' 1 KiB of the 'stack:
p/x *(uint64_t[128]*)$sp
maintenance info sections
thread apply all backtrace full
disassemble /s
up
disassemble /s
up
disassemble /s
p "done"
detach
quit
'
+ sleep 5
+ ts '%Y-%m-%d %H:%M:%S'
++ cat /var/run/clickhouse-server/clickhouse-server.pid
+ gdb -batch -command script.gdb -p 1331
aarch64-binfmt-P: Could not open '/lib/ld-linux-aarch64.so.1': No such file or directory
+ run_with_retry 60 clickhouse-client --query 'SELECT '\''Connected to clickhouse-server after attaching gdb'\'''
+ local retries=60
+ shift
+ local retry=0
+ '[' 0 -ge 60 ']'
+ clickhouse-client --query 'SELECT '\''Connected to clickhouse-server after attaching gdb'\'''
Connected to clickhouse-server after attaching gdb
+ return
+ clickhouse-client --query 'SHOW TABLES FROM datasets'
hits_v1
visits_v1
+ clickhouse-client --query 'SHOW TABLES FROM test'
+ [[ '' == \1 ]]
+ [[ '' == \1 ]]
+ TEMP_POLICY=default
+ clickhouse-client --query 'CREATE TABLE test.hits_s3 (WatchID UInt64, JavaEnable UInt8, Title String, GoodEvent Int16,
EventTime DateTime, EventDate Date, CounterID UInt32, ClientIP UInt32, ClientIP6 FixedString(16), RegionID UInt32,
UserID UInt64, CounterClass Int8, OS UInt8, UserAgent UInt8, URL String, Referer String, URLDomain String, RefererDomain String,
Refresh UInt8, IsRobot UInt8, RefererCategories Array(UInt16), URLCategories Array(UInt16), URLRegions Array(UInt32),
RefererRegions Array(UInt32), ResolutionWidth UInt16, ResolutionHeight UInt16, ResolutionDepth UInt8, FlashMajor UInt8,
FlashMinor UInt8, FlashMinor2 String, NetMajor UInt8, NetMinor UInt8, UserAgentMajor UInt16, UserAgentMinor FixedString(2),
CookieEnable UInt8, JavascriptEnable UInt8, IsMobile UInt8, MobilePhone UInt8, MobilePhoneModel String, Params String,
IPNetworkID UInt32, TraficSourceID Int8, SearchEngineID UInt16, SearchPhrase String, AdvEngineID UInt8, IsArtifical UInt8,
WindowClientWidth UInt16, WindowClientHeight UInt16, ClientTimeZone Int16, ClientEventTime DateTime, SilverlightVersion1 UInt8,
SilverlightVersion2 UInt8, SilverlightVersion3 UInt32, SilverlightVersion4 UInt16, PageCharset String, CodeVersion UInt32,
IsLink UInt8, IsDownload UInt8, IsNotBounce UInt8, FUniqID UInt64, HID UInt32, IsOldCounter UInt8, IsEvent UInt8,
IsParameter UInt8, DontCountHits UInt8, WithHash UInt8, HitColor FixedString(1), UTCEventTime DateTime, Age UInt8,
Sex UInt8, Income UInt8, Interests UInt16, Robotness UInt8, GeneralInterests Array(UInt16), RemoteIP UInt32,
RemoteIP6 FixedString(16), WindowName Int32, OpenerName Int32, HistoryLength Int16, BrowserLanguage FixedString(2),
BrowserCountry FixedString(2), SocialNetwork String, SocialAction String, HTTPError UInt16, SendTiming Int32,
DNSTiming Int32, ConnectTiming Int32, ResponseStartTiming Int32, ResponseEndTiming Int32, FetchTiming Int32,
RedirectTiming Int32, DOMInteractiveTiming Int32, DOMContentLoadedTiming Int32, DOMCompleteTiming Int32,
LoadEventStartTiming Int32, LoadEventEndTiming Int32, NSToDOMContentLoadedTiming Int32, FirstPaintTiming Int32,
RedirectCount Int8, SocialSourceNetworkID UInt8, SocialSourcePage String, ParamPrice Int64, ParamOrderID String,
ParamCurrency FixedString(3), ParamCurrencyID UInt16, GoalsReached Array(UInt32), OpenstatServiceName String,
OpenstatCampaignID String, OpenstatAdID String, OpenstatSourceID String, UTMSource String, UTMMedium String,
UTMCampaign String, UTMContent String, UTMTerm String, FromTag String, HasGCLID UInt8, RefererHash UInt64,
URLHash UInt64, CLID UInt32, YCLID UInt64, ShareService String, ShareURL String, ShareTitle String,
ParsedParams Nested(Key1 String, Key2 String, Key3 String, Key4 String, Key5 String, ValueDouble Float64),
IslandID FixedString(16), RequestNum UInt32, RequestTry UInt8) ENGINE = MergeTree() PARTITION BY toYYYYMM(EventDate)
ORDER BY (CounterID, EventDate, intHash32(UserID)) SAMPLE BY intHash32(UserID) SETTINGS index_granularity = 8192, storage_policy='\''default'\'''
+ clickhouse-client --query 'CREATE TABLE test.hits (WatchID UInt64, JavaEnable UInt8, Title String, GoodEvent Int16,
EventTime DateTime, EventDate Date, CounterID UInt32, ClientIP UInt32, ClientIP6 FixedString(16), RegionID UInt32,
UserID UInt64, CounterClass Int8, OS UInt8, UserAgent UInt8, URL String, Referer String, URLDomain String,
RefererDomain String, Refresh UInt8, IsRobot UInt8, RefererCategories Array(UInt16), URLCategories Array(UInt16),
URLRegions Array(UInt32), RefererRegions Array(UInt32), ResolutionWidth UInt16, ResolutionHeight UInt16, ResolutionDepth UInt8,
FlashMajor UInt8, FlashMinor UInt8, FlashMinor2 String, NetMajor UInt8, NetMinor UInt8, UserAgentMajor UInt16,
UserAgentMinor FixedString(2), CookieEnable UInt8, JavascriptEnable UInt8, IsMobile UInt8, MobilePhone UInt8,
MobilePhoneModel String, Params String, IPNetworkID UInt32, TraficSourceID Int8, SearchEngineID UInt16,
SearchPhrase String, AdvEngineID UInt8, IsArtifical UInt8, WindowClientWidth UInt16, WindowClientHeight UInt16,
ClientTimeZone Int16, ClientEventTime DateTime, SilverlightVersion1 UInt8, SilverlightVersion2 UInt8, SilverlightVersion3 UInt32,
SilverlightVersion4 UInt16, PageCharset String, CodeVersion UInt32, IsLink UInt8, IsDownload UInt8, IsNotBounce UInt8,
FUniqID UInt64, HID UInt32, IsOldCounter UInt8, IsEvent UInt8, IsParameter UInt8, DontCountHits UInt8, WithHash UInt8,
HitColor FixedString(1), UTCEventTime DateTime, Age UInt8, Sex UInt8, Income UInt8, Interests UInt16, Robotness UInt8,
GeneralInterests Array(UInt16), RemoteIP UInt32, RemoteIP6 FixedString(16), WindowName Int32, OpenerName Int32,
HistoryLength Int16, BrowserLanguage FixedString(2), BrowserCountry FixedString(2), SocialNetwork String, SocialAction String,
HTTPError UInt16, SendTiming Int32, DNSTiming Int32, ConnectTiming Int32, ResponseStartTiming Int32, ResponseEndTiming Int32,
FetchTiming Int32, RedirectTiming Int32, DOMInteractiveTiming Int32, DOMContentLoadedTiming Int32, DOMCompleteTiming Int32,
LoadEventStartTiming Int32, LoadEventEndTiming Int32, NSToDOMContentLoadedTiming Int32, FirstPaintTiming Int32,
RedirectCount Int8, SocialSourceNetworkID UInt8, SocialSourcePage String, ParamPrice Int64, ParamOrderID String,
ParamCurrency FixedString(3), ParamCurrencyID UInt16, GoalsReached Array(UInt32), OpenstatServiceName String,
OpenstatCampaignID String, OpenstatAdID String, OpenstatSourceID String, UTMSource String, UTMMedium String,
UTMCampaign String, UTMContent String, UTMTerm String, FromTag String, HasGCLID UInt8, RefererHash UInt64,
URLHash UInt64, CLID UInt32, YCLID UInt64, ShareService String, ShareURL String, ShareTitle String,
ParsedParams Nested(Key1 String, Key2 String, Key3 String, Key4 String, Key5 String, ValueDouble Float64),
IslandID FixedString(16), RequestNum UInt32, RequestTry UInt8) ENGINE = MergeTree() PARTITION BY toYYYYMM(EventDate)
ORDER BY (CounterID, EventDate, intHash32(UserID)) SAMPLE BY intHash32(UserID) SETTINGS index_granularity = 8192, storage_policy='\''default'\'''
+ clickhouse-client --query 'CREATE TABLE test.visits (CounterID UInt32, StartDate Date, Sign Int8, IsNew UInt8,
VisitID UInt64, UserID UInt64, StartTime DateTime, Duration UInt32, UTCStartTime DateTime, PageViews Int32,
Hits Int32, IsBounce UInt8, Referer String, StartURL String, RefererDomain String, StartURLDomain String,
EndURL String, LinkURL String, IsDownload UInt8, TraficSourceID Int8, SearchEngineID UInt16, SearchPhrase String,
AdvEngineID UInt8, PlaceID Int32, RefererCategories Array(UInt16), URLCategories Array(UInt16), URLRegions Array(UInt32),
RefererRegions Array(UInt32), IsYandex UInt8, GoalReachesDepth Int32, GoalReachesURL Int32, GoalReachesAny Int32,
SocialSourceNetworkID UInt8, SocialSourcePage String, MobilePhoneModel String, ClientEventTime DateTime, RegionID UInt32,
ClientIP UInt32, ClientIP6 FixedString(16), RemoteIP UInt32, RemoteIP6 FixedString(16), IPNetworkID UInt32,
SilverlightVersion3 UInt32, CodeVersion UInt32, ResolutionWidth UInt16, ResolutionHeight UInt16, UserAgentMajor UInt16,
UserAgentMinor UInt16, WindowClientWidth UInt16, WindowClientHeight UInt16, SilverlightVersion2 UInt8, SilverlightVersion4 UInt16,
FlashVersion3 UInt16, FlashVersion4 UInt16, ClientTimeZone Int16, OS UInt8, UserAgent UInt8, ResolutionDepth UInt8,
FlashMajor UInt8, FlashMinor UInt8, NetMajor UInt8, NetMinor UInt8, MobilePhone UInt8, SilverlightVersion1 UInt8,
Age UInt8, Sex UInt8, Income UInt8, JavaEnable UInt8, CookieEnable UInt8, JavascriptEnable UInt8, IsMobile UInt8,
BrowserLanguage UInt16, BrowserCountry UInt16, Interests UInt16, Robotness UInt8, GeneralInterests Array(UInt16),
Params Array(String), Goals Nested(ID UInt32, Serial UInt32, EventTime DateTime, Price Int64, OrderID String, CurrencyID UInt32),
WatchIDs Array(UInt64), ParamSumPrice Int64, ParamCurrency FixedString(3), ParamCurrencyID UInt16, ClickLogID UInt64,
ClickEventID Int32, ClickGoodEvent Int32, ClickEventTime DateTime, ClickPriorityID Int32, ClickPhraseID Int32, ClickPageID Int32,
ClickPlaceID Int32, ClickTypeID Int32, ClickResourceID Int32, ClickCost UInt32, ClickClientIP UInt32, ClickDomainID UInt32,
ClickURL String, ClickAttempt UInt8, ClickOrderID UInt32, ClickBannerID UInt32, ClickMarketCategoryID UInt32, ClickMarketPP UInt32,
ClickMarketCategoryName String, ClickMarketPPName String, ClickAWAPSCampaignName String, ClickPageName String, ClickTargetType UInt16,
ClickTargetPhraseID UInt64, ClickContextType UInt8, ClickSelectType Int8, ClickOptions String, ClickGroupBannerID Int32,
OpenstatServiceName String, OpenstatCampaignID String, OpenstatAdID String, OpenstatSourceID String, UTMSource String,
UTMMedium String, UTMCampaign String, UTMContent String, UTMTerm String, FromTag String, HasGCLID UInt8, FirstVisit DateTime,
PredLastVisit Date, LastVisit Date, TotalVisits UInt32, TraficSource Nested(ID Int8, SearchEngineID UInt16, AdvEngineID UInt8,
PlaceID UInt16, SocialSourceNetworkID UInt8, Domain String, SearchPhrase String, SocialSourcePage String), Attendance FixedString(16),
CLID UInt32, YCLID UInt64, NormalizedRefererHash UInt64, SearchPhraseHash UInt64, RefererDomainHash UInt64, NormalizedStartURLHash UInt64,
StartURLDomainHash UInt64, NormalizedEndURLHash UInt64, TopLevelDomain UInt64, URLScheme UInt64, OpenstatServiceNameHash UInt64,
OpenstatCampaignIDHash UInt64, OpenstatAdIDHash UInt64, OpenstatSourceIDHash UInt64, UTMSourceHash UInt64, UTMMediumHash UInt64,
UTMCampaignHash UInt64, UTMContentHash UInt64, UTMTermHash UInt64, FromHash UInt64, WebVisorEnabled UInt8, WebVisorActivity UInt32,
ParsedParams Nested(Key1 String, Key2 String, Key3 String, Key4 String, Key5 String, ValueDouble Float64),
Market Nested(Type UInt8, GoalID UInt32, OrderID String, OrderPrice Int64, PP UInt32, DirectPlaceID UInt32, DirectOrderID UInt32,
DirectBannerID UInt32, GoodID String, GoodName String, GoodQuantity Int32, GoodPrice Int64), IslandID FixedString(16))
ENGINE = CollapsingMergeTree(Sign) PARTITION BY toYYYYMM(StartDate) ORDER BY (CounterID, StartDate, intHash32(UserID), VisitID)
SAMPLE BY intHash32(UserID) SETTINGS index_granularity = 8192, storage_policy='\''default'\'''
+ clickhouse-client --query 'INSERT INTO test.hits_s3 SELECT * FROM datasets.hits_v1 SETTINGS enable_filesystem_cache_on_write_operations=0, max_insert_threads=16'
Received exception from server (version 25.3.14):
Code: 241. DB::Exception: Received from localhost:9000. DB::Exception: (total) memory limit exceeded: would use 4.89 GiB (attempt to allocate chunk of 1.06 MiB bytes), current RSS: 15.40 GiB, maximum: 15.30 GiB. OvercommitTracker decision: Query was selected to stop by OvercommitTracker: (avg_value_size_hint = 18.9488525390625, avg_chars_size = 13.138623046874999, limit = 8192): (while reading column Params): (while reading from part store/78e/78ebf6a1-d987-4579-b3ec-00c1a087b1f3/201403_1_1_2/ in table datasets.hits_v1 (78ebf6a1-d987-4579-b3ec-00c1a087b1f3) located on disk __tmp_internal_262634248876485800814430204900764312493 of type web, from mark 212 with max_rows_to_read = 8192): While executing MergeTreeSelect(pool: ReadPool, algorithm: Thread). (MEMORY_LIMIT_EXCEEDED)
(query: INSERT INTO test.hits_s3 SELECT * FROM datasets.hits_v1 SETTINGS enable_filesystem_cache_on_write_operations=0, max_insert_threads=16)
+ clickhouse-client --query 'INSERT INTO test.hits SELECT * FROM datasets.hits_v1 SETTINGS enable_filesystem_cache_on_write_operations=0, max_insert_threads=16'
Received exception from server (version 25.3.14):
Code: 241. DB::Exception: Received from localhost:9000. DB::Exception: (total) memory limit exceeded: would use 4.90 GiB (attempt to allocate chunk of 1.79 MiB bytes), current RSS: 15.33 GiB, maximum: 15.30 GiB. OvercommitTracker decision: Query was selected to stop by OvercommitTracker: (avg_value_size_hint = 142.442626953125, avg_chars_size = 161.33115234375, limit = 8192): (while reading column Title): (while reading from part store/78e/78ebf6a1-d987-4579-b3ec-00c1a087b1f3/201403_1_1_2/ in table datasets.hits_v1 (78ebf6a1-d987-4579-b3ec-00c1a087b1f3) located on disk __tmp_internal_262634248876485800814430204900764312493 of type web, from mark 8 with max_rows_to_read = 8192): While executing MergeTreeSelect(pool: ReadPool, algorithm: Thread). (MEMORY_LIMIT_EXCEEDED)
(query: INSERT INTO test.hits SELECT * FROM datasets.hits_v1 SETTINGS enable_filesystem_cache_on_write_operations=0, max_insert_threads=16)
+ clickhouse-client --query 'INSERT INTO test.visits SELECT * FROM datasets.visits_v1 SETTINGS enable_filesystem_cache_on_write_operations=0, max_insert_threads=16'
Received exception from server (version 25.3.14):
Code: 241. DB::Exception: Received from localhost:9000. DB::Exception: (total) memory limit exceeded: would use 4.09 GiB (attempt to allocate chunk of 1.02 MiB bytes), current RSS: 15.32 GiB, maximum: 15.30 GiB. OvercommitTracker decision: Query was selected to stop by OvercommitTracker: (while reading column URLCategories): (while reading from part store/513/5131f834-711f-4168-98a5-968b691a104b/201403_1_8_2/ in table datasets.visits_v1 (5131f834-711f-4168-98a5-968b691a104b) located on disk __tmp_internal_262634248876485800814430204900764312493 of type web, from mark 25 with max_rows_to_read = 6682): While executing MergeTreeSelect(pool: ReadPool, algorithm: Thread). (MEMORY_LIMIT_EXCEEDED)
(query: INSERT INTO test.visits SELECT * FROM datasets.visits_v1 SETTINGS enable_filesystem_cache_on_write_operations=0, max_insert_threads=16)
+ clickhouse-client --query 'DROP TABLE datasets.visits_v1 SYNC'
+ clickhouse-client --query 'DROP TABLE datasets.hits_v1 SYNC'
+ clickhouse-client --query 'SHOW TABLES FROM test'
hits
hits_s3
visits
+ clickhouse-client --query 'SYSTEM STOP THREAD FUZZER'
+ stop_server
+ local max_tries=90
+ local check_hang=true
+ local pid
++ cat /var/run/clickhouse-server/clickhouse-server.pid
+ pid=1331
+ for i in {1..30}
+ clickhouse client -q 'SYSTEM STOP DISTRIBUTED SENDS'
+ break
+ clickhouse stop --max-tries 90 --do-not-kill
/var/run/clickhouse-server/clickhouse-server.pid file exists and contains pid = 1331.
The process with pid = 1331 is running.
Sent terminate signal to process with pid 1331.
Waiting for server to stop
/var/run/clickhouse-server/clickhouse-server.pid file exists and contains pid = 1331.
The process with pid = 1331 is running.
Waiting for server to stop
/var/run/clickhouse-server/clickhouse-server.pid file exists and contains pid = 1331.
The process with pid = 1331 is running.
Waiting for server to stop
/var/run/clickhouse-server/clickhouse-server.pid file exists and contains pid = 1331.
The process with pid = 1331 is running.
Waiting for server to stop
/var/run/clickhouse-server/clickhouse-server.pid file exists and contains pid = 1331.
The process with pid = 1331 is running.
Waiting for server to stop
/var/run/clickhouse-server/clickhouse-server.pid file exists and contains pid = 1331.
The process with pid = 1331 is running.
Waiting for server to stop
Found pid = 1331 in the list of running processes.
The process with pid = 1331 is running.
Waiting for server to stop
Now there is no clickhouse-server process.
Server stopped
+ return
+ export RANDOMIZE_OBJECT_KEY_TYPE=1
+ RANDOMIZE_OBJECT_KEY_TYPE=1
+ export ZOOKEEPER_FAULT_INJECTION=1
+ ZOOKEEPER_FAULT_INJECTION=1
+ export THREAD_POOL_FAULT_INJECTION=1
+ THREAD_POOL_FAULT_INJECTION=1
+ configure
+ export USE_DATABASE_ORDINARY=1
+ USE_DATABASE_ORDINARY=1
+ export EXPORT_S3_STORAGE_POLICIES=1
+ EXPORT_S3_STORAGE_POLICIES=1
+ /repo/tests/config/install.sh
+ DEST_SERVER_PATH=/etc/clickhouse-server
+ DEST_CLIENT_PATH=/etc/clickhouse-client
+++ dirname /repo/tests/config/install.sh
++ cd /repo/tests/config
++ pwd -P
+ SRC_PATH=/repo/tests/config
+ '[' 0 -ge 2 ']'
+ FAST_TEST=0
+ NO_AZURE=0
+ [[ 0 -gt 0 ]]
Going to install test configs from /repo/tests/config into /etc/clickhouse-server
+ echo 'Going to install test configs from /repo/tests/config into /etc/clickhouse-server'
+ mkdir -p /etc/clickhouse-server/config.d/
+ mkdir -p /etc/clickhouse-server/users.d/
+ mkdir -p /etc/clickhouse-client
+ ln -sf /repo/tests/config/config.d/tmp.xml /etc/clickhouse-server/config.d/
+ ln -sf /repo/tests/config/config.d/zookeeper_write.xml /etc/clickhouse-server/config.d/
+ ln -sf /repo/tests/config/config.d/max_num_to_warn.xml /etc/clickhouse-server/config.d/
+ ln -sf /repo/tests/config/config.d/listen.xml /etc/clickhouse-server/config.d/
+ ln -sf /repo/tests/config/config.d/text_log.xml /etc/clickhouse-server/config.d/
+ ln -sf /repo/tests/config/config.d/blob_storage_log.xml /etc/clickhouse-server/config.d/
+ ln -sf /repo/tests/config/config.d/custom_settings_prefixes.xml /etc/clickhouse-server/config.d/
+ ln -sf /repo/tests/config/config.d/database_catalog_drop_table_concurrency.xml /etc/clickhouse-server/config.d/
+ ln -sf /repo/tests/config/config.d/enable_access_control_improvements.xml /etc/clickhouse-server/config.d/
+ ln -sf /repo/tests/config/config.d/macros.xml /etc/clickhouse-server/config.d/
+ ln -sf /repo/tests/config/config.d/secure_ports.xml /etc/clickhouse-server/config.d/
+ ln -sf /repo/tests/config/config.d/clusters.xml /etc/clickhouse-server/config.d/
+ ln -sf /repo/tests/config/config.d/graphite.xml /etc/clickhouse-server/config.d/
+ ln -sf /repo/tests/config/config.d/graphite_alternative.xml /etc/clickhouse-server/config.d/
+ ln -sf /repo/tests/config/config.d/grpc_protocol.xml /etc/clickhouse-server/config.d/
+ ln -sf /repo/tests/config/config.d/database_atomic.xml /etc/clickhouse-server/config.d/
+ ln -sf /repo/tests/config/config.d/max_concurrent_queries.xml /etc/clickhouse-server/config.d/
+ ln -sf /repo/tests/config/config.d/merge_tree_settings.xml /etc/clickhouse-server/config.d/
+ ln -sf /repo/tests/config/config.d/backoff_failed_mutation.xml /etc/clickhouse-server/config.d/
+ ln -sf /repo/tests/config/config.d/merge_tree_old_dirs_cleanup.xml /etc/clickhouse-server/config.d/
+ ln -sf /repo/tests/config/config.d/test_cluster_with_incorrect_pw.xml /etc/clickhouse-server/config.d/
+ ln -sf /repo/tests/config/config.d/keeper_port.xml /etc/clickhouse-server/config.d/
+ ln -sf /repo/tests/config/config.d/logging_no_rotate.xml /etc/clickhouse-server/config.d/
+ ln -sf /repo/tests/config/config.d/merge_tree.xml /etc/clickhouse-server/config.d/
+ ln -sf /repo/tests/config/config.d/lost_forever_check.xml /etc/clickhouse-server/config.d/
+ ln -sf /repo/tests/config/config.d/tcp_with_proxy.xml /etc/clickhouse-server/config.d/
+ ln -sf /repo/tests/config/config.d/prometheus.xml /etc/clickhouse-server/config.d/
+ ln -sf /repo/tests/config/config.d/top_level_domains_lists.xml /etc/clickhouse-server/config.d/
+ ln -sf /repo/tests/config/config.d/top_level_domains_path.xml /etc/clickhouse-server/config.d/
+ ln -sf /repo/tests/config/config.d/transactions.xml /etc/clickhouse-server/config.d/
+ ln -sf /repo/tests/config/config.d/encryption.xml /etc/clickhouse-server/config.d/
+ ln -sf /repo/tests/config/config.d/zookeeper_log.xml /etc/clickhouse-server/config.d/
+ ln -sf /repo/tests/config/config.d/logger_trace.xml /etc/clickhouse-server/config.d/
+ ln -sf /repo/tests/config/config.d/named_collection.xml /etc/clickhouse-server/config.d/
+ ln -sf /repo/tests/config/config.d/ssl_certs.xml /etc/clickhouse-server/config.d/
+ ln -sf /repo/tests/config/config.d/filesystem_cache_log.xml /etc/clickhouse-server/config.d/
+ ln -sf /repo/tests/config/config.d/session_log.xml /etc/clickhouse-server/config.d/
+ ln -sf /repo/tests/config/config.d/system_unfreeze.xml /etc/clickhouse-server/config.d/
+ ln -sf /repo/tests/config/config.d/enable_zero_copy_replication.xml /etc/clickhouse-server/config.d/
+ ln -sf /repo/tests/config/config.d/nlp.xml /etc/clickhouse-server/config.d/
+ ln -sf /repo/tests/config/config.d/forbidden_headers.xml /etc/clickhouse-server/config.d/
+ ln -sf /repo/tests/config/config.d/enable_keeper_map.xml /etc/clickhouse-server/config.d/
+ ln -sf /repo/tests/config/config.d/custom_disks_base_path.xml /etc/clickhouse-server/config.d/
+ ln -sf /repo/tests/config/config.d/display_name.xml /etc/clickhouse-server/config.d/
+ ln -sf /repo/tests/config/config.d/compressed_marks_and_index.xml /etc/clickhouse-server/config.d/
+ ln -sf /repo/tests/config/config.d/disable_s3_env_credentials.xml /etc/clickhouse-server/config.d/
+ ln -sf /repo/tests/config/config.d/enable_wait_for_shutdown_replicated_tables.xml /etc/clickhouse-server/config.d/
+ ln -sf /repo/tests/config/config.d/backups.xml /etc/clickhouse-server/config.d/
+ ln -sf /repo/tests/config/config.d/filesystem_caches_path.xml /etc/clickhouse-server/config.d/
+ ln -sf /repo/tests/config/config.d/validate_tcp_client_information.xml /etc/clickhouse-server/config.d/
+ ln -sf /repo/tests/config/config.d/zero_copy_destructive_operations.xml /etc/clickhouse-server/config.d/
+ ln -sf /repo/tests/config/config.d/handlers.yaml /etc/clickhouse-server/config.d/
+ ln -sf /repo/tests/config/config.d/threadpool_writer_pool_size.yaml /etc/clickhouse-server/config.d/
+ ln -sf /repo/tests/config/config.d/serverwide_trace_collector.xml /etc/clickhouse-server/config.d/
+ ln -sf /repo/tests/config/config.d/rocksdb.xml /etc/clickhouse-server/config.d/
+ '[' 0 '!=' 1 ']'
+ ln -sf /repo/tests/config/config.d/legacy_geobase.xml /etc/clickhouse-server/config.d/
+ ln -sf /repo/tests/config/users.d/log_queries.xml /etc/clickhouse-server/users.d/
+ ln -sf /repo/tests/config/users.d/readonly.xml /etc/clickhouse-server/users.d/
+ ln -sf /repo/tests/config/users.d/ci_logs_sender.yaml /etc/clickhouse-server/users.d/
+ ln -sf /repo/tests/config/users.d/access_management.xml /etc/clickhouse-server/users.d/
+ ln -sf /repo/tests/config/users.d/database_atomic_drop_detach_sync.xml /etc/clickhouse-server/users.d/
+ ln -sf /repo/tests/config/users.d/opentelemetry.xml /etc/clickhouse-server/users.d/
+ ln -sf /repo/tests/config/users.d/remote_queries.xml /etc/clickhouse-server/users.d/
+ ln -sf /repo/tests/config/users.d/session_log_test.xml /etc/clickhouse-server/users.d/
+ ln -sf /repo/tests/config/users.d/memory_profiler.xml /etc/clickhouse-server/users.d/
+ ln -sf /repo/tests/config/users.d/no_fsync_metadata.xml /etc/clickhouse-server/users.d/
+ ln -sf /repo/tests/config/users.d/filelog.xml /etc/clickhouse-server/users.d/
+ ln -sf /repo/tests/config/users.d/enable_blobs_check.xml /etc/clickhouse-server/users.d/
+ ln -sf /repo/tests/config/users.d/marks.xml /etc/clickhouse-server/users.d/
+ ln -sf /repo/tests/config/users.d/insert_keeper_retries.xml /etc/clickhouse-server/users.d/
+ ln -sf /repo/tests/config/users.d/prefetch_settings.xml /etc/clickhouse-server/users.d/
+ ln -sf /repo/tests/config/users.d/nonconst_timezone.xml /etc/clickhouse-server/users.d/
+ ln -sf /repo/tests/config/users.d/allow_introspection_functions.yaml /etc/clickhouse-server/users.d/
+ ln -sf /repo/tests/config/users.d/replicated_ddl_entry.xml /etc/clickhouse-server/users.d/
+ ln -sf /repo/tests/config/users.d/limits.yaml /etc/clickhouse-server/users.d/
+ [[ -n '' ]]
+ ln -sf /repo/tests/config/users.d/timeouts.xml /etc/clickhouse-server/users.d/
+ ln -sf /repo/tests/config/ints_dictionary.xml /etc/clickhouse-server/
+ ln -sf /repo/tests/config/strings_dictionary.xml /etc/clickhouse-server/
+ ln -sf /repo/tests/config/decimals_dictionary.xml /etc/clickhouse-server/
+ ln -sf /repo/tests/config/executable_dictionary.xml /etc/clickhouse-server/
+ ln -sf /repo/tests/config/executable_pool_dictionary.xml /etc/clickhouse-server/
+ ln -sf /repo/tests/config/test_function.xml /etc/clickhouse-server/
+ ln -sf /repo/tests/config/top_level_domains /etc/clickhouse-server/
+ ln -sf /repo/tests/config/regions_hierarchy.txt /etc/clickhouse-server/config.d/
+ ln -sf /repo/tests/config/regions_names_en.txt /etc/clickhouse-server/config.d/
+ ln -sf /repo/tests/config/regions_names_es.txt /etc/clickhouse-server/config.d/
+ ln -sf /repo/tests/config/ext-en.txt /etc/clickhouse-server/config.d/
+ ln -sf /repo/tests/config/ext-ru.txt /etc/clickhouse-server/config.d/
+ ln -sf /repo/tests/config/lem-en.bin /etc/clickhouse-server/config.d/
+ ln -sf /repo/tests/config/server.key /etc/clickhouse-server/
+ ln -sf /repo/tests/config/server.crt /etc/clickhouse-server/
+ ln -sf /repo/tests/config/dhparam.pem /etc/clickhouse-server/
+ ln -sf --backup=simple --suffix=_original.xml /repo/tests/config/config.d/query_masking_rules.xml /etc/clickhouse-server/config.d/
+ [[ -n 1 ]]
+ [[ 1 -eq 1 ]]
+ rm -f /etc/clickhouse-server/config.d/zookeeper.xml
+ ln -sf /repo/tests/config/config.d/zookeeper_fault_injection.xml /etc/clickhouse-server/config.d/
+ [[ -n 1 ]]
+ [[ 1 -eq 1 ]]
+ ln -sf /repo/tests/config/config.d/cannot_allocate_thread_injection.xml /etc/clickhouse-server/config.d/
+ value=0
+ sed --follow-symlinks -i 's|[01]|0|' /etc/clickhouse-server/config.d/keeper_port.xml
+ value=41021440
+ sed --follow-symlinks -i 's|[[:digit:]]\+|41021440|' /etc/clickhouse-server/config.d/keeper_port.xml
+ value=32415744
+ sed --follow-symlinks -i 's|[[:digit:]]\+|32415744|' /etc/clickhouse-server/config.d/keeper_port.xml
+ value=1
+ sed --follow-symlinks -i 's|[01]|1|' /etc/clickhouse-server/config.d/keeper_port.xml
+ [[ -n '' ]]
+ [[ -n 1 ]]
+ [[ 1 -eq 1 ]]
+ ln -sf /repo/tests/config/users.d/database_ordinary.xml /etc/clickhouse-server/users.d/
+ [[ '' == \1 ]]
+ [[ '' == \1 ]]
+ [[ 1 == \1 ]]
+ [[ 0 != \1 ]]
+ ln -sf /repo/tests/config/config.d/azure_storage_conf.xml /etc/clickhouse-server/config.d/
+ ln -sf /repo/tests/config/config.d/storage_conf.xml /etc/clickhouse-server/config.d/
+ ln -sf /repo/tests/config/config.d/storage_conf_02944.xml /etc/clickhouse-server/config.d/
+ ln -sf /repo/tests/config/config.d/storage_conf_02963.xml /etc/clickhouse-server/config.d/
+ ln -sf /repo/tests/config/config.d/storage_conf_02961.xml /etc/clickhouse-server/config.d/
+ ln -sf /repo/tests/config/users.d/s3_cache.xml /etc/clickhouse-server/users.d/
+ ln -sf /repo/tests/config/users.d/s3_cache_new.xml /etc/clickhouse-server/users.d/
+ [[ '' == \1 ]]
+ [[ '' == \1 ]]
+ ln -sf /repo/tests/config/client_config.xml /etc/clickhouse-client/config.xml
+ sudo cat /etc/clickhouse-server/config.d/keeper_port.xml
+ sed 's|100000|10000|'
+ sudo mv /etc/clickhouse-server/config.d/keeper_port.xml.tmp /etc/clickhouse-server/config.d/keeper_port.xml
+ [[ -n 1 ]]
+ [[ 1 -eq 1 ]]
+ randomize_config_boolean_value filtered_list keeper_port
+ value=0
+ sudo cat /etc/clickhouse-server/config.d/keeper_port.xml
+ sed 's|[01]|0|'
+ sudo mv /etc/clickhouse-server/config.d/keeper_port.xml.tmp /etc/clickhouse-server/config.d/keeper_port.xml
+ randomize_config_boolean_value multi_read keeper_port
+ value=0
+ sudo cat /etc/clickhouse-server/config.d/keeper_port.xml
+ sed 's|[01]|0|'
+ sudo mv /etc/clickhouse-server/config.d/keeper_port.xml.tmp /etc/clickhouse-server/config.d/keeper_port.xml
+ randomize_config_boolean_value check_not_exists keeper_port
+ value=1
+ sudo cat /etc/clickhouse-server/config.d/keeper_port.xml
+ sed 's|[01]|1|'
+ sudo mv /etc/clickhouse-server/config.d/keeper_port.xml.tmp /etc/clickhouse-server/config.d/keeper_port.xml
+ randomize_config_boolean_value create_if_not_exists keeper_port
+ value=1
+ sudo cat /etc/clickhouse-server/config.d/keeper_port.xml
+ sed 's|[01]|1|'
+ sudo mv /etc/clickhouse-server/config.d/keeper_port.xml.tmp /etc/clickhouse-server/config.d/keeper_port.xml
+ randomize_config_boolean_value remove_recursive keeper_port
+ value=0
+ sudo cat /etc/clickhouse-server/config.d/keeper_port.xml
+ sed 's|[01]|0|'
+ sudo mv /etc/clickhouse-server/config.d/keeper_port.xml.tmp /etc/clickhouse-server/config.d/keeper_port.xml
+ sudo chown clickhouse /etc/clickhouse-server/config.d/keeper_port.xml
+ sudo chgrp clickhouse /etc/clickhouse-server/config.d/keeper_port.xml
+ [[ -n 1 ]]
+ [[ 1 -eq 1 ]]
+ randomize_config_boolean_value use_compression zookeeper_fault_injection
+ value=1
+ sudo cat /etc/clickhouse-server/config.d/zookeeper_fault_injection.xml
+ sed 's|[01]|1|'
+ sudo mv /etc/clickhouse-server/config.d/zookeeper_fault_injection.xml.tmp /etc/clickhouse-server/config.d/zookeeper_fault_injection.xml
+ randomize_config_boolean_value use_xid_64 zookeeper_fault_injection
+ value=0
+ sudo cat /etc/clickhouse-server/config.d/zookeeper_fault_injection.xml
+ sed 's|[01]|0|'
+ sudo mv /etc/clickhouse-server/config.d/zookeeper_fault_injection.xml.tmp /etc/clickhouse-server/config.d/zookeeper_fault_injection.xml
+ echo 'ASAN_OPTIONS='\''malloc_context_size=10 verbosity=1 allocator_release_to_os_interval_ms=10000'\'''
+ export 'ASAN_OPTIONS=malloc_context_size=10 allocator_release_to_os_interval_ms=10000'
+ ASAN_OPTIONS='malloc_context_size=10 allocator_release_to_os_interval_ms=10000'
+ sudo chown root: /var/lib/clickhouse
+ local total_mem
++ awk '/MemTotal/ { print $(NF-1) }' /proc/meminfo
+ total_mem=32086440
+ total_mem=32856514560
+ max_server_memory_usage_to_ram_ratio=0.5
+ echo 'Setting max_server_memory_usage_to_ram_ratio to 0.5'
+ cat
Setting max_server_memory_usage_to_ram_ratio to 0.5
+ local max_users_mem
+ max_users_mem=9856954368
+ echo 'Setting max_memory_usage_for_user=9856954368 and max_memory_usage for queries to 10G'
+ cat
Setting max_memory_usage_for_user=9856954368 and max_memory_usage for queries to 10G
+ cat
+ [[ '' == \1 ]]
+ [[ '' == \1 ]]
+ sudo cat /etc/clickhouse-server/config.d/logger_trace.xml
+ sed 's|trace|test|'
+ mv /etc/clickhouse-server/config.d/logger_trace.xml.tmp /etc/clickhouse-server/config.d/logger_trace.xml
+ '[' SLRU = SLRU ']'
+ sudo cat /etc/clickhouse-server/config.d/storage_conf.xml
+ sed 's|LRU|SLRU|'
+ mv /etc/clickhouse-server/config.d/storage_conf.xml.tmp /etc/clickhouse-server/config.d/storage_conf.xml
++ date +%-d
+ '[' 1 -eq 1 ']'
+ sudo echo 'true'
+ start_server
+ counter=0
+ max_attempt=120
+ clickhouse-client --query 'SELECT 1'
Code: 210. DB::NetException: Connection refused (localhost:9000). (NETWORK_ERROR)
+ '[' 0 -gt 120 ']'
+ clickhouse start --user root
+ sleep 0.5
+ counter=1
+ clickhouse-client --query 'SELECT 1'
Code: 210. DB::NetException: Connection refused (localhost:9000). (NETWORK_ERROR)
+ '[' 1 -gt 120 ']'
+ clickhouse start --user root
+ sleep 0.5
+ counter=2
+ clickhouse-client --query 'SELECT 1'
Code: 210. DB::NetException: Connection refused (localhost:9000). (NETWORK_ERROR)
+ '[' 2 -gt 120 ']'
+ clickhouse start --user root
+ sleep 0.5
+ counter=3
+ clickhouse-client --query 'SELECT 1'
Code: 210. DB::NetException: Connection refused (localhost:9000). (NETWORK_ERROR)
+ '[' 3 -gt 120 ']'
+ clickhouse start --user root
+ sleep 0.5
+ counter=4
+ clickhouse-client --query 'SELECT 1'
Code: 210. DB::NetException: Connection refused (localhost:9000). (NETWORK_ERROR)
+ '[' 4 -gt 120 ']'
+ clickhouse start --user root
+ sleep 0.5
+ counter=5
+ clickhouse-client --query 'SELECT 1'
Code: 210. DB::NetException: Connection refused (localhost:9000). (NETWORK_ERROR)
+ '[' 5 -gt 120 ']'
+ clickhouse start --user root
+ sleep 0.5
+ counter=6
+ clickhouse-client --query 'SELECT 1'
Code: 210. DB::NetException: Connection refused (localhost:9000). (NETWORK_ERROR)
+ '[' 6 -gt 120 ']'
+ clickhouse start --user root
+ sleep 0.5
+ counter=7
+ clickhouse-client --query 'SELECT 1'
Code: 210. DB::NetException: Connection refused (localhost:9000). (NETWORK_ERROR)
+ '[' 7 -gt 120 ']'
+ clickhouse start --user root
+ sleep 0.5
+ counter=8
+ clickhouse-client --query 'SELECT 1'
Code: 210. DB::NetException: Connection refused (localhost:9000). (NETWORK_ERROR)
+ '[' 8 -gt 120 ']'
+ clickhouse start --user root
+ sleep 0.5
+ counter=9
+ clickhouse-client --query 'SELECT 1'
Code: 210. DB::NetException: Connection refused (localhost:9000). (NETWORK_ERROR)
+ '[' 9 -gt 120 ']'
+ clickhouse start --user root
+ sleep 0.5
+ counter=10
+ clickhouse-client --query 'SELECT 1'
Code: 210. DB::NetException: Connection refused (localhost:9000). (NETWORK_ERROR)
+ '[' 10 -gt 120 ']'
+ clickhouse start --user root
+ sleep 0.5
+ counter=11
+ clickhouse-client --query 'SELECT 1'
Code: 210. DB::NetException: Connection refused (localhost:9000). (NETWORK_ERROR)
+ '[' 11 -gt 120 ']'
+ clickhouse start --user root
+ sleep 0.5
+ counter=12
+ clickhouse-client --query 'SELECT 1'
Code: 210. DB::NetException: Connection refused (localhost:9000). (NETWORK_ERROR)
+ '[' 12 -gt 120 ']'
+ clickhouse start --user root
+ sleep 0.5
+ counter=13
+ clickhouse-client --query 'SELECT 1'
1
+ attach_gdb_to_clickhouse
++ clickhouse local --query 'SELECT count() FROM system.build_options WHERE name = '\''CXX_FLAGS'\'' AND position('\''sanitize=address'\'' IN value)'
+ IS_ASAN=0
+ [[ 0 = \1 ]]
++ kill -l SIGRTMIN
+ RTMIN=34
+ echo '
set follow-fork-mode parent
handle SIGHUP nostop noprint pass
handle SIGINT nostop noprint pass
handle SIGQUIT nostop noprint pass
handle SIGPIPE nostop noprint pass
handle SIGTERM nostop noprint pass
handle SIGUSR1 nostop noprint pass
handle SIGUSR2 nostop noprint pass
handle SIG34 nostop noprint pass
info signals
# safeExit is called if graceful shutdown times out. Print stack traces in that case.
break safeExit
continue
backtrace full
info registers
p top' 1 KiB of the 'stack:
p/x *(uint64_t[128]*)$sp
maintenance info sections
thread apply all backtrace full
disassemble /s
up
disassemble /s
up
disassemble /s
p "done"
detach
quit
'
+ sleep 5
+ ts '%Y-%m-%d %H:%M:%S'
++ cat /var/run/clickhouse-server/clickhouse-server.pid
+ gdb -batch -command script.gdb -p 2748
aarch64-binfmt-P: Could not open '/lib/ld-linux-aarch64.so.1': No such file or directory
+ run_with_retry 60 clickhouse-client --query 'SELECT '\''Connected to clickhouse-server after attaching gdb'\'''
+ local retries=60
+ shift
+ local retry=0
+ '[' 0 -ge 60 ']'
+ clickhouse-client --query 'SELECT '\''Connected to clickhouse-server after attaching gdb'\'''
Connected to clickhouse-server after attaching gdb
+ return
+ cd /repo/tests/
+ python3 /repo/tests/ci/stress.py --hung-check --drop-databases --output-folder /test_output --skip-func-tests '' --global-time-limit 1200
2026-09-21 01:26:16,731 Run func tests '/usr/bin/clickhouse-test --client-option optimize_trivial_approximate_count_query=1 ignore_drop_queries_probability=0.2 --global_time_limit=1200 '
2026-09-21 01:26:17,233 Run func tests '/usr/bin/clickhouse-test --order=random --database=test_1 --client-option join_use_nulls=1 join_algorithm='parallel_hash' memory_tracker_fault_probability=0.001 merge_tree_read_split_ranges_into_intersecting_and_non_intersecting_injection_probability=0.05 group_by_use_nulls=1 ignore_drop_queries_probability=0.2 --global_time_limit=1200 '
2026-09-21 01:26:17,734 Run func tests '/usr/bin/clickhouse-test --order=random --db-engine="Replicated('/test/db/test_2', 's1', 'r1')" --client-option enable_deflate_qpl_codec=1 enable_zstd_qat_codec=1 use_query_cache=1 query_cache_nondeterministic_function_handling='ignore' query_cache_system_table_handling='ignore' ignore_drop_queries_probability=0.2 --global_time_limit=1200 '
2026-09-21 01:26:18,236 Run func tests '/usr/bin/clickhouse-test --order=random --database=test_3 --client-option join_algorithm='partial_merge' group_by_use_nulls=1 ignore_drop_queries_probability=0.2 --global_time_limit=1200 '
2026-09-21 01:26:18,737 Run func tests '/usr/bin/clickhouse-test --order=random --client-option join_use_nulls=1 ignore_drop_queries_probability=0.2 --global_time_limit=1200 '
2026-09-21 01:26:19,238 Run func tests '/usr/bin/clickhouse-test --order=random --db-engine="Replicated('/test/db/test_5', 's1', 'r1')" --database=test_5 --client-option enable_deflate_qpl_codec=1 enable_zstd_qat_codec=1 join_algorithm='full_sorting_merge' use_query_cache=1 query_cache_nondeterministic_function_handling='ignore' query_cache_system_table_handling='ignore' group_by_use_nulls=1 http_make_head_request=1 ignore_drop_queries_probability=0.2 --global_time_limit=1200 '
2026-09-21 01:26:19,739 Run func tests '/usr/bin/clickhouse-test --order=random --client-option use_query_cache=1 query_cache_nondeterministic_function_handling='ignore' query_cache_system_table_handling='ignore' memory_tracker_fault_probability=0.001 merge_tree_read_split_ranges_into_intersecting_and_non_intersecting_injection_probability=0.05 ignore_drop_queries_probability=0.2 --global_time_limit=1200 '
2026-09-21 01:26:20,241 Run func tests '/usr/bin/clickhouse-test --order=random --database=test_7 --client-option join_use_nulls=1 join_algorithm='grace_hash' group_by_use_nulls=1 ignore_drop_queries_probability=0.2 enable_parallel_replicas=1 max_parallel_replicas=3 cluster_for_parallel_replicas='parallel_replicas' parallel_replicas_for_non_replicated_merge_tree=1 --global_time_limit=1200 '
2026-09-21 01:26:20,742 Run func tests '/usr/bin/clickhouse-test --order=random --db-engine="Replicated('/test/db/test_8', 's1', 'r1')" --client-option enable_deflate_qpl_codec=1 enable_zstd_qat_codec=1 ignore_drop_queries_probability=0.2 --global_time_limit=1200 '
2026-09-21 01:26:21,243 Run func tests '/usr/bin/clickhouse-test --order=random --database=test_9 --client-option join_algorithm='auto' max_rows_in_join=1000 use_query_cache=1 query_cache_nondeterministic_function_handling='ignore' query_cache_system_table_handling='ignore' group_by_use_nulls=1 ignore_drop_queries_probability=0.2 --global_time_limit=1200 '
2026-09-21 01:26:21,745 Run func tests '/usr/bin/clickhouse-test --order=random --client-option join_use_nulls=1 ignore_drop_queries_probability=0.2 --global_time_limit=1200 '
2026-09-21 01:26:22,245 Run func tests '/usr/bin/clickhouse-test --order=random --db-engine="Replicated('/test/db/test_11', 's1', 'r1')" --database=test_11 --client-option enable_deflate_qpl_codec=1 enable_zstd_qat_codec=1 join_algorithm='parallel_hash' use_query_cache=1 query_cache_nondeterministic_function_handling='ignore' query_cache_system_table_handling='ignore' memory_tracker_fault_probability=0.001 merge_tree_read_split_ranges_into_intersecting_and_non_intersecting_injection_probability=0.05 group_by_use_nulls=1 ignore_drop_queries_probability=0.2 --global_time_limit=1200 '
2026-09-21 01:26:22,747 Run func tests '/usr/bin/clickhouse-test --order=random --client-option use_query_cache=1 query_cache_nondeterministic_function_handling='ignore' query_cache_system_table_handling='ignore' implicit_transaction=1 throw_on_unsupported_query_inside_transaction=0 http_make_head_request=1 ignore_drop_queries_probability=0.2 --global_time_limit=1200 '
2026-09-21 01:26:23,248 Run func tests '/usr/bin/clickhouse-test --order=random --database=test_13 --client-option join_use_nulls=1 join_algorithm='partial_merge' use_query_cache=1 query_cache_nondeterministic_function_handling='ignore' query_cache_system_table_handling='ignore' group_by_use_nulls=1 ignore_drop_queries_probability=0.2 enable_parallel_replicas=1 max_parallel_replicas=3 cluster_for_parallel_replicas='parallel_replicas' parallel_replicas_for_non_replicated_merge_tree=1 --global_time_limit=1200 '
2026-09-21 01:26:23,750 Run func tests '/usr/bin/clickhouse-test --order=random --db-engine="Replicated('/test/db/test_14', 's1', 'r1')" --client-option enable_deflate_qpl_codec=1 enable_zstd_qat_codec=1 use_query_cache=1 query_cache_nondeterministic_function_handling='ignore' query_cache_system_table_handling='ignore' ignore_drop_queries_probability=0.2 --global_time_limit=1200 '
2026-09-21 01:26:24,251 Run func tests '/usr/bin/clickhouse-test --order=random --database=test_15 --client-option join_algorithm='full_sorting_merge' group_by_use_nulls=1 ignore_drop_queries_probability=0.2 --global_time_limit=1200 '
2026-09-21 01:26:24,752 Will wait functests to finish
2026-09-21 01:26:24,753 Finished 0 from 16 processes
2026-09-21 01:26:29,757 Finished 0 from 16 processes
2026-09-21 01:26:34,761 Finished 0 from 16 processes
2026-09-21 01:26:39,765 Finished 0 from 16 processes
2026-09-21 01:26:44,769 Finished 0 from 16 processes
2026-09-21 01:26:49,773 Finished 0 from 16 processes
2026-09-21 01:26:54,777 Finished 0 from 16 processes
2026-09-21 01:26:59,781 Finished 0 from 16 processes
2026-09-21 01:27:04,785 Finished 0 from 16 processes
2026-09-21 01:27:09,789 Finished 0 from 16 processes
2026-09-21 01:27:14,793 Finished 0 from 16 processes
2026-09-21 01:27:19,798 Finished 0 from 16 processes
2026-09-21 01:27:24,801 Finished 0 from 16 processes
2026-09-21 01:27:29,805 Finished 0 from 16 processes
2026-09-21 01:27:34,809 Finished 0 from 16 processes
2026-09-21 01:27:39,813 Finished 0 from 16 processes
2026-09-21 01:27:44,817 Finished 0 from 16 processes
2026-09-21 01:27:49,821 Finished 0 from 16 processes
2026-09-21 01:27:54,825 Finished 0 from 16 processes
2026-09-21 01:27:59,829 Finished 0 from 16 processes
2026-09-21 01:28:04,831 Finished 0 from 16 processes
2026-09-21 01:28:09,833 Finished 0 from 16 processes
2026-09-21 01:28:14,837 Finished 0 from 16 processes
2026-09-21 01:28:19,841 Finished 0 from 16 processes
2026-09-21 01:28:24,845 Finished 0 from 16 processes
2026-09-21 01:28:29,849 Finished 0 from 16 processes
2026-09-21 01:28:34,853 Finished 0 from 16 processes
2026-09-21 01:28:39,858 Finished 0 from 16 processes
2026-09-21 01:28:44,861 Finished 0 from 16 processes
2026-09-21 01:28:49,865 Finished 0 from 16 processes
2026-09-21 01:28:54,869 Finished 0 from 16 processes
2026-09-21 01:28:59,873 Finished 0 from 16 processes
2026-09-21 01:29:04,877 Finished 0 from 16 processes
2026-09-21 01:29:09,882 Finished 0 from 16 processes
2026-09-21 01:29:14,885 Finished 0 from 16 processes
2026-09-21 01:29:19,889 Finished 0 from 16 processes
2026-09-21 01:29:24,893 Finished 0 from 16 processes
2026-09-21 01:29:29,897 Finished 0 from 16 processes
2026-09-21 01:29:34,901 Finished 0 from 16 processes
2026-09-21 01:29:39,905 Finished 0 from 16 processes
2026-09-21 01:29:44,909 Finished 0 from 16 processes
2026-09-21 01:29:49,913 Finished 0 from 16 processes
2026-09-21 01:29:54,917 Finished 0 from 16 processes
2026-09-21 01:29:59,921 Finished 0 from 16 processes
2026-09-21 01:30:04,926 Finished 0 from 16 processes
2026-09-21 01:30:09,929 Finished 0 from 16 processes
2026-09-21 01:30:14,933 Finished 0 from 16 processes
2026-09-21 01:30:19,938 Finished 0 from 16 processes
2026-09-21 01:30:24,941 Finished 0 from 16 processes
2026-09-21 01:30:29,947 Finished 0 from 16 processes
2026-09-21 01:30:34,949 Finished 0 from 16 processes
2026-09-21 01:30:39,953 Finished 0 from 16 processes
2026-09-21 01:30:44,957 Finished 0 from 16 processes
2026-09-21 01:30:49,961 Finished 0 from 16 processes
2026-09-21 01:30:54,962 Finished 0 from 16 processes
2026-09-21 01:30:59,971 Finished 0 from 16 processes
2026-09-21 01:31:04,973 Finished 0 from 16 processes
2026-09-21 01:31:09,977 Finished 0 from 16 processes
2026-09-21 01:31:14,978 Finished 0 from 16 processes
2026-09-21 01:31:19,983 Finished 0 from 16 processes
2026-09-21 01:31:24,985 Finished 0 from 16 processes
2026-09-21 01:31:29,989 Finished 0 from 16 processes
2026-09-21 01:31:34,993 Finished 0 from 16 processes
2026-09-21 01:31:39,997 Finished 0 from 16 processes
2026-09-21 01:31:45,001 Finished 0 from 16 processes
2026-09-21 01:31:50,005 Finished 0 from 16 processes
2026-09-21 01:31:55,009 Finished 0 from 16 processes
2026-09-21 01:32:00,013 Finished 0 from 16 processes
2026-09-21 01:32:05,017 Finished 0 from 16 processes
2026-09-21 01:32:10,021 Finished 0 from 16 processes
2026-09-21 01:32:15,025 Finished 1 from 16 processes
2026-09-21 01:32:20,029 Finished 1 from 16 processes
2026-09-21 01:32:25,033 Finished 1 from 16 processes
2026-09-21 01:32:30,038 Finished 1 from 16 processes
2026-09-21 01:32:35,041 Finished 1 from 16 processes
2026-09-21 01:32:40,045 Finished 1 from 16 processes
2026-09-21 01:32:45,049 Finished 1 from 16 processes
2026-09-21 01:32:50,053 Finished 1 from 16 processes
2026-09-21 01:32:55,057 Finished 1 from 16 processes
2026-09-21 01:33:00,061 Finished 1 from 16 processes
2026-09-21 01:33:05,065 Finished 1 from 16 processes
2026-09-21 01:33:10,069 Finished 1 from 16 processes
2026-09-21 01:33:15,073 Finished 1 from 16 processes
2026-09-21 01:33:20,077 Finished 1 from 16 processes
2026-09-21 01:33:25,081 Finished 1 from 16 processes
2026-09-21 01:33:30,085 Finished 1 from 16 processes
2026-09-21 01:33:35,089 Finished 1 from 16 processes
2026-09-21 01:33:40,093 Finished 1 from 16 processes
2026-09-21 01:33:45,097 Finished 1 from 16 processes
2026-09-21 01:33:50,101 Finished 1 from 16 processes
2026-09-21 01:33:55,105 Finished 1 from 16 processes
2026-09-21 01:34:00,109 Finished 1 from 16 processes
2026-09-21 01:34:05,113 Finished 1 from 16 processes
2026-09-21 01:34:10,117 Finished 1 from 16 processes
2026-09-21 01:34:15,121 Finished 1 from 16 processes
2026-09-21 01:34:20,125 Finished 1 from 16 processes
2026-09-21 01:34:25,129 Finished 1 from 16 processes
2026-09-21 01:34:30,133 Finished 1 from 16 processes
2026-09-21 01:34:35,137 Finished 1 from 16 processes
2026-09-21 01:34:40,141 Finished 1 from 16 processes
2026-09-21 01:34:45,145 Finished 1 from 16 processes
2026-09-21 01:34:50,149 Finished 1 from 16 processes
2026-09-21 01:34:55,153 Finished 1 from 16 processes
2026-09-21 01:35:00,157 Finished 1 from 16 processes
2026-09-21 01:35:05,161 Finished 1 from 16 processes
2026-09-21 01:35:10,165 Finished 1 from 16 processes
2026-09-21 01:35:15,169 Finished 1 from 16 processes
2026-09-21 01:35:20,173 Finished 1 from 16 processes
2026-09-21 01:35:25,177 Finished 1 from 16 processes
2026-09-21 01:35:30,181 Finished 1 from 16 processes
2026-09-21 01:35:35,185 Finished 1 from 16 processes
2026-09-21 01:35:40,189 Finished 1 from 16 processes
2026-09-21 01:35:45,193 Finished 1 from 16 processes
2026-09-21 01:35:50,197 Finished 1 from 16 processes
2026-09-21 01:35:55,198 Finished 1 from 16 processes
2026-09-21 01:36:00,203 Finished 1 from 16 processes
2026-09-21 01:36:05,205 Finished 1 from 16 processes
2026-09-21 01:36:10,209 Finished 1 from 16 processes
2026-09-21 01:36:15,213 Finished 1 from 16 processes
2026-09-21 01:36:20,217 Finished 1 from 16 processes
2026-09-21 01:36:25,221 Finished 1 from 16 processes
2026-09-21 01:36:30,225 Finished 1 from 16 processes
2026-09-21 01:36:35,229 Finished 1 from 16 processes
2026-09-21 01:36:40,233 Finished 1 from 16 processes
2026-09-21 01:36:45,237 Finished 1 from 16 processes
2026-09-21 01:36:50,241 Finished 1 from 16 processes
2026-09-21 01:36:55,245 Finished 1 from 16 processes
2026-09-21 01:37:00,249 Finished 1 from 16 processes
2026-09-21 01:37:05,252 Finished 1 from 16 processes
2026-09-21 01:37:10,257 Finished 1 from 16 processes
2026-09-21 01:37:15,261 Finished 1 from 16 processes
2026-09-21 01:37:20,265 Finished 1 from 16 processes
2026-09-21 01:37:25,270 Finished 1 from 16 processes
2026-09-21 01:37:30,273 Finished 1 from 16 processes
2026-09-21 01:37:35,277 Finished 1 from 16 processes
2026-09-21 01:37:40,281 Finished 1 from 16 processes
2026-09-21 01:37:45,285 Finished 1 from 16 processes
2026-09-21 01:37:50,289 Finished 1 from 16 processes
2026-09-21 01:37:55,293 Finished 1 from 16 processes
2026-09-21 01:38:00,297 Finished 1 from 16 processes
2026-09-21 01:38:05,301 Finished 1 from 16 processes
2026-09-21 01:38:10,305 Finished 1 from 16 processes
2026-09-21 01:38:15,309 Finished 1 from 16 processes
2026-09-21 01:38:20,313 Finished 1 from 16 processes
2026-09-21 01:38:25,317 Finished 1 from 16 processes
2026-09-21 01:38:30,321 Finished 1 from 16 processes
2026-09-21 01:38:35,325 Finished 1 from 16 processes
2026-09-21 01:38:40,329 Finished 1 from 16 processes
2026-09-21 01:38:45,333 Finished 1 from 16 processes
2026-09-21 01:38:50,339 Finished 1 from 16 processes
2026-09-21 01:38:55,342 Finished 1 from 16 processes
2026-09-21 01:39:00,343 Finished 1 from 16 processes
2026-09-21 01:39:05,345 Finished 1 from 16 processes
2026-09-21 01:39:10,350 Finished 1 from 16 processes
2026-09-21 01:39:15,353 Finished 1 from 16 processes
2026-09-21 01:39:20,357 Finished 1 from 16 processes
2026-09-21 01:39:25,361 Finished 1 from 16 processes
2026-09-21 01:39:30,365 Finished 1 from 16 processes
2026-09-21 01:39:35,369 Finished 1 from 16 processes
2026-09-21 01:39:40,371 Finished 1 from 16 processes
2026-09-21 01:39:45,373 Finished 1 from 16 processes
2026-09-21 01:39:50,377 Finished 1 from 16 processes
2026-09-21 01:39:55,381 Finished 1 from 16 processes
2026-09-21 01:40:00,385 Finished 1 from 16 processes
2026-09-21 01:40:05,389 Finished 1 from 16 processes
2026-09-21 01:40:10,393 Finished 1 from 16 processes
2026-09-21 01:40:15,397 Finished 1 from 16 processes
2026-09-21 01:40:20,401 Finished 1 from 16 processes
2026-09-21 01:40:25,405 Finished 1 from 16 processes
2026-09-21 01:40:30,409 Finished 1 from 16 processes
2026-09-21 01:40:35,413 Finished 1 from 16 processes
2026-09-21 01:40:40,417 Finished 1 from 16 processes
2026-09-21 01:40:45,421 Finished 1 from 16 processes
2026-09-21 01:40:50,425 Finished 1 from 16 processes
2026-09-21 01:40:55,429 Finished 1 from 16 processes
2026-09-21 01:41:00,433 Finished 1 from 16 processes
2026-09-21 01:41:05,437 Finished 1 from 16 processes
2026-09-21 01:41:10,441 Finished 1 from 16 processes
2026-09-21 01:41:15,445 Finished 1 from 16 processes
2026-09-21 01:41:20,449 Finished 1 from 16 processes
2026-09-21 01:41:25,453 Finished 1 from 16 processes
2026-09-21 01:41:30,457 Finished 1 from 16 processes
2026-09-21 01:41:35,461 Finished 1 from 16 processes
2026-09-21 01:41:40,465 Finished 1 from 16 processes
2026-09-21 01:41:45,469 Finished 1 from 16 processes
2026-09-21 01:41:50,473 Finished 1 from 16 processes
2026-09-21 01:41:55,477 Finished 1 from 16 processes
2026-09-21 01:42:00,481 Finished 1 from 16 processes
2026-09-21 01:42:05,485 Finished 1 from 16 processes
2026-09-21 01:42:10,489 Finished 1 from 16 processes
2026-09-21 01:42:15,493 Finished 1 from 16 processes
2026-09-21 01:42:20,497 Finished 1 from 16 processes
2026-09-21 01:42:25,503 Finished 1 from 16 processes
2026-09-21 01:42:30,505 Finished 1 from 16 processes
2026-09-21 01:42:35,509 Finished 1 from 16 processes
2026-09-21 01:42:40,513 Finished 1 from 16 processes
2026-09-21 01:42:45,517 Finished 1 from 16 processes
2026-09-21 01:42:50,521 Finished 1 from 16 processes
2026-09-21 01:42:55,525 Finished 1 from 16 processes
2026-09-21 01:43:00,529 Finished 1 from 16 processes
2026-09-21 01:43:05,533 Finished 1 from 16 processes
2026-09-21 01:43:10,537 Finished 1 from 16 processes
2026-09-21 01:43:15,541 Finished 1 from 16 processes
2026-09-21 01:43:20,545 Finished 1 from 16 processes
2026-09-21 01:43:25,549 Finished 1 from 16 processes
2026-09-21 01:43:30,554 Finished 1 from 16 processes
2026-09-21 01:43:35,557 Finished 1 from 16 processes
2026-09-21 01:43:40,561 Finished 1 from 16 processes
2026-09-21 01:43:45,565 Finished 1 from 16 processes
2026-09-21 01:43:50,570 Finished 1 from 16 processes
2026-09-21 01:43:55,573 Finished 1 from 16 processes
2026-09-21 01:44:00,577 Finished 1 from 16 processes
2026-09-21 01:44:05,581 Finished 1 from 16 processes
2026-09-21 01:44:10,585 Finished 1 from 16 processes
2026-09-21 01:44:15,591 Finished 1 from 16 processes
2026-09-21 01:44:20,593 Finished 1 from 16 processes
2026-09-21 01:44:25,597 Finished 1 from 16 processes
2026-09-21 01:44:30,601 Finished 1 from 16 processes
2026-09-21 01:44:35,605 Finished 1 from 16 processes
2026-09-21 01:44:40,609 Finished 1 from 16 processes
2026-09-21 01:44:45,613 Finished 1 from 16 processes
2026-09-21 01:44:50,617 Finished 1 from 16 processes
2026-09-21 01:44:55,621 Finished 1 from 16 processes
2026-09-21 01:45:00,625 Finished 1 from 16 processes
2026-09-21 01:45:05,629 Finished 1 from 16 processes
2026-09-21 01:45:10,635 Finished 1 from 16 processes
2026-09-21 01:45:15,638 Finished 1 from 16 processes
2026-09-21 01:45:20,641 Finished 1 from 16 processes
2026-09-21 01:45:25,645 Finished 1 from 16 processes
2026-09-21 01:45:30,649 Finished 1 from 16 processes
2026-09-21 01:45:35,653 Finished 1 from 16 processes
2026-09-21 01:45:40,657 Finished 1 from 16 processes
2026-09-21 01:45:45,661 Finished 1 from 16 processes
2026-09-21 01:45:50,667 Finished 1 from 16 processes
2026-09-21 01:45:55,669 Finished 1 from 16 processes
2026-09-21 01:46:00,673 Finished 1 from 16 processes
2026-09-21 01:46:05,677 Finished 1 from 16 processes
2026-09-21 01:46:10,681 Finished 1 from 16 processes
2026-09-21 01:46:15,685 Finished 1 from 16 processes
2026-09-21 01:46:20,689 Finished 2 from 16 processes
2026-09-21 01:46:25,693 Finished 4 from 16 processes
2026-09-21 01:46:30,697 Finished 6 from 16 processes
2026-09-21 01:46:35,701 Finished 8 from 16 processes
2026-09-21 01:46:40,707 Finished 9 from 16 processes
2026-09-21 01:46:45,707 Finished 10 from 16 processes
2026-09-21 01:46:50,709 Finished 11 from 16 processes
2026-09-21 01:46:55,713 Finished 11 from 16 processes
2026-09-21 01:47:00,715 Finished 12 from 16 processes
2026-09-21 01:47:05,717 Finished 12 from 16 processes
2026-09-21 01:47:10,723 Finished 12 from 16 processes
2026-09-21 01:47:15,728 Finished 12 from 16 processes
2026-09-21 01:47:20,729 Finished 12 from 16 processes
2026-09-21 01:47:25,734 Finished 13 from 16 processes
2026-09-21 01:47:30,739 Finished 13 from 16 processes
2026-09-21 01:47:35,744 Finished 13 from 16 processes
2026-09-21 01:47:40,749 Finished 13 from 16 processes
2026-09-21 01:47:45,755 Finished 14 from 16 processes
2026-09-21 01:47:50,760 Finished 14 from 16 processes
2026-09-21 01:47:55,762 Finished 14 from 16 processes
2026-09-21 01:48:00,767 Finished 14 from 16 processes
2026-09-21 01:48:05,772 Finished 14 from 16 processes
2026-09-21 01:48:10,774 Finished 14 from 16 processes
2026-09-21 01:48:15,780 Finished 14 from 16 processes
2026-09-21 01:48:20,785 Finished 14 from 16 processes
2026-09-21 01:48:25,790 Finished 14 from 16 processes
2026-09-21 01:48:30,795 Finished 14 from 16 processes
2026-09-21 01:48:35,800 Finished 14 from 16 processes
2026-09-21 01:48:40,803 Finished 14 from 16 processes
2026-09-21 01:48:45,804 Finished 14 from 16 processes
2026-09-21 01:48:50,809 Finished 14 from 16 processes
2026-09-21 01:48:55,814 Finished 14 from 16 processes
2026-09-21 01:49:00,820 Finished 14 from 16 processes
2026-09-21 01:49:05,825 Finished 14 from 16 processes
2026-09-21 01:49:10,829 Finished 14 from 16 processes
2026-09-21 01:49:15,832 Finished 14 from 16 processes
2026-09-21 01:49:20,837 Finished 14 from 16 processes
2026-09-21 01:49:25,843 Finished 15 from 16 processes
2026-09-21 01:49:30,845 Finished 15 from 16 processes
2026-09-21 01:49:35,851 Finished 15 from 16 processes
2026-09-21 01:49:40,852 Finished 15 from 16 processes
2026-09-21 01:49:45,857 Finished 15 from 16 processes
2026-09-21 01:49:50,861 Finished 15 from 16 processes
2026-09-21 01:49:55,867 Finished 15 from 16 processes
2026-09-21 01:50:00,872 Finished 15 from 16 processes
2026-09-21 01:50:05,875 Finished 15 from 16 processes
2026-09-21 01:50:10,880 Finished 15 from 16 processes
2026-09-21 01:50:15,886 Finished 15 from 16 processes
2026-09-21 01:50:20,887 Finished 15 from 16 processes
2026-09-21 01:50:25,889 Finished 15 from 16 processes
2026-09-21 01:50:30,895 Finished 15 from 16 processes
2026-09-21 01:50:35,900 Finished 15 from 16 processes
2026-09-21 01:50:40,904 Finished 15 from 16 processes
2026-09-21 01:50:45,909 Finished 15 from 16 processes
2026-09-21 01:50:50,913 Finished 15 from 16 processes
2026-09-21 01:50:55,916 Finished 15 from 16 processes
2026-09-21 01:51:00,919 Finished 15 from 16 processes
2026-09-21 01:51:05,923 Finished 15 from 16 processes
2026-09-21 01:51:10,928 Finished 15 from 16 processes
2026-09-21 01:51:15,929 Finished 15 from 16 processes
2026-09-21 01:51:20,934 Finished 15 from 16 processes
2026-09-21 01:51:25,937 Finished 15 from 16 processes
2026-09-21 01:51:30,938 Finished 15 from 16 processes
2026-09-21 01:51:35,943 Finished 15 from 16 processes
2026-09-21 01:51:40,944 Finished 15 from 16 processes
2026-09-21 01:51:45,950 Finished 15 from 16 processes
2026-09-21 01:51:50,953 Finished 15 from 16 processes
2026-09-21 01:51:55,959 Finished 15 from 16 processes
2026-09-21 01:52:00,962 Finished 15 from 16 processes
2026-09-21 01:52:05,966 Finished 15 from 16 processes
2026-09-21 01:52:10,971 Finished 15 from 16 processes
2026-09-21 01:52:15,977 Finished 15 from 16 processes
2026-09-21 01:52:20,981 Finished 15 from 16 processes
2026-09-21 01:52:25,986 Finished 15 from 16 processes
2026-09-21 01:52:30,989 Finished 15 from 16 processes
2026-09-21 01:52:35,995 Finished 15 from 16 processes
2026-09-21 01:52:41,000 Finished 15 from 16 processes
2026-09-21 01:52:46,005 Finished 15 from 16 processes
2026-09-21 01:52:51,009 Finished 15 from 16 processes
2026-09-21 01:52:56,011 Finished 15 from 16 processes
2026-09-21 01:53:01,017 Finished 15 from 16 processes
2026-09-21 01:53:06,021 Finished 15 from 16 processes
2026-09-21 01:53:11,027 Finished 15 from 16 processes
2026-09-21 01:53:16,032 Finished 15 from 16 processes
2026-09-21 01:53:21,037 Finished 15 from 16 processes
2026-09-21 01:53:26,042 Finished 15 from 16 processes
2026-09-21 01:53:31,044 Finished 15 from 16 processes
2026-09-21 01:53:36,049 Finished 15 from 16 processes
2026-09-21 01:53:41,054 Finished 15 from 16 processes
2026-09-21 01:53:46,055 Finished 15 from 16 processes
2026-09-21 01:53:51,057 Finished 15 from 16 processes
2026-09-21 01:53:56,062 Finished 15 from 16 processes
2026-09-21 01:54:01,065 Finished 15 from 16 processes
2026-09-21 01:54:06,071 Finished 15 from 16 processes
2026-09-21 01:54:11,076 Finished 15 from 16 processes
2026-09-21 01:54:16,077 Finished 15 from 16 processes
2026-09-21 01:54:21,083 Finished 15 from 16 processes
2026-09-21 01:54:26,088 Finished 15 from 16 processes
2026-09-21 01:54:31,089 All processes finished
2026-09-21 01:54:31,089 Compressing stress logs
2026-09-21 01:54:31,115 Logs compressed
2026-09-21 01:54:31,115 Will terminate gdb (if any)
2026-09-21 01:54:31,115 Running command: kill -TERM $(pidof gdb)
/bin/sh: 1: kill: Usage: kill [-s sigspec | -signum | -sigspec] [pid | job]... or
kill -l [exitstatus]
2026-09-21 01:54:31,119 Command returned 2, retrying
/bin/sh: 1: kill: Usage: kill [-s sigspec | -signum | -sigspec] [pid | job]... or
kill -l [exitstatus]
2026-09-21 01:54:31,122 Command returned 2, retrying
/bin/sh: 1: kill: Usage: kill [-s sigspec | -signum | -sigspec] [pid | job]... or
kill -l [exitstatus]
2026-09-21 01:54:32,127 Command returned 2, retrying
/bin/sh: 1: kill: Usage: kill [-s sigspec | -signum | -sigspec] [pid | job]... or
kill -l [exitstatus]
2026-09-21 01:54:34,133 Command returned 2, retrying
/bin/sh: 1: kill: Usage: kill [-s sigspec | -signum | -sigspec] [pid | job]... or
kill -l [exitstatus]
2026-09-21 01:54:37,138 Command returned 2, retrying
2026-09-21 01:54:41,142 Running command: timeout 50s tail --pid=$(pidof gdb) -f /dev/null || kill -9 $(pidof gdb) ||:
tail: invalid PID: ‘’
/bin/sh: 1: kill: Usage: kill [-s sigspec | -signum | -sigspec] [pid | job]... or
kill -l [exitstatus]
2026-09-21 01:54:41,152 Running command: kill -CONT $(cat /var/run/clickhouse-server/clickhouse-server.pid) && clickhouse client -q 'SELECT 1 FORMAT Null'
2026-09-21 01:54:41,517 Running command: clickhouse client -q "SYSTEM STOP THREAD FUZZER" --max_untracked_memory=1Gi --memory_profiler_step=1Gi --max_memory_usage_for_user=0 --max_memory_usage_in_client=1000000000 --enable-progress-table-toggle=0
2026-09-21 01:54:41,982 Running command: clickhouse client -q "SYSTEM START MERGES" --max_untracked_memory=1Gi --memory_profiler_step=1Gi --max_memory_usage_for_user=0 --max_memory_usage_in_client=1000000000 --enable-progress-table-toggle=0
2026-09-21 01:54:42,348 Running command: clickhouse client -q "SYSTEM START DISTRIBUTED SENDS" --max_untracked_memory=1Gi --memory_profiler_step=1Gi --max_memory_usage_for_user=0 --max_memory_usage_in_client=1000000000 --enable-progress-table-toggle=0
2026-09-21 01:54:42,662 Running command: clickhouse client -q "SYSTEM START TTL MERGES" --max_untracked_memory=1Gi --memory_profiler_step=1Gi --max_memory_usage_for_user=0 --max_memory_usage_in_client=1000000000 --enable-progress-table-toggle=0
2026-09-21 01:54:43,028 Running command: clickhouse client -q "SYSTEM START MOVES" --max_untracked_memory=1Gi --memory_profiler_step=1Gi --max_memory_usage_for_user=0 --max_memory_usage_in_client=1000000000 --enable-progress-table-toggle=0
2026-09-21 01:54:43,393 Running command: clickhouse client -q "SYSTEM START FETCHES" --max_untracked_memory=1Gi --memory_profiler_step=1Gi --max_memory_usage_for_user=0 --max_memory_usage_in_client=1000000000 --enable-progress-table-toggle=0
2026-09-21 01:54:43,758 Running command: clickhouse client -q "SYSTEM START REPLICATED SENDS" --max_untracked_memory=1Gi --memory_profiler_step=1Gi --max_memory_usage_for_user=0 --max_memory_usage_in_client=1000000000 --enable-progress-table-toggle=0
2026-09-21 01:54:44,073 Running command: clickhouse client -q "SYSTEM START REPLICATION QUEUES" --max_untracked_memory=1Gi --memory_profiler_step=1Gi --max_memory_usage_for_user=0 --max_memory_usage_in_client=1000000000 --enable-progress-table-toggle=0
2026-09-21 01:54:44,388 Running command: clickhouse client -q "SYSTEM DROP MARK CACHE" --max_untracked_memory=1Gi --memory_profiler_step=1Gi --max_memory_usage_for_user=0 --max_memory_usage_in_client=1000000000 --enable-progress-table-toggle=0
2026-09-21 01:54:44,703 Running command: clickhouse client -q "KILL QUERY WHERE upper(query) LIKE 'WATCH %'" --max_untracked_memory=1Gi --memory_profiler_step=1Gi --max_memory_usage_for_user=0 --max_memory_usage_in_client=1000000000 --enable-progress-table-toggle=0
2026-09-21 01:54:45,118 Running command: clickhouse client -q "KILL QUERY WHERE query LIKE 'insert into tableB select %'" --max_untracked_memory=1Gi --memory_profiler_step=1Gi --max_memory_usage_for_user=0 --max_memory_usage_in_client=1000000000 --enable-progress-table-toggle=0
2026-09-21 01:54:45,533 Running command: clickhouse client -q "KILL QUERY WHERE query LIKE 'SELECT URL, uniq(SearchPhrase) AS u FROM test.hits GROUP BY URL ORDER BY u %'" --max_untracked_memory=1Gi --memory_profiler_step=1Gi --max_memory_usage_for_user=0 --max_memory_usage_in_client=1000000000 --enable-progress-table-toggle=0
2026-09-21 01:54:45,948 Running command: clickhouse client -q "KILL QUERY WHERE query LIKE 'SELECT (SELECT number FROM system.numbers WHERE number = 1000000000000)%'" --max_untracked_memory=1Gi --memory_profiler_step=1Gi --max_memory_usage_for_user=0 --max_memory_usage_in_client=1000000000 --enable-progress-table-toggle=0
Received exception from server (version 25.3.14):
Code: 159. DB::Exception: Received from localhost:9000. DB::Exception: Timeout exceeded: elapsed 60285.414182 ms, maximum: 60000 ms. (TIMEOUT_EXCEEDED)
(query: SELECT sleepEachRow((
SELECT maxOrDefault(300 - elapsed) + 1
FROM system.processes
WHERE query NOT LIKE '%FROM system.processes%' AND elapsed < 300
) / 300)
FROM numbers(300)
FORMAT Null
SETTINGS function_sleep_max_microseconds_per_block = 0
)
2026-09-21 01:55:48,343 Checking if some queries hung
Using queries from 'queries' directory
Connecting to ClickHouse server... OK
Connected to server 25.3.14.10001.altinitystable @ 07020f362800626e9ea95b3bc0c3b19c36cb4272 HEAD
Found 1 parallel tests and 0 sequential tests
Running about 1 stateless tests (Process-3).
00001_select_1: [ OK ]
1 tests passed. 0 tests skipped. 0.98 s elapsed (Process-3).
Checking the hung queries: done
No queries hung.
All tests have finished.
Top patterns of log messages:
count count_% size size_% uniq_loggers uniq_threads levels background_% message_format_string
1. 44081 0.064 9.03 MiB 0.08 1 131 ['Debug'] 0 (from {}{}{}){}{}{} {} (stage: {})
2. 42778 0.062 6.41 MiB 0.056 11329 129 ['Trace'] 1 {} Creating query context from {} context, user_id: {}, parent context user: {}
3. 38332 0.055 1.06 MiB 0.009 1 129 ['Debug'] 0 Processed in {} sec.
4. 35442 0.051 915.28 KiB 0.008 1 166 ['Trace'] 0 Query to stage {}{}
5. 35224 0.051 1.70 MiB 0.015 1 166 ['Trace'] 0 Query from stage {} to stage {}{}
6. 25037 0.036 1.94 MiB 0.017 1 105 ['Debug'] 0 Read {} rows, {} in {} sec., {} rows/sec., {}/sec.
7. 23540 0.034 1.03 MiB 0.009 1 3 ['Trace'] 1 Processing requests batch, size: {}, bytes: {}
8. 18049 0.026 488.82 KiB 0.004 1 165 ['Trace'] 0 Aggregation method: {}
9. 11469 0.017 540.22 KiB 0.005 11469 160 ['Debug'] 0.997 Authenticating user '{}' from {}
10. 11447 0.017 1.26 MiB 0.011 11447 160 ['Debug'] 0.997 {} Authenticated with global context as user {}
11. 11441 0.017 1.19 MiB 0.01 1 104 ['Debug'] 0 Converted aggregated data to blocks. {} rows, {} in {} sec. ({:.3f} rows/sec., {}/sec.)
12. 11441 0.017 402.22 KiB 0.003 1 104 ['Trace'] 0 Converting aggregated data to blocks
13. 11406 0.016 835.40 KiB 0.007 11406 129 ['Debug'] 1 Creating session context with user_id: {}
14. 11397 0.016 1001.69 KiB 0.009 11397 160 ['Debug'] 0.997 {} Logout, user_id: {}
15. 10520 0.015 1.32 MiB 0.012 1 95 ['Trace'] 0 No query result found for query {}
16. 9212 0.013 955.03 KiB 0.008 1 71 ['Trace'] 0.002 Checking existence of path: {}
17. 9167 0.013 343.47 KiB 0.003 1 143 ['Debug'] 0.134 {}{} memory usage: {}.
18. 8340 0.012 281.39 KiB 0.002 1 129 ['Trace'] 1 TCP Request. Address: {}
19. 8340 0.012 760.14 KiB 0.007 1 129 ['Debug'] 1 Connected {} version {}.{}.{}, revision: {}{}{}.
20. 8266 0.012 217.95 KiB 0.002 1 129 ['Debug'] 1 Done processing connection.
21. 7449 0.011 880.88 KiB 0.008 826 286 ['Trace'] 0.447 Renaming temporary part {} to {} with tid {}.
22. 7213 0.01 507.20 KiB 0.004 1 727 ['Trace'] 0.627 Reserved {} on local disk {}, having unreserved {}.
23. 7180 0.01 643.39 KiB 0.006 1 163 ['Trace'] 0 Aggregated. {} to {} rows (from {}) in {} sec. ({:.3f} rows/sec., {}/sec.)
24. 6747 0.01 316.30 KiB 0.003 1 267 ['Trace'] 0.456 filled checksums {}
25. 6567 0.009 455.36 KiB 0.004 823 700 ['Trace'] 0.626 Trying to reserve {} using storage policy from min volume index {}
26. 6259 0.009 293.98 KiB 0.003 1 152 ['Trace'] 0 Read steps statistics: {}
27. 6230 0.009 807.94 KiB 0.007 1 85 ['Trace'] 0 Stored query result of query {}
28. 5483 0.008 58.90 KiB 0.001 1 161 ['Trace'] 0 Aggregating
29. 5121 0.007 305.06 KiB 0.003 943 180 ['Debug'] 0.072 There are {} detached tables. Start searching non used tables.
30. 5121 0.007 215.04 KiB 0.002 943 180 ['Debug'] 0.072 Found {} non used tables in detached tables.
31. 5028 0.007 470.20 KiB 0.004 1 70 ['Debug'] 0 Reading {} marks from part {}, total {} rows starting from the beginning of the part
32. 4539 0.007 350.18 KiB 0.003 1 108 ['Trace'] 0 Query span trace_id for opentelemetry log: {}
33. 4382 0.006 351.60 KiB 0.003 1 147 ['Trace'] 0 An entry for key={} found in cache: {}
34. 4171 0.006 324.62 KiB 0.003 553 111 ['Trace'] 0.001 Reading {} ranges in{}order from part {}, approx. {} rows starting from {}
35. 3921 0.006 111.35 KiB 0.001 655 118 ['Debug'] 0.001 Key condition: {}
36. 3910 0.006 87.82 KiB 0.001 1 163 ['Trace'] 0 Merging aggregated data
37. 3691 0.005 162.20 KiB 0.001 653 118 ['Trace'] 0.001 Filtering marks by primary and secondary keys
38. 3412 0.005 388.77 KiB 0.003 641 118 ['Debug'] 0.001 Selected {}/{} parts by partition key, {} parts by primary key, {}/{} marks by primary key, {} marks to read from {} ranges
39. 3338 0.005 1.29 MiB 0.011 3 17 ['Error'] 0.5 Unknown {}{} identifier {} in scope {}{}
40. 3278 0.005 614.07 KiB 0.005 2 93 ['Trace'] 1 HTTP Request for {}. Method: {}, Address: {}, User-Agent: {}{}, Content Type: {}, Transfer Encoding: {}, X-Forwarded-For: {}
41. 3258 0.005 3.37 MiB 0.03 2 93 ['Trace'] 1 Request URI: {}
42. 2994 0.004 173.01 KiB 0.001 19 42 ['Trace'] 1 Flushing system log, {} entries to flush up to offset {}
43. 2991 0.004 106.92 KiB 0.001 19 41 ['Trace'] 1 Flushed system log up to offset {}
44. 2945 0.004 323.23 KiB 0.003 1 94 ['Trace'] 0 Adjusting memory limit before external aggregation with {} (ratio: {}, available system memory: {})
45. 2941 0.004 60.31 KiB 0.001 2 91 ['Debug'] 0.052 Done processing query
46. 2918 0.004 151.03 KiB 0.001 583 118 ['Trace'] 0.001 Spreading mark ranges among streams (default reading)
47. 2833 0.004 363.53 KiB 0.003 1 70 ['Debug'] 0 Could not find entry for table_uuid: {}, part: {}, condition_hash: {}
48. 2699 0.004 251.67 KiB 0.002 61 411 ['Trace'] 1 Nothing to merge in partition {} with max_total_size_to_merge = {} (looked up {} ranges)
49. 2478 0.004 1.24 MiB 0.011 2 11 ['Error'] 0.5 Number of arguments for function {} doesn't match: passed {}, should be {}
50. 2380 0.003 149.49 KiB 0.001 471 114 ['Debug'] 0.001 PK index has dropped {}/{} granules, it took {}ms across {} threads.
51. 2243 0.003 89.81 KiB 0.001 32 181 ['Trace'] 0.001 Sending external_roles with query: [{}] ({})
52. 2243 0.003 63.54 KiB 0.001 1 187 ['Debug'] 1 Stop worker in {}
53. 2243 0.003 87.65 KiB 0.001 1 221 ['Debug'] 0.576 Spawn loader worker #{} in {}
54. 2242 0.003 164.50 KiB 0.001 1 169 ['Debug'] 1 Execute load job '{}' in {}
55. 2242 0.003 171.07 KiB 0.001 1 87 ['Debug'] 0.038 Schedule load job '{}' into {}
56. 2242 0.003 155.73 KiB 0.001 1 169 ['Debug'] 1 Finish load job '{}' with status {}
57. 2229 0.003 207.16 KiB 0.002 1 88 ['Debug'] 0.026 Prioritize load job '{}': {} -> {}
58. 2108 0.003 132.05 KiB 0.001 1 66 ['Trace'] 0 Query result found for query {}
59. 2105 0.003 675.99 KiB 0.006 1 177 ['Trace'] 0.025 The new analyzer is enabled, but the old interpreter is used. It can be a bug, please report it. Will disable 'allow_experimental_analyzer' setting (for query: {})
60. 2010 0.003 10.31 MiB 0.091 6 7 ['Error'] 0.5 Value passed to '{}' function is non-zero
61. 1999 0.003 230.35 KiB 0.002 1 86 ['Debug'] 0 Done waiting for the table {} to be dropped. The outcome: {}
62. 1999 0.003 148.36 KiB 0.001 1 86 ['Debug'] 0 Waiting for table {} to be finally dropped
63. 1957 0.003 367.76 KiB 0.003 1 131 ['Information'] 1 Removing metadata {} of dropped table {}
64. 1913 0.003 63.50 KiB 0.001 1 226 ['Debug'] 0.507 Change current priority: {} -> {}
65. 1904 0.003 16.73 KiB 0 2 87 ['Trace'] 0.004 No tables
66. 1846 0.003 133.42 KiB 0.001 1 492 ['Information'] 1 Have {} tables in drop queue ({} of them are in use), will try drop {} tables
67. 1779 0.003 300.80 KiB 0.003 1 144 ['Trace'] 0 {}Keys: {}, datatype: {}, kind: {}, strictness: {}, right header: {}
68. 1755 0.003 101.29 KiB 0.001 2 26 ['Trace'] 0.955 Loading config file '{}'.
69. 1694 0.002 7.71 MiB 0.068 1 73 ['Trace'] 0 Before join block: '{}'
70. 1687 0.002 7.78 MiB 0.068 1 73 ['Trace'] 0 After join block: '{}'
71. 1685 0.002 49.37 KiB 0 259 95 ['Trace'] 1 Checking task {}
72. 1664 0.002 171.71 KiB 0.001 1 71 ['Trace'] 0 Adjusting memory limit before external sort with {} (ratio: {}, available system memory: {})
73. 1645 0.002 157.33 KiB 0.001 258 94 ['Debug'] 1 Will not execute task {}: {}
74. 1584 0.002 162.03 KiB 0.001 1 6 ['Trace'] 0.5 Adding file: {}, size: {}
75. 1529 0.002 115.04 KiB 0.001 1 152 ['Trace'] 0 Statistics updated for key={}: {}
76. 1522 0.002 106.77 KiB 0.001 1 323 ['Trace'] 0.243 Rolling back transaction {}{}
77. 1519 0.002 74.93 KiB 0.001 1 72 ['Trace'] 0 Merging partially aggregated blocks (bucket = {}).
78. 1519 0.002 222.71 KiB 0.002 1 72 ['Debug'] 0 Merged partially aggregated blocks for bucket #{}. Got {} rows, {} from {} source rows in {} sec. ({:.3f} rows/sec., {}/sec.)
79. 1512 0.002 60.54 KiB 0.001 1 78 ['Trace'] 0.002 PREWHERE condition was split into {} steps
80. 1475 0.002 23.05 KiB 0 259 97 ['Debug'] 1 Scheduling tasks
81. 1463 0.002 329.24 KiB 0.003 259 97 ['Trace'] 1 scheduleTasks: initialized={}, size_before_filtering={}, queue_size={}, entries={}..{}, first_failed_task_name={}, current_tasks_size={}, last_current_task={}, last_skipped_entry_name={}
82. 1463 0.002 35.72 KiB 0 259 97 ['Debug'] 1 Waiting for queue updates
83. 1447 0.002 73.48 KiB 0.001 259 95 ['Debug'] 1 Will schedule {} tasks starting from {}
84. 1427 0.002 436.68 KiB 0.004 133 75 ['Debug'] 0 Proposing query: {}
85. 1426 0.002 436.55 KiB 0.004 134 72 ['Debug'] 0.028 Executing query: {}
86. 1426 0.002 122.55 KiB 0.001 133 75 ['Debug'] 0 Waiting for worker thread to process all entries before {} (timeout: {}s{})
87. 1426 0.002 503.40 KiB 0.004 134 72 ['Debug'] 0.028 Processing task {} (query: {}, backup restore: {})
88. 1402 0.002 140.07 KiB 0.001 888 503 ['Trace'] 1 Didn't start merge: {}
89. 1384 0.002 131.63 KiB 0.001 133 72 ['Trace'] 1 Waiting for initiator {} to commit or rollback entry {}
90. 1371 0.002 465.63 KiB 0.004 134 72 ['Debug'] 0 Executed query: {}
91. 1360 0.002 147.08 KiB 0.001 592 249 ['Debug'] 0.961 Removing {} parts from filesystem (serially): Parts: [{}]
92. 1334 0.002 97.18 KiB 0.001 1 80 ['Trace'] 0.002 The min valid primary key position for moving to the tail of PREWHERE is {}
93. 1330 0.002 78.97 KiB 0.001 1 59 ['Trace'] 0 Left table estimation: {}, right table estimation: {}
94. 1316 0.002 152.45 KiB 0.001 1 5 ['Trace'] 1 Creating part at path {}
95. 1206 0.002 102.96 KiB 0.001 130 459 ['Trace'] 1 Scheduling next merge selecting task after {}ms, current attempt status: {}
96. 1176 0.002 49.38 KiB 0 136 74 ['Trace'] 1 Too early to clean queue, will do it later.
97. 1168 0.002 28.52 KiB 0 85 214 ['Debug'] 0.54 Loaded metadata version {}
98. 1131 0.002 124.06 KiB 0.001 1 29 ['Debug'] 0 Reading {} marks from part {}, total {} rows starting from the beginning of the part, column {}
99. 1083 0.002 19.04 KiB 0 1025 141 ['Debug'] 0.048 Loading data parts
100. 1054 0.002 29.95 KiB 0 79 152 ['Trace'] 0.003 Found (LEFT) boundary mark: {}
count count_% size size_% uniq_loggers uniq_threads levels background_% message_format_string
Top messages without format string (fmt::runtime):
count pattern runtime_message line
1. 145 IfthesignaturecheckfailedThiscou If the signature check failed. This could be because of a time skew. Attempting to adjust the signer. ('/AWSLogger.cpp',70)
2. 44 CodeDBExceptionSyntaxerrorfailed Code: 62. DB::Exception: Syntax error: failed at position 102 (IDENTIFIED): IDENTIFIED plaintext_password by '8'. Expected one of: NO_PASSWORD, PLAINTEXT_PASSWORD, SHA256_PASSWORD, DOUBLE_SHA1_PASSWORD, LDAP, KERBEROS, SSL_CERTIFICATE, BCRYPT_PASSWORD, SSH ('/executeQuery.cpp',301)
3. 10 CodeDBExceptionReceivedfromDBExc Code: 439. DB::Exception: Received from 127.0.0.9:9000. DB::Exception: Cannot schedule a task: failed to start the thread (threads=2, jobs=2). Stack trace: ↴ ('/executeQuery.cpp',301)
↳ ↴
↳0. ./contrib/llvm-project/libcxx/include/__exception/exception.h:113: Poco::Exception::Exception(St
4. 9 voidDBStorageReplicatedMergeTree void DB::StorageReplicatedMergeTree::mutationsUpdatingTask(): Code: 999. Coordination::Exception: Session expired. (KEEPER_EXCEPTION), Stack trace (when copying this message, always include the lines below): ↴ ('/Exception.cpp',285)
↳ ↴
↳0. ./contrib/llvm-project/libcxx/include/__exce
5. 6 configatindexiscommittedprevconf config at index 1 is committed, prev config log idx 0 ('/LoggerWrapper.h',43)
6. 4 CodeDBExceptionEmptyquerywhileex Code: 62. DB::Exception: Empty query: while executing 'FUNCTION formatQuery(__table1.query : 2) -> formatQuery(__table1.query) String : 1'. (SYNTAX_ERROR) (version 25.3.14.10001.altinitystable (altinity build)) (from [::1]:44378) (comment: 02882_formatQuer ('/executeQuery.cpp',301)
7. 4 CodeDBExceptionEmptyqueryInscope Code: 62. DB::Exception: Empty query: In scope SELECT formatQuery(''). (SYNTAX_ERROR) (version 25.3.14.10001.altinitystable (altinity build)) (from [::1]:44378) (comment: 02882_formatQuery.sql) (query 16, line 21) (in query: SELECT formatQuery('');), Stack ('/executeQuery.cpp',301)
8. 4 CodeDBExceptionSQLitedatabasefil Code: 481. DB::Exception: SQLite database file path '/etc/passwd' must be inside 'user_files' directory. (PATH_ACCESS_DENIED) (version 25.3.14.10001.altinitystable (altinity build)) (from [::1]:51752) (comment: 02918_sqlite_path_check.sh) (query 1, line 1) ('/executeQuery.cpp',301)
9. 4 CodeCoordinationExceptionSession Code: 999. Coordination::Exception: Session expired (fault injected on recv). (KEEPER_EXCEPTION), Stack trace (when copying this message, always include the lines below): ↴ ('/Exception.cpp',285)
↳ ↴
↳0. ./contrib/llvm-project/libcxx/include/__exception/exception.h:113: Poco::Exceptio
10. 3 Forkedachildprocesstowatch Forked a child process to watch ('',0)
11. 3 newconfigurationlogidxprevlogidx new configuration: log idx 1, prev log idx 0 ↴ ('/LoggerWrapper.h',43)
↳peer 1, DC ID 0, localhost:9234, voting member, 1 ↴
↳my id: 1, leader: 1, term: 1
12. 3 invalidelectiontimeoutupperbound invalid election timeout upper bound detected, adjusted to 0 ('/LoggerWrapper.h',43)
13. 3 ConnectiontosystemasuserMYSQLUSE Connection to system@127.0.0.1:9004 as user 02833_MYSQL_USER_26167 failed: mysqlxx::ConnectionFailed: 02833_MYSQL_USER_26167: Authentication failed: password is incorrect, or there is no user with such name. ((nullptr):9004) ('',0)
14. 3 statemachinecommitindexprecommit state machine commit index 0, precommit index 0, last log index 0 ('/LoggerWrapper.h',43)
15. 3 bgappendentriesthreadinitiated bg append_entries thread initiated ('/LoggerWrapper.h',43)
16. 3 Electiontimeoutinitiateleaderele Election timeout, initiate leader election ('/LoggerWrapper.h',43)
17. 3 autoDBStorageReplicatedMergeTree auto DB::StorageReplicatedMergeTree::processQueueEntry(ReplicatedMergeTreeQueue::SelectedEntryPtr)::(anonymous class)::operator()(LogEntryPtr &) const: Poco::Exception. Code: 1000, e.code() = 0, Malformed message: Unexpected EOF, Stack trace (when copying ('/Exception.cpp',285)
18. 3 startingup starting up ('',0)
19. 3 skippedconfiglatestconfig skipped config 1, latest config 1 ('/LoggerWrapper.h',43)
20. 3 INITRAFTSERVERcommitindextermele === INIT RAFT SERVER === ↴ ('/LoggerWrapper.h',43)
↳commit index 0 ↴
↳term 0 ↴
↳election timer allowed ↴
↳log store start 1, end 0 ↴
↳config log idx 0, prev log idx 0 ↴
↳ -- ASYNC REPLICATION --
21. 3 newelectiontimeoutrange new election timeout range: 0 - 0 ('/LoggerWrapper.h',43)
22. 3 Connectiontomysqlfailedtimes Connection to mysql failed 1 times ('',0)
23. 3 peerDCIDlocalhostvotingmembermyi peer 1: DC ID 0, localhost:9234, voting member, 1 ↴ ('/LoggerWrapper.h',43)
↳my id: 1, voting_member ↴
↳num peers: 0
24. 3 invalidelectiontimeoutlowerbound invalid election timeout lower bound detected, adjusted to 0 ('/LoggerWrapper.h',43)
25. 3 RaftASIOlistenerinitiatedonunsec Raft ASIO listener initiated on :::9234, unsecured ('/LoggerWrapper.h',43)
26. 3 waitforHBforms wait for HB, for 50 + [0, 0] ms ('/LoggerWrapper.h',43)
27. 3 numberofpendingcommitelements number of pending commit elements: 0 ('/LoggerWrapper.h',43)
28. 3 ELECTIONTIMEOUTcurrentrolefollow [ELECTION TIMEOUT] current role: follower, log last term 0, state term 0, target p 1, my p 1, hb dead, pre-vote NOT done ('/LoggerWrapper.h',43)
29. 3 StartingClickHousealtinitystable Starting ClickHouse 25.3.14.10001.altinitystable (revision: 4294967295, git hash: 07020f362800626e9ea95b3bc0c3b19c36cb4272, build id: C2B74946E070F433F4DD96381F5CA924319F27B0), PID 430 ('',0)
30. 3 globalmanagerdoesnotexistwilluse global manager does not exist. will use local thread for commit and append ('/LoggerWrapper.h',43)
Top messages not matching their format strings:
message_format_string count() any_message
1. 247 Connection to system@127.0.0.1:9004 as user 02833_MYSQL_USER_26167 failed: mysqlxx::ConnectionFailed: 02833_MYSQL_USER_26167: Authentication failed: password is incorrect, or there is no user with such name. ((nullptr):9004)
2. {} is in use (by merge/mutation/INSERT) (consider increasing temporary_directories_lifetime setting) 41 /var/lib/clickhouse/store/0b0/0b025222-9ba7-4912-8a5f-7614de775293/tmp_merge_202609_1_47_9/ is in use (by merge/mutation/INSERT) (consider increasing temporary_directories_lifetime setting) (skipped 1 similar messages)
3. Illegal UTF-8 sequence, while processing '{}' 12 Code: 36. DB::Exception: Illegal UTF-8 sequence, while processing '�': while executing 'FUNCTION stringJaccardIndexUTF8(materialize('hello'_String) :: 3, materialize('�'_String) :: 1) -> stringJaccardIndexUTF8(materialize('hello'_String), materialize('�'_String)) Float64 : 2'. (BAD_ARGUMENTS) (version 25.3.14.10001.altinitystable (altinity build)) (from [::1]:47986) (comment: 02884_string_distance_function.sql) (query 35, line 48) (in query: SELECT stringJaccardIndexUTF8(materialize('hello'), materialize('\xC2\x01'));), Stack trace (when copying this message, always include the lines below):↴
↳ ↴
↳0. ./contrib/llvm-project/libcxx/include/__exception/exception.h:113: Poco::Exception::Exception(String const&, int) @ 0x00000000415cf486 ↴
↳1. ./build_docker/./src/Common/Exception.cpp:108: DB::Exception::Exception(DB::Exception::MessageMasked&&, int, bool) @ 0x000000001f987092 ↴
↳2. DB::Exception::Exception(PreformattedMessage&&, int) @ 0x0000000008ed9edf ↴
↳3. DB::Exception::Exception>>(int, FormatStringHelperImpl>>::type>, std::basic_string_view>&&) @ 0x0000000009156dca↴
↳4. DB::parseUTF8String(char const*, unsigned long, std::function, std::function) @ 0x000000000afc265c ↴
↳5. DB::ByteJaccardIndexImpl::process(char const*, unsigned long, char const*, unsigned long) @ 0x000000000afe24d6 ↴
↳6. DB::FunctionsStringSimilarity>, DB::NameJaccardIndexUTF8>::executeImpl(std::vector> const&, std::shared_ptr const&, unsigned long) const @ 0x000000000afe0869↴
↳7. ./build_docker/./src/Functions/IFunctionAdaptors.cpp:10: DB::FunctionToExecutableFunctionAdaptor::executeImpl(std::vector> const&, std::shared_ptr const&, unsigned long) const @ 0x000000002c3fd73b↴
↳8. DB::IExecutableFunction::executeWithoutLowCardinalityColumns(std::vector> const&, std::shared_ptr const&, unsigned long, bool) const @ 0x000000002c3ea107 ↴
↳9. DB::IExecutableFunction::executeWithoutSparseColumns(std::vector> const&, std::shared_ptr const&, unsigned long, bool) const @ 0x000000002c3ef05d ↴
↳10. DB::IExecutableFunction::execute(std::vector> const&, std::shared_ptr const&, unsigned long, bool) const @ 0x000000002c3f42c6 ↴
↳11. ./build_docker/./src/Interpreters/ExpressionActions.cpp:636: DB::ExpressionActions::execute(DB::Block&, unsigned long&, bool, bool) const @ 0x0000000031e005a5 ↴
↳12. ./build_docker/./src/Processors/Transforms/ExpressionTransform.cpp:25: DB::ExpressionTransform::transform(DB::Chunk&) @ 0x000000003bdbb094 ↴
↳13. ./src/Processors/ISimpleTransform.h:33: DB::ISimpleTransform::transform(DB::Chunk&, DB::Chunk&) @ 0x00000000272aad04 ↴
↳14. ./build_docker/./src/Processors/ISimpleTransform.cpp:89: DB::ISimpleTransform::work() @ 0x000000003b433281 ↴
↳15. ./build_docker/./src/Processors/Executors/ExecutionThreadContext.cpp:53: DB::ExecutionThreadContext::executeTask() @ 0x000000003b4a3f6d ↴
↳16. ./build_docker/./src/Processors/Executors/PipelineExecutor.cpp:296: DB::PipelineExecutor::executeStepImpl(unsigned long, std::atomic*) @ 0x000000003b46e594 ↴
↳17. ./build_docker/./src/Processors/Executors/PipelineExecutor.cpp:262: DB::PipelineExecutor::executeImpl(unsigned long, bool) @ 0x000000003b46c363 ↴
↳18. ./build_docker/./src/Processors/Executors/PipelineExecutor.cpp:128: DB::PipelineExecutor::execute(unsigned long, bool) @ 0x000000003b46b87a ↴
↳19. ./build_docker/./src/Processors/Executors/PullingAsyncPipelineExecutor.cpp:76: void std::__function::__policy_invoker::__call_impl[abi:ne190107]::ThreadFromGlobalPoolImpl(DB::PullingAsyncPipelineExecutor::pull(DB::Chunk&, unsigned long)::$_0&&)::'lambda'(), void ()>>(std::__function::__policy_storage const*) @ 0x000000003b4b0cd7↴
↳20. ./contrib/llvm-project/libcxx/include/__functional/function.h:716: ? @ 0x000000001fd5c6e7 ↴
↳21. ./contrib/llvm-project/libcxx/include/__type_traits/invoke.h:117: void* std::__thread_proxy[abi:ne190107]>, void (ThreadPoolImpl::ThreadFromThreadPool::*)(), ThreadPoolImpl::ThreadFromThreadPool*>>(void*) @ 0x000000001fd70044↴
↳22. ? @ 0x00007f44bdb06ac3 ↴
↳23. ? @ 0x00007f44bdb98850 ↴
4. (from {}{}{}){}{}{} {} (stage: {}) 6 (from [::1]:50026) (comment: 02683_native_too_large_size.sql) (query 1, line 1) SELECT * FROM format('Native', 'WatchID Int64, JavaEnable Int16, Title String, GoodEvent Int16, EventTime DateTime, EventDate Date, CounterID Int32, ClientIP Int32, RegionID Int32, UserID Int64, CounterClass Int16, OS Int16, UserAgent Int16, URL String, Referer String, IsRefresh Int16, RefererCategoryID Int16, RefererRegionID Int32, URLCategoryID Int16, URLRegionID Int32, ResolutionWidth Int16, ResolutionHeight Int16, ResolutionDepth Int16, FlashMajor Int16, FlashMinor Int16, FlashMinor2 String, NetMajor Int16, NetMinor Int16, UserAgentMajor Int16, UserAgentMinor String, CookieEnable Int16, JavascriptEnable Int16, IsMobile Int16, MobilePhone Int16, MobilePhoneModel String, Params String, IPNetworkID Int32, TraficSourceID Int16, SearchEngineID Int16, SearchPhrase String, AdvEngineID Int32, IsArtifical Int16, WindowClientWidth Int16, WindowClientHeight Int16, ClientTimeZone Int16, ClientEventTime DateTime, SilverlightVersion1 Int16, SilverlightVersion2 Int16, SilverlightVersion3 Int32, SilverlightVersion4 Int16, PageCharset String, CodeVersion Int32, IsLink Int16, IsDownload Int16, IsNotBounce Int16, FUniqID Int64, OriginalURL String, HID Int32, IsOldCounter Int16, IsEvent Int16, IsParameter Int16, DontCountHits Int16, WithHash Int16, HitColor String, LocalEventTime DateTime, Age Int16, Sex Int16, Income Int16, Interests Int16, Robotness Int16, RemoteIP Int32, VindowName Int32, OpenerName Int32, HistoryLength Int16, BrowserLanguage String, BrowserCountry String, SocialNetwork String, SocialAction String, HTTPError Int16, SendTiming Int32, DNSTiming Int32, ConnectTiming Int32, ResponseStartTiming Int32, ResponseEndTiming Int32, FetchTiming Int32, SocialSourceNetworkID Int16, SocialSourcePage String, ParamPrice Int64, ParamOrderID String, ParamCurrency String, ParamCurrencyID Int16, OpenstatServiceName String, OpenstatCampaignID String, OpenstatAdID String, OpenstatSourceID String, UTMSource String, UTMMedium String, UTMCampaign String, UTMContent String, UTMTerm String, FromTag String, HasGCLID Int16, RefererHash Int64, URLHash Int64, CLID Int32', $$i↴
↳WatchIDInt64c*5/ !p~�F�ӓ2ql!�|�@H�ǐ=ЌW�E&Ly�k=�p�1�o�C»-�C_��\�/E�J�{ ↴
↳JavaEnableInt16 TitleString GoodEventInt16 EventTimeDateTime7�Qn$�Q�)�Q8*�QJ�Q��Q�0�Q83�Q� �Q�1�Q EventDateDate>>>>>>>>>> CounterIDInt32 ClientIPInt32�z�z�z�z�I`�z�^{]�^{]�gU�z�RegionIDInt32G G G G ' G � � � G UserIDInt64� �:6� �:6� �:6� �:6�q�Jd8
�Ks}�&n%�t"6&n%�t"6�s�yy�f� �:6�CounterClassInt16 OSInt16 ' ' , UserAgentInt16 URLString -http://holodilInt16 WindowClientWidthInt16 WindowClientHeightInt16 ClientTimeZoneInt16�ClientEventTimeDateTime����������SilverlightVersion1Int16 SilverlightVersion2Int16 SilverlightVersion3Int32 SilverlightVersion4Int16 PageCharsetString CodeVersionInt32 IsLinkInt16 ↴
↳IsDownloadInt16 IsNotBounceInt16 FUniqIDInt64 %�l�+k:�W�m OriginalURLString HIDInt32 IsOldCounterInt16 IsEventInt16 IsParameterInt16
DontCountHitsInt16 WithHashInt16 HitColorString5555555555LocalEventTimeDateTime&�Qǘ�Q}�Qݞ�Q'�QA�Q�Q ↴
↳�QY�Q�QAgeInt16 SexInt16 IncomeInt16 InterestsInt16 �: RobotnessInt16 RemoteIPInt32^DI�^DI�^DI�^DI�9�3N^DI��U�U�=k^DI� ↴
↳WindowNameInt32� ↴
↳OpenerNameInt32�
HistoryLengthInt16�BrowserLanguageString����������BrowserCountryString����������
SocialNetworkString SocialActionString HTTPErrorInt16 ↴
↳SendTimingInt32 DNSTimingInt32
ConnectTimingInt32 ResponseStartTimingInt32 ResponseEndTimingInt32 FetchTimingInt32 SocialSourceNetworkIDInt16 SocialSourcePageString ↴
↳ParamPriceInt64 ParamOrderIDString
ParamCurrencyStringNHNHNHNHNHNHNHNHNHNHParamCurrencyIDInt16 OpenstatServiceNameString OpenstatCampaignIDString OpenstatAdIDString OpenstatSourceIDString UTMSourceString UTMMediumString UTMCampaignString ↴
↳UTMContentString UTMTermString FromTagString HasGCLIDInt16 RefererHashInt64X+�'�X+�'�X+�'�X+�'�X+�'�X+�'�X+�'�X+�'�X+�'�X+�'�URLHashInt64�|3�b.�|3�b.�|3�b.�|3�b.� ↴
↳o�e�
�#�\X-h�X v�v�h�9�D�|3�b.�CLIDInt32 $$); (stage: Complete)
5. Close WriteBufferFromAzureBlobStorage. {}. 2 Close WriteBufferFromAzureBlobStorage. bgytzjuiihxtbmzcdsncfcottfkwttiu. (LogSeriesLimiter: on interval from 2026-09-20 16:26:05 to 2026-09-20 16:32:15 accepted series 1 / 1 for the logger WriteBufferFromAzureBlobStorage)
Top short messages:
c message_format_string substr(any(toValidUTF8(message)), 1, 120) min_length_without_exception_boilerplate
1. 25 Cannot TRUNCATE dictionary Code: 62. DB::Exception: Cannot TRUNCATE dictionary. (SYNTAX_ERROR) (version 25.3.14.10001.altinitystable (altinity buil 27
2. 14 {} ThreadFuzzer is enabled. Application will run slowly and unstable. 34
3. 9 Creating {}: {} Creating table test_3.src: CREATE TABLE IF NOT EXISTS test_3.src UUID '475bac4a-c068-4fed-a399-c0bbd2915d53' (`Timestamp 106
4. 3 Froze {} parts Froze 1 parts -13
5. 2 Found {} on {} Found changelog_1_100000.bin on LocalLogDisk 18
Top messages by level:
(0.0048122390607339745,'Unknown {}{} identifier {} in scope {}{}') Error
(0.00006631605655894632,'There is no table {}.{} on server: {}') Warning
(0.0028213157105621296,'Removing metadata {} of dropped table {}') Information
(0.06355529029132932,'(from {}{}{}){}{}{} {} (stage: {})') Debug
(0.06167681590662699,'{} Creating query context from {} context, user_id: {}, parent context user: {}') Trace
2026-09-21 01:56:10,169 Stress test finished
+ echo -e 'Test script exit code\tOK\t\N\t'
+ rg -Fa 'No queries hung' /test_output/test_results.tsv
+ grep -Fa OK
No queries hung OK \N
+ stop_server
+ local max_tries=90
+ local check_hang=true
+ local pid
++ cat /var/run/clickhouse-server/clickhouse-server.pid
+ pid=2748
+ for i in {1..30}
+ clickhouse client -q 'SYSTEM STOP DISTRIBUTED SENDS'
+ break
+ clickhouse stop --max-tries 90 --do-not-kill
/var/run/clickhouse-server/clickhouse-server.pid file exists and contains pid = 2748.
The process with pid = 2748 is running.
Sent terminate signal to process with pid 2748.
Waiting for server to stop
/var/run/clickhouse-server/clickhouse-server.pid file exists and contains pid = 2748.
The process with pid = 2748 is running.
Waiting for server to stop
/var/run/clickhouse-server/clickhouse-server.pid file exists and contains pid = 2748.
The process with pid = 2748 is running.
Waiting for server to stop
/var/run/clickhouse-server/clickhouse-server.pid file exists and contains pid = 2748.
The process with pid = 2748 is running.
Waiting for server to stop
/var/run/clickhouse-server/clickhouse-server.pid file exists and contains pid = 2748.
The process with pid = 2748 is running.
Waiting for server to stop
/var/run/clickhouse-server/clickhouse-server.pid file exists and contains pid = 2748.
The process with pid = 2748 is running.
Waiting for server to stop
/var/run/clickhouse-server/clickhouse-server.pid file exists and contains pid = 2748.
The process with pid = 2748 is running.
Waiting for server to stop
/var/run/clickhouse-server/clickhouse-server.pid file exists and contains pid = 2748.
The process with pid = 2748 is running.
Waiting for server to stop
/var/run/clickhouse-server/clickhouse-server.pid file exists and contains pid = 2748.
The process with pid = 2748 does not exist.
Server stopped
+ return
+ mv /var/log/clickhouse-server/clickhouse-server.log /var/log/clickhouse-server/clickhouse-server.stress.log
+ unset THREAD_FUZZER_CPU_TIME_PERIOD_US THREAD_FUZZER_EXPLICIT_MEMORY_EXCEPTION_PROBABILITY THREAD_FUZZER_EXPLICIT_SLEEP_PROBABILITY THREAD_FUZZER_SLEEP_PROBABILITY THREAD_FUZZER_SLEEP_TIME_US_MAX THREAD_FUZZER_pthread_mutex_lock_AFTER_MIGRATE_PROBABILITY THREAD_FUZZER_pthread_mutex_lock_AFTER_SLEEP_PROBABILITY THREAD_FUZZER_pthread_mutex_lock_AFTER_SLEEP_TIME_US_MAX THREAD_FUZZER_pthread_mutex_lock_BEFORE_MIGRATE_PROBABILITY THREAD_FUZZER_pthread_mutex_lock_BEFORE_SLEEP_PROBABILITY THREAD_FUZZER_pthread_mutex_lock_BEFORE_SLEEP_TIME_US_MAX THREAD_FUZZER_pthread_mutex_unlock_AFTER_MIGRATE_PROBABILITY THREAD_FUZZER_pthread_mutex_unlock_AFTER_SLEEP_PROBABILITY THREAD_FUZZER_pthread_mutex_unlock_AFTER_SLEEP_TIME_US_MAX THREAD_FUZZER_pthread_mutex_unlock_BEFORE_MIGRATE_PROBABILITY THREAD_FUZZER_pthread_mutex_unlock_BEFORE_SLEEP_PROBABILITY THREAD_FUZZER_pthread_mutex_unlock_BEFORE_SLEEP_TIME_US_MAX THREAD_POOL_FAULT_INJECTION
+ rm /etc/clickhouse-server/config.d/cannot_allocate_thread_injection.xml
+ start_server
+ counter=0
+ max_attempt=120
+ clickhouse-client --query 'SELECT 1'
Code: 210. DB::NetException: Connection refused (localhost:9000). (NETWORK_ERROR)
+ '[' 0 -gt 120 ']'
+ clickhouse start --user root
+ sleep 0.5
+ counter=1
+ clickhouse-client --query 'SELECT 1'
Code: 210. DB::NetException: Connection refused (localhost:9000). (NETWORK_ERROR)
+ '[' 1 -gt 120 ']'
+ clickhouse start --user root
+ sleep 0.5
+ counter=2
+ clickhouse-client --query 'SELECT 1'
Code: 210. DB::NetException: Connection refused (localhost:9000). (NETWORK_ERROR)
+ '[' 2 -gt 120 ']'
+ clickhouse start --user root
+ sleep 0.5
+ counter=3
+ clickhouse-client --query 'SELECT 1'
Code: 210. DB::NetException: Connection refused (localhost:9000). (NETWORK_ERROR)
+ '[' 3 -gt 120 ']'
+ clickhouse start --user root
+ sleep 0.5
+ counter=4
+ clickhouse-client --query 'SELECT 1'
Code: 210. DB::NetException: Connection refused (localhost:9000). (NETWORK_ERROR)
+ '[' 4 -gt 120 ']'
+ clickhouse start --user root
+ sleep 0.5
+ counter=5
+ clickhouse-client --query 'SELECT 1'
Code: 210. DB::NetException: Connection refused (localhost:9000). (NETWORK_ERROR)
+ '[' 5 -gt 120 ']'
+ clickhouse start --user root
+ sleep 0.5
+ counter=6
+ clickhouse-client --query 'SELECT 1'
Code: 210. DB::NetException: Connection refused (localhost:9000). (NETWORK_ERROR)
+ '[' 6 -gt 120 ']'
+ clickhouse start --user root
+ sleep 0.5
+ counter=7
+ clickhouse-client --query 'SELECT 1'
Code: 210. DB::NetException: Connection refused (localhost:9000). (NETWORK_ERROR)
+ '[' 7 -gt 120 ']'
+ clickhouse start --user root
+ sleep 0.5
+ counter=8
+ clickhouse-client --query 'SELECT 1'
Code: 210. DB::NetException: Connection refused (localhost:9000). (NETWORK_ERROR)
+ '[' 8 -gt 120 ']'
+ clickhouse start --user root
+ sleep 0.5
+ counter=9
+ clickhouse-client --query 'SELECT 1'
Code: 210. DB::NetException: Connection refused (localhost:9000). (NETWORK_ERROR)
+ '[' 9 -gt 120 ']'
+ clickhouse start --user root
+ sleep 0.5
+ counter=10
+ clickhouse-client --query 'SELECT 1'
Code: 210. DB::NetException: Connection refused (localhost:9000). (NETWORK_ERROR)
+ '[' 10 -gt 120 ']'
+ clickhouse start --user root
+ sleep 0.5
+ counter=11
+ clickhouse-client --query 'SELECT 1'
1
+ attach_gdb_to_clickhouse
++ clickhouse local --query 'SELECT count() FROM system.build_options WHERE name = '\''CXX_FLAGS'\'' AND position('\''sanitize=address'\'' IN value)'
+ IS_ASAN=0
+ [[ 0 = \1 ]]
++ kill -l SIGRTMIN
+ RTMIN=34
+ echo '
set follow-fork-mode parent
handle SIGHUP nostop noprint pass
handle SIGINT nostop noprint pass
handle SIGQUIT nostop noprint pass
handle SIGPIPE nostop noprint pass
handle SIGTERM nostop noprint pass
handle SIGUSR1 nostop noprint pass
handle SIGUSR2 nostop noprint pass
handle SIG34 nostop noprint pass
info signals
# safeExit is called if graceful shutdown times out. Print stack traces in that case.
break safeExit
continue
backtrace full
info registers
p top' 1 KiB of the 'stack:
p/x *(uint64_t[128]*)$sp
maintenance info sections
thread apply all backtrace full
disassemble /s
up
disassemble /s
up
disassemble /s
p "done"
detach
quit
'
+ sleep 5
+ ts '%Y-%m-%d %H:%M:%S'
++ cat /var/run/clickhouse-server/clickhouse-server.pid
+ gdb -batch -command script.gdb -p 73488
aarch64-binfmt-P: Could not open '/lib/ld-linux-aarch64.so.1': No such file or directory
+ run_with_retry 60 clickhouse-client --query 'SELECT '\''Connected to clickhouse-server after attaching gdb'\'''
+ local retries=60
+ shift
+ local retry=0
+ '[' 0 -ge 60 ']'
+ clickhouse-client --query 'SELECT '\''Connected to clickhouse-server after attaching gdb'\'''
Connected to clickhouse-server after attaching gdb
+ return
+ check_server_start
+ clickhouse-client --query 'SELECT '\''Server successfully started'\'', '\''OK'\'', NULL, '\'''\'''
+ '[' -s /test_output/application_errors.txt ']'
+ rm /test_output/application_errors.txt
rm: cannot remove '/test_output/application_errors.txt': No such file or directory
+ stop_server
+ local max_tries=90
+ local check_hang=true
+ local pid
++ cat /var/run/clickhouse-server/clickhouse-server.pid
+ pid=73488
+ for i in {1..30}
+ clickhouse client -q 'SYSTEM STOP DISTRIBUTED SENDS'
+ break
+ clickhouse stop --max-tries 90 --do-not-kill
/var/run/clickhouse-server/clickhouse-server.pid file exists and contains pid = 73488.
The process with pid = 73488 is running.
Sent terminate signal to process with pid 73488.
Waiting for server to stop
/var/run/clickhouse-server/clickhouse-server.pid file exists and contains pid = 73488.
The process with pid = 73488 is running.
Waiting for server to stop
/var/run/clickhouse-server/clickhouse-server.pid file exists and contains pid = 73488.
The process with pid = 73488 is running.
Waiting for server to stop
/var/run/clickhouse-server/clickhouse-server.pid file exists and contains pid = 73488.
The process with pid = 73488 is running.
Waiting for server to stop
/var/run/clickhouse-server/clickhouse-server.pid file exists and contains pid = 73488.
The process with pid = 73488 is running.
Waiting for server to stop
/var/run/clickhouse-server/clickhouse-server.pid file exists and contains pid = 73488.
The process with pid = 73488 is running.
Waiting for server to stop
/var/run/clickhouse-server/clickhouse-server.pid file exists and contains pid = 73488.
The process with pid = 73488 is running.
Waiting for server to stop
Now there is no clickhouse-server process.
Server stopped
+ return
+ '[' -f /var/log/clickhouse-server/clickhouse-server.log ']'
+ '[' -f /var/log/clickhouse-server/stderr.log ']'
+ mv /var/log/clickhouse-server/clickhouse-server.log /var/log/clickhouse-server/clickhouse-server.final.log
+ check_logs_for_critical_errors
+ sed -n '/WARNING:.*anitizer/,/^$/p' /var/log/clickhouse-server/stderr.log
+ rg -Fav -e 'ASan doesn'\''t fully support makecontext/swapcontext functions' -e DB::Exception /test_output/tmp
+ echo -e 'No sanitizer asserts\tOK\t\N\t'
+ rm -f /test_output/tmp
+ rg -Fa ' Application: Child process was terminated by signal 9' /var/log/clickhouse-server/clickhouse-server.err.log /var/log/clickhouse-server/clickhouse-server.final.log /var/log/clickhouse-server/clickhouse-server.initial.log /var/log/clickhouse-server/clickhouse-server.stress.log
+ echo -e 'No OOM messages in clickhouse-server.log\tOK\t\N\t'
+ rg -Fa 'Code: 49. DB::Exception: ' /var/log/clickhouse-server/clickhouse-server.err.log /var/log/clickhouse-server/clickhouse-server.final.log /var/log/clickhouse-server/clickhouse-server.initial.log /var/log/clickhouse-server/clickhouse-server.stress.log
+ echo -e 'No logical errors\tOK\t\N\t'
+ '[' -s /test_output/logical_errors.txt ']'
+ rm /test_output/logical_errors.txt
+ rg --text 'Code: 499.*The specified key does not exist' /var/log/clickhouse-server/clickhouse-server.err.log /var/log/clickhouse-server/clickhouse-server.final.log /var/log/clickhouse-server/clickhouse-server.initial.log /var/log/clickhouse-server/clickhouse-server.stress.log
+ grep -v -e a.myext -e DistributedCacheTCPHandler -e ReadBufferFromDistributedCache -e ReadBufferFromS3 -e ReadBufferFromAzureBlobStorage -e AsynchronousBoundedReadBuffer -e 'caller id: None:DistribCache'
+ echo -e 'No lost s3 keys\tOK\t\N\t'
+ rg -Fa 'it is lost forever' /var/log/clickhouse-server/clickhouse-server.err.log /var/log/clickhouse-server/clickhouse-server.final.log /var/log/clickhouse-server/clickhouse-server.initial.log /var/log/clickhouse-server/clickhouse-server.stress.log
+ grep SharedMergeTreePartCheckThread
+ echo -e 'No SharedMergeTree lost forever in clickhouse-server.log\tOK\t\N\t'
+ '[' -s /test_output/no_such_key_errors.txt ']'
+ rm /test_output/no_such_key_errors.txt
+ rg -Fa '#######################################' /var/log/clickhouse-server/clickhouse-server.err.log /var/log/clickhouse-server/clickhouse-server.final.log /var/log/clickhouse-server/clickhouse-server.initial.log /var/log/clickhouse-server/clickhouse-server.stress.log
+ echo -e 'Not crashed\tOK\t\N\t'
+ rg -Fa ' ' /var/log/clickhouse-server/clickhouse-server.err.log /var/log/clickhouse-server/clickhouse-server.final.log /var/log/clickhouse-server/clickhouse-server.initial.log /var/log/clickhouse-server/clickhouse-server.stress.log
+ echo -e 'No fatal messages in clickhouse-server.log\tOK\t\N\t'
+ '[' -s /test_output/fatal_messages.txt ']'
+ rm /test_output/fatal_messages.txt
+ rg -Faz '########################################' /test_output/gdb.log /test_output/stress_run_logs.tar.zst /test_output/test_results.tsv
+ rg -v 'rg -Faz '
+ rg -Fa ' received signal ' /test_output/gdb.log
+ dmesg -T
+ grep -q -F -e 'Out of memory: Killed process' -e 'oom_reaper: reaped process' -e oom-kill:constraint=CONSTRAINT_NONE /test_output/dmesg.log
+ echo -e 'No OOM in dmesg\tOK\t\N\t'
+ tar -chf /test_output/coordination.tar /var/lib/clickhouse/coordination
tar: Removing leading `/' from member names
tar: Removing leading `/' from hard link targets
+ collect_query_and_trace_logs
+ for table in query_log trace_log metric_log
+ clickhouse-local --config-file=/etc/clickhouse-server/config.xml --only-system-tables -q 'select * from system.query_log format TSVWithNamesAndTypes'
+ zstd --threads=0
Logging trace to /var/log/clickhouse-server/clickhouse-server.log
Logging errors to /var/log/clickhouse-server/clickhouse-server.err.log
+ for table in query_log trace_log metric_log
+ clickhouse-local --config-file=/etc/clickhouse-server/config.xml --only-system-tables -q 'select * from system.trace_log format TSVWithNamesAndTypes'
+ zstd --threads=0
Logging trace to /var/log/clickhouse-server/clickhouse-server.log
Logging errors to /var/log/clickhouse-server/clickhouse-server.err.log
+ for table in query_log trace_log metric_log
+ clickhouse-local --config-file=/etc/clickhouse-server/config.xml --only-system-tables -q 'select * from system.metric_log format TSVWithNamesAndTypes'
+ zstd --threads=0
Logging trace to /var/log/clickhouse-server/clickhouse-server.log
Logging errors to /var/log/clickhouse-server/clickhouse-server.err.log
+ mv /var/log/clickhouse-server/stderr.log /test_output/
+ clickhouse-local --structure 'test String, res String, time Nullable(Float32), desc String' -q 'SELECT '\''failure'\'', test FROM table WHERE res != '\''OK'\'' order by
(test like '\''%Sanitizer%'\'') DESC,
(test like '\''%Killed by signal%'\'') DESC,
(test like '\''%gdb.log%'\'') DESC,
(test ilike '\''%possible deadlock%'\'') DESC,
(test like '\''%start%'\'') DESC,
(test like '\''%dmesg%'\'') DESC,
(test like '\''%OOM%'\'') DESC,
(test like '\''%Signal 9%'\'') DESC,
(test like '\''%Fatal message%'\'') DESC,
rowNumberInAllBlocks()
LIMIT 1'
+ '[' -s /test_output/check_status.tsv ']'
+ echo -e 'success\tNo errors found'
+ rg 'OOM in dmesg|Signal 9' /test_output/check_status.tsv
+ collect_core_dumps
+ find . -type f -maxdepth 1 -name 'core.*'
+ read -r core