+ dmesg --clear
+ source /setup_export_logs.sh
++ CLICKHOUSE_CI_LOGS_CREDENTIALS=/tmp/export-logs-config.sh
++ CLICKHOUSE_CI_LOGS_USER=ci
++ CLICKHOUSE_CI_LOGS_CLUSTER=system_logs_export
++ EXTRA_COLUMNS='pull_request_number UInt32, commit_sha String, check_start_time DateTime('\''UTC'\''), check_name LowCardinality(String), instance_type LowCardinality(String), instance_id String, INDEX ix_pr (pull_request_number) TYPE set(100), INDEX ix_commit (commit_sha) TYPE set(100), INDEX ix_check_time (check_start_time) TYPE minmax, '
++ EXTRA_COLUMNS_EXPRESSION='CAST(0 AS UInt32) AS pull_request_number, '\'''\'' AS commit_sha, now() AS check_start_time, toLowCardinality('\'''\'') AS check_name, toLowCardinality('\'''\'') AS instance_type, '\'''\'' AS instance_id'
++ EXTRA_ORDER_BY_COLUMNS=check_name
++ EXTRA_COLUMNS_COVERAGE_LOG='pull_request_number UInt32, commit_sha String, check_start_time DateTime('\''UTC'\''), check_name LowCardinality(String), instance_type LowCardinality(String), instance_id String, INDEX ix_pr (pull_request_number) TYPE set(100), INDEX ix_commit (commit_sha) TYPE set(100), INDEX ix_check_time (check_start_time) TYPE minmax, symbols Array(LowCardinality(String)), '
++ EXTRA_COLUMNS_EXPRESSION_COVERAGE_LOG='CAST(0 AS UInt32) AS pull_request_number, '\'''\'' AS commit_sha, now() AS check_start_time, toLowCardinality('\'''\'') AS check_name, toLowCardinality('\'''\'') AS instance_type, '\'''\'' AS instance_id, arrayDistinct(arrayMap(x -> demangle(addressToSymbol(x)), coverage))::Array(LowCardinality(String)) AS symbols'
+ ln -s /repo/tests/clickhouse-test /usr/bin/clickhouse-test
+ source /repo/tests/docker_scripts/attach_gdb.lib
++ source /repo/tests/docker_scripts/utils.lib
+++ sysctl kernel.core_pattern=core.%e.%p-%P
kernel.core_pattern = core.%e.%p-%P
+++ sysctl fs.suid_dumpable=1
fs.suid_dumpable = 1
++ source /basic_helpers.sh
+ source /repo/tests/docker_scripts/stress_tests.lib
++ OK='\tOK\t\N\t'
++ FAIL='\tFAIL\t\N\t'
++ FAILURE_CONTEXT_LINES=100
++ FAILURE_CONTEXT_MAX_LINE_WIDTH=3000
++ source /basic_helpers.sh
+ source /repo/tests/docker_scripts/utils.lib
++ sysctl kernel.core_pattern=core.%e.%p-%P
kernel.core_pattern = core.%e.%p-%P
++ sysctl fs.suid_dumpable=1
fs.suid_dumpable = 1
+ install_packages package_folder
+ run_with_retry 3 dpkg -i package_folder/clickhouse-common-static_25.3.14.10001.altinitystable+asan_amd64.deb
+ local retries=3
+ shift
+ local retry=0
+ '[' 0 -ge 3 ']'
+ dpkg -i package_folder/clickhouse-common-static_25.3.14.10001.altinitystable+asan_amd64.deb
Selecting previously unselected package clickhouse-common-static.
(Reading database ... 48718 files and directories currently installed.)
Preparing to unpack .../clickhouse-common-static_25.3.14.10001.altinitystable+asan_amd64.deb ...
Unpacking clickhouse-common-static (25.3.14.10001.altinitystable+asan) ...
Setting up clickhouse-common-static (25.3.14.10001.altinitystable+asan) ...
+ return
+ run_with_retry 3 dpkg -i package_folder/clickhouse-common-static-dbg_25.3.14.10001.altinitystable+asan_amd64.deb
+ local retries=3
+ shift
+ local retry=0
+ '[' 0 -ge 3 ']'
+ dpkg -i package_folder/clickhouse-common-static-dbg_25.3.14.10001.altinitystable+asan_amd64.deb
Selecting previously unselected package clickhouse-common-static-dbg.
(Reading database ... 48745 files and directories currently installed.)
Preparing to unpack .../clickhouse-common-static-dbg_25.3.14.10001.altinitystable+asan_amd64.deb ...
Unpacking clickhouse-common-static-dbg (25.3.14.10001.altinitystable+asan) ...
Setting up clickhouse-common-static-dbg (25.3.14.10001.altinitystable+asan) ...
+ return
+ run_with_retry 3 dpkg -i package_folder/clickhouse-server_25.3.14.10001.altinitystable+asan_amd64.deb
+ local retries=3
+ shift
+ local retry=0
+ '[' 0 -ge 3 ']'
+ dpkg -i package_folder/clickhouse-server_25.3.14.10001.altinitystable+asan_amd64.deb
Selecting previously unselected package clickhouse-server.
(Reading database ... 48752 files and directories currently installed.)
Preparing to unpack .../clickhouse-server_25.3.14.10001.altinitystable+asan_amd64.deb ...
Unpacking clickhouse-server (25.3.14.10001.altinitystable+asan) ...
Setting up clickhouse-server (25.3.14.10001.altinitystable+asan) ...
ClickHouse binary is already located at /usr/bin/clickhouse
Symlink /usr/bin/clickhouse-server already exists but it points to /clickhouse. Will replace the old symlink to /usr/bin/clickhouse.
Creating symlink /usr/bin/clickhouse-server to /usr/bin/clickhouse.
Creating symlink /usr/bin/clickhouse-client to /usr/bin/clickhouse.
Creating symlink /usr/bin/clickhouse-local to /usr/bin/clickhouse.
Creating symlink /usr/bin/clickhouse-benchmark to /usr/bin/clickhouse.
Creating symlink /usr/bin/clickhouse-obfuscator to /usr/bin/clickhouse.
Creating symlink /usr/bin/clickhouse-git-import to /usr/bin/clickhouse.
Creating symlink /usr/bin/clickhouse-compressor to /usr/bin/clickhouse.
Creating symlink /usr/bin/clickhouse-format to /usr/bin/clickhouse.
Symlink /usr/bin/clickhouse-extract-from-config already exists but it points to /clickhouse. Will replace the old symlink to /usr/bin/clickhouse.
Creating symlink /usr/bin/clickhouse-extract-from-config to /usr/bin/clickhouse.
Symlink /usr/bin/clickhouse-keeper already exists but it points to /clickhouse. Will replace the old symlink to /usr/bin/clickhouse.
Creating symlink /usr/bin/clickhouse-keeper to /usr/bin/clickhouse.
Symlink /usr/bin/clickhouse-keeper-converter already exists but it points to /clickhouse. Will replace the old symlink to /usr/bin/clickhouse.
Creating symlink /usr/bin/clickhouse-keeper-converter to /usr/bin/clickhouse.
Creating symlink /usr/bin/clickhouse-disks to /usr/bin/clickhouse.
Creating symlink /usr/bin/ch to /usr/bin/clickhouse.
Creating symlink /usr/bin/chl to /usr/bin/clickhouse.
Creating symlink /usr/bin/chc to /usr/bin/clickhouse.
Creating clickhouse group if it does not exist.
groupadd -r clickhouse
Creating clickhouse user if it does not exist.
useradd -r --shell /bin/false --home-dir /nonexistent -g clickhouse clickhouse
Will set ulimits for clickhouse user in /etc/security/limits.d/clickhouse.conf.
Creating config directory /etc/clickhouse-server/config.d that is used for tweaks of main server configuration.
Creating config directory /etc/clickhouse-server/users.d that is used for tweaks of users configuration.
Config file /etc/clickhouse-server/config.xml already exists, will keep it and extract path info from it.
/etc/clickhouse-server/config.xml has /var/lib/clickhouse/ as data path.
/etc/clickhouse-server/config.xml has /var/log/clickhouse-server/ as log path.
Users config file /etc/clickhouse-server/users.xml already exists, will keep it and extract users info from it.
Log directory /var/log/clickhouse-server/ already exists.
Creating data directory /var/lib/clickhouse/.
Creating pid directory /var/run/clickhouse-server.
chown -R clickhouse:clickhouse '/var/log/clickhouse-server/'
chown -R clickhouse:clickhouse '/var/run/clickhouse-server'
chown clickhouse:clickhouse '/var/lib/clickhouse/'
groupadd -r clickhouse-bridge
useradd -r --shell /bin/false --home-dir /nonexistent -g clickhouse-bridge clickhouse-bridge
chown -R clickhouse-bridge:clickhouse-bridge '/usr/bin/clickhouse-odbc-bridge'
chown -R clickhouse-bridge:clickhouse-bridge '/usr/bin/clickhouse-library-bridge'
Password for the default user is an empty string. See /etc/clickhouse-server/users.xml and /etc/clickhouse-server/users.d to change it.
Setting capabilities for clickhouse binary. This is optional.
chown -R clickhouse:clickhouse '/etc/clickhouse-server'
ClickHouse has been successfully installed.
Start clickhouse-server with:
sudo clickhouse start
Start clickhouse-client with:
clickhouse-client
+ return
+ run_with_retry 3 dpkg -i package_folder/clickhouse-client_25.3.14.10001.altinitystable+asan_amd64.deb
+ local retries=3
+ shift
+ local retry=0
+ '[' 0 -ge 3 ']'
+ dpkg -i package_folder/clickhouse-client_25.3.14.10001.altinitystable+asan_amd64.deb
Selecting previously unselected package clickhouse-client.
(Reading database ... 48769 files and directories currently installed.)
Preparing to unpack .../clickhouse-client_25.3.14.10001.altinitystable+asan_amd64.deb ...
Unpacking clickhouse-client (25.3.14.10001.altinitystable+asan) ...
Setting up clickhouse-client (25.3.14.10001.altinitystable+asan) ...
+ return
+ export THREAD_FUZZER_CPU_TIME_PERIOD_US=1000
+ THREAD_FUZZER_CPU_TIME_PERIOD_US=1000
+ export THREAD_FUZZER_SLEEP_PROBABILITY=0.1
+ THREAD_FUZZER_SLEEP_PROBABILITY=0.1
+ export THREAD_FUZZER_SLEEP_TIME_US_MAX=100000
+ THREAD_FUZZER_SLEEP_TIME_US_MAX=100000
+ export THREAD_FUZZER_pthread_mutex_lock_BEFORE_MIGRATE_PROBABILITY=1
+ THREAD_FUZZER_pthread_mutex_lock_BEFORE_MIGRATE_PROBABILITY=1
+ export THREAD_FUZZER_pthread_mutex_lock_AFTER_MIGRATE_PROBABILITY=1
+ THREAD_FUZZER_pthread_mutex_lock_AFTER_MIGRATE_PROBABILITY=1
+ export THREAD_FUZZER_pthread_mutex_unlock_BEFORE_MIGRATE_PROBABILITY=1
+ THREAD_FUZZER_pthread_mutex_unlock_BEFORE_MIGRATE_PROBABILITY=1
+ export THREAD_FUZZER_pthread_mutex_unlock_AFTER_MIGRATE_PROBABILITY=1
+ THREAD_FUZZER_pthread_mutex_unlock_AFTER_MIGRATE_PROBABILITY=1
+ export THREAD_FUZZER_pthread_mutex_lock_BEFORE_SLEEP_PROBABILITY=0.001
+ THREAD_FUZZER_pthread_mutex_lock_BEFORE_SLEEP_PROBABILITY=0.001
+ export THREAD_FUZZER_pthread_mutex_lock_AFTER_SLEEP_PROBABILITY=0.001
+ THREAD_FUZZER_pthread_mutex_lock_AFTER_SLEEP_PROBABILITY=0.001
+ export THREAD_FUZZER_pthread_mutex_unlock_BEFORE_SLEEP_PROBABILITY=0.001
+ THREAD_FUZZER_pthread_mutex_unlock_BEFORE_SLEEP_PROBABILITY=0.001
+ export THREAD_FUZZER_pthread_mutex_unlock_AFTER_SLEEP_PROBABILITY=0.001
+ THREAD_FUZZER_pthread_mutex_unlock_AFTER_SLEEP_PROBABILITY=0.001
+ export THREAD_FUZZER_pthread_mutex_lock_BEFORE_SLEEP_TIME_US_MAX=10000
+ THREAD_FUZZER_pthread_mutex_lock_BEFORE_SLEEP_TIME_US_MAX=10000
+ export THREAD_FUZZER_pthread_mutex_lock_AFTER_SLEEP_TIME_US_MAX=10000
+ THREAD_FUZZER_pthread_mutex_lock_AFTER_SLEEP_TIME_US_MAX=10000
+ export THREAD_FUZZER_pthread_mutex_unlock_BEFORE_SLEEP_TIME_US_MAX=10000
+ THREAD_FUZZER_pthread_mutex_unlock_BEFORE_SLEEP_TIME_US_MAX=10000
+ export THREAD_FUZZER_pthread_mutex_unlock_AFTER_SLEEP_TIME_US_MAX=10000
+ THREAD_FUZZER_pthread_mutex_unlock_AFTER_SLEEP_TIME_US_MAX=10000
+ export THREAD_FUZZER_EXPLICIT_SLEEP_PROBABILITY=0.01
+ THREAD_FUZZER_EXPLICIT_SLEEP_PROBABILITY=0.01
+ export THREAD_FUZZER_EXPLICIT_MEMORY_EXCEPTION_PROBABILITY=0.01
+ THREAD_FUZZER_EXPLICIT_MEMORY_EXCEPTION_PROBABILITY=0.01
+ export ZOOKEEPER_FAULT_INJECTION=1
+ ZOOKEEPER_FAULT_INJECTION=1
+ configure
+ export USE_DATABASE_ORDINARY=1
+ USE_DATABASE_ORDINARY=1
+ export EXPORT_S3_STORAGE_POLICIES=1
+ EXPORT_S3_STORAGE_POLICIES=1
+ /repo/tests/config/install.sh
+ DEST_SERVER_PATH=/etc/clickhouse-server
+ DEST_CLIENT_PATH=/etc/clickhouse-client
+++ dirname /repo/tests/config/install.sh
++ cd /repo/tests/config
++ pwd -P
+ SRC_PATH=/repo/tests/config
+ '[' 0 -ge 2 ']'
+ FAST_TEST=0
+ NO_AZURE=0
+ [[ 0 -gt 0 ]]
+ echo 'Going to install test configs from /repo/tests/config into /etc/clickhouse-server'
+ mkdir -p /etc/clickhouse-server/config.d/
Going to install test configs from /repo/tests/config into /etc/clickhouse-server
+ mkdir -p /etc/clickhouse-server/users.d/
+ mkdir -p /etc/clickhouse-client
+ ln -sf /repo/tests/config/config.d/tmp.xml /etc/clickhouse-server/config.d/
+ ln -sf /repo/tests/config/config.d/zookeeper_write.xml /etc/clickhouse-server/config.d/
+ ln -sf /repo/tests/config/config.d/max_num_to_warn.xml /etc/clickhouse-server/config.d/
+ ln -sf /repo/tests/config/config.d/listen.xml /etc/clickhouse-server/config.d/
+ ln -sf /repo/tests/config/config.d/text_log.xml /etc/clickhouse-server/config.d/
+ ln -sf /repo/tests/config/config.d/blob_storage_log.xml /etc/clickhouse-server/config.d/
+ ln -sf /repo/tests/config/config.d/custom_settings_prefixes.xml /etc/clickhouse-server/config.d/
+ ln -sf /repo/tests/config/config.d/database_catalog_drop_table_concurrency.xml /etc/clickhouse-server/config.d/
+ ln -sf /repo/tests/config/config.d/enable_access_control_improvements.xml /etc/clickhouse-server/config.d/
+ ln -sf /repo/tests/config/config.d/macros.xml /etc/clickhouse-server/config.d/
+ ln -sf /repo/tests/config/config.d/secure_ports.xml /etc/clickhouse-server/config.d/
+ ln -sf /repo/tests/config/config.d/clusters.xml /etc/clickhouse-server/config.d/
+ ln -sf /repo/tests/config/config.d/graphite.xml /etc/clickhouse-server/config.d/
+ ln -sf /repo/tests/config/config.d/graphite_alternative.xml /etc/clickhouse-server/config.d/
+ ln -sf /repo/tests/config/config.d/grpc_protocol.xml /etc/clickhouse-server/config.d/
+ ln -sf /repo/tests/config/config.d/database_atomic.xml /etc/clickhouse-server/config.d/
+ ln -sf /repo/tests/config/config.d/max_concurrent_queries.xml /etc/clickhouse-server/config.d/
+ ln -sf /repo/tests/config/config.d/merge_tree_settings.xml /etc/clickhouse-server/config.d/
+ ln -sf /repo/tests/config/config.d/backoff_failed_mutation.xml /etc/clickhouse-server/config.d/
+ ln -sf /repo/tests/config/config.d/merge_tree_old_dirs_cleanup.xml /etc/clickhouse-server/config.d/
+ ln -sf /repo/tests/config/config.d/test_cluster_with_incorrect_pw.xml /etc/clickhouse-server/config.d/
+ ln -sf /repo/tests/config/config.d/keeper_port.xml /etc/clickhouse-server/config.d/
+ ln -sf /repo/tests/config/config.d/logging_no_rotate.xml /etc/clickhouse-server/config.d/
+ ln -sf /repo/tests/config/config.d/merge_tree.xml /etc/clickhouse-server/config.d/
+ ln -sf /repo/tests/config/config.d/lost_forever_check.xml /etc/clickhouse-server/config.d/
+ ln -sf /repo/tests/config/config.d/tcp_with_proxy.xml /etc/clickhouse-server/config.d/
+ ln -sf /repo/tests/config/config.d/prometheus.xml /etc/clickhouse-server/config.d/
+ ln -sf /repo/tests/config/config.d/top_level_domains_lists.xml /etc/clickhouse-server/config.d/
+ ln -sf /repo/tests/config/config.d/top_level_domains_path.xml /etc/clickhouse-server/config.d/
+ ln -sf /repo/tests/config/config.d/transactions.xml /etc/clickhouse-server/config.d/
+ ln -sf /repo/tests/config/config.d/encryption.xml /etc/clickhouse-server/config.d/
+ ln -sf /repo/tests/config/config.d/zookeeper_log.xml /etc/clickhouse-server/config.d/
+ ln -sf /repo/tests/config/config.d/logger_trace.xml /etc/clickhouse-server/config.d/
+ ln -sf /repo/tests/config/config.d/named_collection.xml /etc/clickhouse-server/config.d/
+ ln -sf /repo/tests/config/config.d/ssl_certs.xml /etc/clickhouse-server/config.d/
+ ln -sf /repo/tests/config/config.d/filesystem_cache_log.xml /etc/clickhouse-server/config.d/
+ ln -sf /repo/tests/config/config.d/session_log.xml /etc/clickhouse-server/config.d/
+ ln -sf /repo/tests/config/config.d/system_unfreeze.xml /etc/clickhouse-server/config.d/
+ ln -sf /repo/tests/config/config.d/enable_zero_copy_replication.xml /etc/clickhouse-server/config.d/
+ ln -sf /repo/tests/config/config.d/nlp.xml /etc/clickhouse-server/config.d/
+ ln -sf /repo/tests/config/config.d/forbidden_headers.xml /etc/clickhouse-server/config.d/
+ ln -sf /repo/tests/config/config.d/enable_keeper_map.xml /etc/clickhouse-server/config.d/
+ ln -sf /repo/tests/config/config.d/custom_disks_base_path.xml /etc/clickhouse-server/config.d/
+ ln -sf /repo/tests/config/config.d/display_name.xml /etc/clickhouse-server/config.d/
+ ln -sf /repo/tests/config/config.d/compressed_marks_and_index.xml /etc/clickhouse-server/config.d/
+ ln -sf /repo/tests/config/config.d/disable_s3_env_credentials.xml /etc/clickhouse-server/config.d/
+ ln -sf /repo/tests/config/config.d/enable_wait_for_shutdown_replicated_tables.xml /etc/clickhouse-server/config.d/
+ ln -sf /repo/tests/config/config.d/backups.xml /etc/clickhouse-server/config.d/
+ ln -sf /repo/tests/config/config.d/filesystem_caches_path.xml /etc/clickhouse-server/config.d/
+ ln -sf /repo/tests/config/config.d/validate_tcp_client_information.xml /etc/clickhouse-server/config.d/
+ ln -sf /repo/tests/config/config.d/zero_copy_destructive_operations.xml /etc/clickhouse-server/config.d/
+ ln -sf /repo/tests/config/config.d/handlers.yaml /etc/clickhouse-server/config.d/
+ ln -sf /repo/tests/config/config.d/threadpool_writer_pool_size.yaml /etc/clickhouse-server/config.d/
+ ln -sf /repo/tests/config/config.d/serverwide_trace_collector.xml /etc/clickhouse-server/config.d/
+ ln -sf /repo/tests/config/config.d/rocksdb.xml /etc/clickhouse-server/config.d/
+ '[' 0 '!=' 1 ']'
+ ln -sf /repo/tests/config/config.d/legacy_geobase.xml /etc/clickhouse-server/config.d/
+ ln -sf /repo/tests/config/users.d/log_queries.xml /etc/clickhouse-server/users.d/
+ ln -sf /repo/tests/config/users.d/readonly.xml /etc/clickhouse-server/users.d/
+ ln -sf /repo/tests/config/users.d/ci_logs_sender.yaml /etc/clickhouse-server/users.d/
+ ln -sf /repo/tests/config/users.d/access_management.xml /etc/clickhouse-server/users.d/
+ ln -sf /repo/tests/config/users.d/database_atomic_drop_detach_sync.xml /etc/clickhouse-server/users.d/
+ ln -sf /repo/tests/config/users.d/opentelemetry.xml /etc/clickhouse-server/users.d/
+ ln -sf /repo/tests/config/users.d/remote_queries.xml /etc/clickhouse-server/users.d/
+ ln -sf /repo/tests/config/users.d/session_log_test.xml /etc/clickhouse-server/users.d/
+ ln -sf /repo/tests/config/users.d/memory_profiler.xml /etc/clickhouse-server/users.d/
+ ln -sf /repo/tests/config/users.d/no_fsync_metadata.xml /etc/clickhouse-server/users.d/
+ ln -sf /repo/tests/config/users.d/filelog.xml /etc/clickhouse-server/users.d/
+ ln -sf /repo/tests/config/users.d/enable_blobs_check.xml /etc/clickhouse-server/users.d/
+ ln -sf /repo/tests/config/users.d/marks.xml /etc/clickhouse-server/users.d/
+ ln -sf /repo/tests/config/users.d/insert_keeper_retries.xml /etc/clickhouse-server/users.d/
+ ln -sf /repo/tests/config/users.d/prefetch_settings.xml /etc/clickhouse-server/users.d/
+ ln -sf /repo/tests/config/users.d/nonconst_timezone.xml /etc/clickhouse-server/users.d/
+ ln -sf /repo/tests/config/users.d/allow_introspection_functions.yaml /etc/clickhouse-server/users.d/
+ ln -sf /repo/tests/config/users.d/replicated_ddl_entry.xml /etc/clickhouse-server/users.d/
+ ln -sf /repo/tests/config/users.d/limits.yaml /etc/clickhouse-server/users.d/
+ [[ -n '' ]]
+ ln -sf /repo/tests/config/users.d/timeouts.xml /etc/clickhouse-server/users.d/
+ ln -sf /repo/tests/config/ints_dictionary.xml /etc/clickhouse-server/
+ ln -sf /repo/tests/config/strings_dictionary.xml /etc/clickhouse-server/
+ ln -sf /repo/tests/config/decimals_dictionary.xml /etc/clickhouse-server/
+ ln -sf /repo/tests/config/executable_dictionary.xml /etc/clickhouse-server/
+ ln -sf /repo/tests/config/executable_pool_dictionary.xml /etc/clickhouse-server/
+ ln -sf /repo/tests/config/test_function.xml /etc/clickhouse-server/
+ ln -sf /repo/tests/config/top_level_domains /etc/clickhouse-server/
+ ln -sf /repo/tests/config/regions_hierarchy.txt /etc/clickhouse-server/config.d/
+ ln -sf /repo/tests/config/regions_names_en.txt /etc/clickhouse-server/config.d/
+ ln -sf /repo/tests/config/regions_names_es.txt /etc/clickhouse-server/config.d/
+ ln -sf /repo/tests/config/ext-en.txt /etc/clickhouse-server/config.d/
+ ln -sf /repo/tests/config/ext-ru.txt /etc/clickhouse-server/config.d/
+ ln -sf /repo/tests/config/lem-en.bin /etc/clickhouse-server/config.d/
+ ln -sf /repo/tests/config/server.key /etc/clickhouse-server/
+ ln -sf /repo/tests/config/server.crt /etc/clickhouse-server/
+ ln -sf /repo/tests/config/dhparam.pem /etc/clickhouse-server/
+ ln -sf --backup=simple --suffix=_original.xml /repo/tests/config/config.d/query_masking_rules.xml /etc/clickhouse-server/config.d/
+ [[ -n 1 ]]
+ [[ 1 -eq 1 ]]
+ rm -f /etc/clickhouse-server/config.d/zookeeper.xml
+ ln -sf /repo/tests/config/config.d/zookeeper_fault_injection.xml /etc/clickhouse-server/config.d/
+ [[ -n '' ]]
+ rm -f /etc/clickhouse-server/config.d/cannot_allocate_thread_injection.xml
+ value=1
+ sed --follow-symlinks -i 's|[01]|1|' /etc/clickhouse-server/config.d/keeper_port.xml
+ value=43558912
+ sed --follow-symlinks -i 's|[[:digit:]]\+|43558912|' /etc/clickhouse-server/config.d/keeper_port.xml
+ value=51085312
+ sed --follow-symlinks -i 's|[[:digit:]]\+|51085312|' /etc/clickhouse-server/config.d/keeper_port.xml
+ value=0
+ sed --follow-symlinks -i 's|[01]|0|' /etc/clickhouse-server/config.d/keeper_port.xml
+ [[ -n '' ]]
+ [[ -n 1 ]]
+ [[ 1 -eq 1 ]]
+ ln -sf /repo/tests/config/users.d/database_ordinary.xml /etc/clickhouse-server/users.d/
+ [[ '' == \1 ]]
+ [[ '' == \1 ]]
+ [[ 1 == \1 ]]
+ [[ 0 != \1 ]]
+ ln -sf /repo/tests/config/config.d/azure_storage_conf.xml /etc/clickhouse-server/config.d/
+ ln -sf /repo/tests/config/config.d/storage_conf.xml /etc/clickhouse-server/config.d/
+ ln -sf /repo/tests/config/config.d/storage_conf_02944.xml /etc/clickhouse-server/config.d/
+ ln -sf /repo/tests/config/config.d/storage_conf_02963.xml /etc/clickhouse-server/config.d/
+ ln -sf /repo/tests/config/config.d/storage_conf_02961.xml /etc/clickhouse-server/config.d/
+ ln -sf /repo/tests/config/users.d/s3_cache.xml /etc/clickhouse-server/users.d/
+ ln -sf /repo/tests/config/users.d/s3_cache_new.xml /etc/clickhouse-server/users.d/
+ [[ '' == \1 ]]
+ [[ '' == \1 ]]
+ ln -sf /repo/tests/config/client_config.xml /etc/clickhouse-client/config.xml
+ sudo cat /etc/clickhouse-server/config.d/keeper_port.xml
+ sed 's|100000|10000|'
+ sudo mv /etc/clickhouse-server/config.d/keeper_port.xml.tmp /etc/clickhouse-server/config.d/keeper_port.xml
+ [[ -n 1 ]]
+ [[ 1 -eq 1 ]]
+ randomize_config_boolean_value filtered_list keeper_port
+ value=0
+ sudo cat /etc/clickhouse-server/config.d/keeper_port.xml
+ sed 's|[01]|0|'
+ sudo mv /etc/clickhouse-server/config.d/keeper_port.xml.tmp /etc/clickhouse-server/config.d/keeper_port.xml
+ randomize_config_boolean_value multi_read keeper_port
+ value=0
+ sudo cat /etc/clickhouse-server/config.d/keeper_port.xml
+ sed 's|[01]|0|'
+ sudo mv /etc/clickhouse-server/config.d/keeper_port.xml.tmp /etc/clickhouse-server/config.d/keeper_port.xml
+ randomize_config_boolean_value check_not_exists keeper_port
+ value=0
+ sudo cat /etc/clickhouse-server/config.d/keeper_port.xml
+ sed 's|[01]|0|'
+ sudo mv /etc/clickhouse-server/config.d/keeper_port.xml.tmp /etc/clickhouse-server/config.d/keeper_port.xml
+ randomize_config_boolean_value create_if_not_exists keeper_port
+ value=0
+ sudo cat /etc/clickhouse-server/config.d/keeper_port.xml
+ sed 's|[01]|0|'
+ sudo mv /etc/clickhouse-server/config.d/keeper_port.xml.tmp /etc/clickhouse-server/config.d/keeper_port.xml
+ randomize_config_boolean_value remove_recursive keeper_port
+ value=0
+ sudo cat /etc/clickhouse-server/config.d/keeper_port.xml
+ sed 's|[01]|0|'
+ sudo mv /etc/clickhouse-server/config.d/keeper_port.xml.tmp /etc/clickhouse-server/config.d/keeper_port.xml
+ sudo chown clickhouse /etc/clickhouse-server/config.d/keeper_port.xml
+ sudo chgrp clickhouse /etc/clickhouse-server/config.d/keeper_port.xml
+ [[ -n 1 ]]
+ [[ 1 -eq 1 ]]
+ randomize_config_boolean_value use_compression zookeeper_fault_injection
+ value=0
+ sudo cat /etc/clickhouse-server/config.d/zookeeper_fault_injection.xml
+ sed 's|[01]|0|'
+ sudo mv /etc/clickhouse-server/config.d/zookeeper_fault_injection.xml.tmp /etc/clickhouse-server/config.d/zookeeper_fault_injection.xml
+ randomize_config_boolean_value use_xid_64 zookeeper_fault_injection
+ value=1
+ sudo cat /etc/clickhouse-server/config.d/zookeeper_fault_injection.xml
+ sed 's|[01]|1|'
+ sudo mv /etc/clickhouse-server/config.d/zookeeper_fault_injection.xml.tmp /etc/clickhouse-server/config.d/zookeeper_fault_injection.xml
+ echo 'ASAN_OPTIONS='\''malloc_context_size=10 verbosity=1 allocator_release_to_os_interval_ms=10000'\'''
+ export 'ASAN_OPTIONS=malloc_context_size=10 allocator_release_to_os_interval_ms=10000'
+ ASAN_OPTIONS='malloc_context_size=10 allocator_release_to_os_interval_ms=10000'
+ sudo chown root: /var/lib/clickhouse
+ local total_mem
++ awk '/MemTotal/ { print $(NF-1) }' /proc/meminfo
+ total_mem=32086444
+ total_mem=32856518656
+ max_server_memory_usage_to_ram_ratio=0.5
+ echo 'Setting max_server_memory_usage_to_ram_ratio to 0.5'
+ cat
Setting max_server_memory_usage_to_ram_ratio to 0.5
Setting max_memory_usage_for_user=9856955596 and max_memory_usage for queries to 10G
+ local max_users_mem
+ max_users_mem=9856955596
+ echo 'Setting max_memory_usage_for_user=9856955596 and max_memory_usage for queries to 10G'
+ cat
+ cat
+ /repo/tests/docker_scripts/setup_minio.sh stateless
+ export MINIO_ROOT_USER=clickhouse
+ MINIO_ROOT_USER=clickhouse
+ export MINIO_ROOT_PASSWORD=clickhouse
+ MINIO_ROOT_PASSWORD=clickhouse
+ main stateless
+ local query_dir
++ check_arg stateless
++ local query_dir
++ '[' '!' 1 -eq 1 ']'
++ case "$1" in
++ query_dir=0_stateless
++ echo 0_stateless
+ query_dir=0_stateless
+ '[' '!' -f ./minio ']'
+ start_minio
+ mkdir -p ./minio_data
+ ./minio --version
minio version RELEASE.2024-08-03T04-33-23Z (commit-id=6efb56851c40da88d1ca15112e2d686a4ecec6b3)
Runtime: go1.22.5 linux/amd64
License: GNU AGPLv3 - https://www.gnu.org/licenses/agpl-3.0.html
Copyright: 2015-2024 MinIO, Inc.
+ wait_for_it
+ local counter=0
+ local max_counter=60
+ local url=http://localhost:11111
+ ./minio server --address :11111 ./minio_data
+ params=('--silent' '--verbose')
+ local params
+ curl --silent --verbose http://localhost:11111
+ grep AccessDenied
trying to connect to minio
+ [[ 0 == \6\0 ]]
+ echo 'trying to connect to minio'
+ sleep 1
INFO: Formatting 1st pool, 1 set(s), 1 drives per set.
INFO: WARNING: Host local has more than 0 drives of set. A host failure will result in data becoming unavailable.
MinIO Object Storage Server
Copyright: 2015-2026 MinIO, Inc.
License: GNU AGPLv3 - https://www.gnu.org/licenses/agpl-3.0.html
Version: RELEASE.2024-08-03T04-33-23Z (go1.22.5 linux/amd64)
API: http://172.17.0.2:11111 http://127.0.0.1:11111
WebUI: http://172.17.0.2:39275 http://127.0.0.1:39275
Docs: https://min.io/docs/minio/linux/index.html
+ counter=1
+ curl --silent --verbose http://localhost:11111
+ grep AccessDenied
AccessDeniedAccess Denied./18D72B5CB6F3CE3B7dc7eb22d3288ec80374614e9088e31d3668a6922ead55932dd2a8e56373820f
+ lsof -i :11111
COMMAND PID USER FD TYPE DEVICE SIZE/OFF NODE NAME
minio 290 root 8u IPv6 15340 0t0 TCP *:11111 (LISTEN)
minio 290 root 9u IPv4 15339 0t0 TCP localhost:11111 (LISTEN)
minio 290 root 10u IPv6 15341 0t0 TCP localhost:11111 (LISTEN)
+ sleep 5
+ setup_minio stateless
+ local test_type=stateless
+ ./mc alias set clickminio http://localhost:11111 clickhouse clickhouse
Added `clickminio` successfully.
+ ./mc admin user add clickminio test testtest
Added user `test` successfully.
+ ./mc admin policy attach clickminio readwrite --user=test
Attached Policies: [readwrite]
To User: test
+ ./mc mb --ignore-existing clickminio/test
Bucket created successfully `clickminio/test`.
+ '[' stateless = stateless ']'
+ ./mc anonymous set public clickminio/test
Access permission for `clickminio/test` is set to `public`
+ upload_data 0_stateless /repo/tests/
+ local query_dir=0_stateless
+ local test_path=/repo/tests/
+ local data_path=/repo/tests//queries/0_stateless/data_minio
+ '[' -d /repo/tests//queries/0_stateless/data_minio ']'
+ ./mc cp --recursive /repo/tests//queries/0_stateless/data_minio/ clickminio/test/
`/repo/tests/queries/0_stateless/data_minio/03036_archive1.tar` -> `clickminio/test/03036_archive1.tar`
`/repo/tests/queries/0_stateless/data_minio/02366_data.jsonl` -> `clickminio/test/02366_data.jsonl`
`/repo/tests/queries/0_stateless/data_minio/02731.arrow` -> `clickminio/test/02731.arrow`
`/repo/tests/queries/0_stateless/data_minio/03036_compressed_file_archive.zip` -> `clickminio/test/03036_compressed_file_archive.zip`
`/repo/tests/queries/0_stateless/data_minio/03036_archive2.tar` -> `clickminio/test/03036_archive2.tar`
`/repo/tests/queries/0_stateless/data_minio/03036_archive2.zip` -> `clickminio/test/03036_archive2.zip`
`/repo/tests/queries/0_stateless/data_minio/03036_archive1.zip` -> `clickminio/test/03036_archive1.zip`
`/repo/tests/queries/0_stateless/data_minio/02731.parquet` -> `clickminio/test/02731.parquet`
`/repo/tests/queries/0_stateless/data_minio/02876.parquet` -> `clickminio/test/02876.parquet`
`/repo/tests/queries/0_stateless/data_minio/03036_archive3.tar.gz` -> `clickminio/test/03036_archive3.tar.gz`
`/repo/tests/queries/0_stateless/data_minio/03036_json_archive.zip` -> `clickminio/test/03036_json_archive.zip`
`/repo/tests/queries/0_stateless/data_minio/03322_a.parquet` -> `clickminio/test/03322_a.parquet`
`/repo/tests/queries/0_stateless/data_minio/03322_b.parquet` -> `clickminio/test/03322_b.parquet`
`/repo/tests/queries/0_stateless/data_minio/a.tsv` -> `clickminio/test/a.tsv`
`/repo/tests/queries/0_stateless/data_minio/b.tsv` -> `clickminio/test/b.tsv`
`/repo/tests/queries/0_stateless/data_minio/c.tsv` -> `clickminio/test/c.tsv`
`/repo/tests/queries/0_stateless/data_minio/est/data/00000-0-52725061-398c-41fa-a222-0981e71942b0-0-00001.parquet` -> `clickminio/test/est/data/00000-0-52725061-398c-41fa-a222-0981e71942b0-0-00001.parquet`
`/repo/tests/queries/0_stateless/data_minio/est/metadata/83521e92-07a7-450d-ba44-3a179b730c85-m0.avro` -> `clickminio/test/est/metadata/83521e92-07a7-450d-ba44-3a179b730c85-m0.avro`
`/repo/tests/queries/0_stateless/data_minio/est/metadata/snap-3858160944799047644-1-83521e92-07a7-450d-ba44-3a179b730c85.avro` -> `clickminio/test/est/metadata/snap-3858160944799047644-1-83521e92-07a7-450d-ba44-3a179b730c85.avro`
`/repo/tests/queries/0_stateless/data_minio/est/metadata/v2.metadata.json` -> `clickminio/test/est/metadata/v2.metadata.json`
`/repo/tests/queries/0_stateless/data_minio/hive_partitioning/column0=Elizabeth/column1=Gordon/sample.parquet` -> `clickminio/test/hive_partitioning/column0=Elizabeth/column1=Gordon/sample.parquet`
`/repo/tests/queries/0_stateless/data_minio/hive_partitioning/column0=Elizabeth/column1=Schmidt/sample.parquet` -> `clickminio/test/hive_partitioning/column0=Elizabeth/column1=Schmidt/sample.parquet`
`/repo/tests/queries/0_stateless/data_minio/hive_partitioning/column0=Elizabeth/sample.parquet` -> `clickminio/test/hive_partitioning/column0=Elizabeth/sample.parquet`
`/repo/tests/queries/0_stateless/data_minio/hive_partitioning/non_existing_column=Elizabeth/sample.parquet` -> `clickminio/test/hive_partitioning/non_existing_column=Elizabeth/sample.parquet`
`/repo/tests/queries/0_stateless/data_minio/json_data` -> `clickminio/test/json_data`
`/repo/tests/queries/0_stateless/data_minio/tsv_with_header.tsv` -> `clickminio/test/tsv_with_header.tsv`
Total: 5.43 MiB, Transferred: 5.43 MiB, Speed: 142.34 MiB/s
+ setup_aws_credentials
+ local minio_root_user=clickhouse
+ local minio_root_password=clickhouse
+ mkdir -p /root/.aws
+ cat
+ config_logs_export_cluster /etc/clickhouse-server/config.d/system_logs_export.yaml
+ azurite-blob --blobHost 0.0.0.0 --blobPort 10000 --silent --inMemoryPersistence
+ set +x
File /tmp/export-logs-config.sh does not exist, do not setup
+ export CLICKHOUSE_MAX_THREADS=8
+ CLICKHOUSE_MAX_THREADS=8
+ export CLICKHOUSE_MAX_CONCURRENT_QUERIES=4
+ CLICKHOUSE_MAX_CONCURRENT_QUERIES=4
+ start_server
+ counter=0
+ max_attempt=120
+ clickhouse-client --query 'SELECT 1'
Code: 210. DB::NetException: Connection refused (localhost:9000). (NETWORK_ERROR)
+ '[' 0 -gt 120 ']'
+ clickhouse start --user root
In-memory extent storage is enabled with a limit of 15667.21 MB (16428259328 bytes, 50% of total memory).
Azurite Blob service is starting on 0.0.0.0:10000
Azurite Blob service successfully listens on http://0.0.0.0:10000
+ sleep 0.5
+ counter=1
+ clickhouse-client --query 'SELECT 1'
Code: 210. DB::NetException: Connection refused (localhost:9000). (NETWORK_ERROR)
+ '[' 1 -gt 120 ']'
+ clickhouse start --user root
+ sleep 0.5
+ counter=2
+ clickhouse-client --query 'SELECT 1'
Code: 210. DB::NetException: Connection refused (localhost:9000). (NETWORK_ERROR)
+ '[' 2 -gt 120 ']'
+ clickhouse start --user root
+ sleep 0.5
+ counter=3
+ clickhouse-client --query 'SELECT 1'
Code: 210. DB::NetException: Connection refused (localhost:9000). (NETWORK_ERROR)
+ '[' 3 -gt 120 ']'
+ clickhouse start --user root
+ sleep 0.5
+ counter=4
+ clickhouse-client --query 'SELECT 1'
Code: 210. DB::NetException: Connection refused (localhost:9000). (NETWORK_ERROR)
+ '[' 4 -gt 120 ']'
+ clickhouse start --user root
+ sleep 0.5
+ counter=5
+ clickhouse-client --query 'SELECT 1'
Code: 210. DB::NetException: Connection refused (localhost:9000). (NETWORK_ERROR)
+ '[' 5 -gt 120 ']'
+ clickhouse start --user root
+ sleep 0.5
+ counter=6
+ clickhouse-client --query 'SELECT 1'
Code: 210. DB::NetException: Connection refused (localhost:9000). (NETWORK_ERROR)
+ '[' 6 -gt 120 ']'
+ clickhouse start --user root
+ sleep 0.5
+ counter=7
+ clickhouse-client --query 'SELECT 1'
Code: 210. DB::NetException: Connection refused (localhost:9000). (NETWORK_ERROR)
+ '[' 7 -gt 120 ']'
+ clickhouse start --user root
+ sleep 0.5
+ counter=8
+ clickhouse-client --query 'SELECT 1'
Code: 210. DB::NetException: Connection refused (localhost:9000). (NETWORK_ERROR)
+ '[' 8 -gt 120 ']'
+ clickhouse start --user root
+ sleep 0.5
+ counter=9
+ clickhouse-client --query 'SELECT 1'
Code: 210. DB::NetException: Connection refused (localhost:9000). (NETWORK_ERROR)
+ '[' 9 -gt 120 ']'
+ clickhouse start --user root
+ sleep 0.5
+ counter=10
+ clickhouse-client --query 'SELECT 1'
Code: 210. DB::NetException: Connection refused (localhost:9000). (NETWORK_ERROR)
+ '[' 10 -gt 120 ']'
+ clickhouse start --user root
+ sleep 0.5
+ counter=11
+ clickhouse-client --query 'SELECT 1'
Code: 210. DB::NetException: Connection refused (localhost:9000). (NETWORK_ERROR)
+ '[' 11 -gt 120 ']'
+ clickhouse start --user root
+ sleep 0.5
+ counter=12
+ clickhouse-client --query 'SELECT 1'
1
+ attach_gdb_to_clickhouse
++ clickhouse local --query 'SELECT count() FROM system.build_options WHERE name = '\''CXX_FLAGS'\'' AND position('\''sanitize=address'\'' IN value)'
+ IS_ASAN=1
+ [[ 1 = \1 ]]
+ echo 'ASAN build detected. Not using gdb since it disables LeakSanitizer detections'
+ setup_logs_replication
ASAN build detected. Not using gdb since it disables LeakSanitizer detections
+ set +x
File /tmp/export-logs-config.sh does not exist, do not setup
+ clickhouse-client --query 'CREATE DATABASE datasets'
+ clickhouse-client
+ clickhouse-client --query 'SHOW TABLES FROM datasets'
hits_v1
visits_v1
+ clickhouse-client --query 'CREATE DATABASE IF NOT EXISTS test'
+ stop_server
+ local max_tries=90
+ local check_hang=true
+ local pid
++ cat /var/run/clickhouse-server/clickhouse-server.pid
+ pid=427
+ for i in {1..30}
+ clickhouse client -q 'SYSTEM STOP DISTRIBUTED SENDS'
+ break
+ clickhouse stop --max-tries 90 --do-not-kill
/var/run/clickhouse-server/clickhouse-server.pid file exists and contains pid = 427.
The process with pid = 427 is running.
Sent terminate signal to process with pid 427.
Waiting for server to stop
/var/run/clickhouse-server/clickhouse-server.pid file exists and contains pid = 427.
The process with pid = 427 is running.
Waiting for server to stop
/var/run/clickhouse-server/clickhouse-server.pid file exists and contains pid = 427.
The process with pid = 427 is running.
Waiting for server to stop
/var/run/clickhouse-server/clickhouse-server.pid file exists and contains pid = 427.
The process with pid = 427 is running.
Waiting for server to stop
/var/run/clickhouse-server/clickhouse-server.pid file exists and contains pid = 427.
The process with pid = 427 is running.
Waiting for server to stop
/var/run/clickhouse-server/clickhouse-server.pid file exists and contains pid = 427.
The process with pid = 427 is running.
Waiting for server to stop
/var/run/clickhouse-server/clickhouse-server.pid file exists and contains pid = 427.
The process with pid = 427 is running.
Waiting for server to stop
/var/run/clickhouse-server/clickhouse-server.pid file exists and contains pid = 427.
The process with pid = 427 is running.
Waiting for server to stop
/var/run/clickhouse-server/clickhouse-server.pid file exists and contains pid = 427.
The process with pid = 427 is running.
Waiting for server to stop
/var/run/clickhouse-server/clickhouse-server.pid file exists and contains pid = 427.
The process with pid = 427 is running.
Waiting for server to stop
/var/run/clickhouse-server/clickhouse-server.pid file exists and contains pid = 427.
The process with pid = 427 is running.
Waiting for server to stop
/var/run/clickhouse-server/clickhouse-server.pid file exists and contains pid = 427.
The process with pid = 427 is running.
Waiting for server to stop
/var/run/clickhouse-server/clickhouse-server.pid file exists and contains pid = 427.
The process with pid = 427 is running.
Waiting for server to stop
Found pid = 1338 in the list of running processes.
The process with pid = 1338 is running.
Waiting for server to stop
Now there is no clickhouse-server process.
Server stopped
+ return
+ mv /var/log/clickhouse-server/clickhouse-server.log /var/log/clickhouse-server/clickhouse-server.initial.log
+ cache_policy=
+ '[' 1 -eq 1 ']'
+ cache_policy=SLRU
+ echo 'Using cache policy: SLRU'
Using cache policy: SLRU
+ '[' SLRU = SLRU ']'
+ sudo cat /etc/clickhouse-server/config.d/storage_conf.xml
+ sed 's|LRU|SLRU|'
+ mv /etc/clickhouse-server/config.d/storage_conf.xml.tmp /etc/clickhouse-server/config.d/storage_conf.xml
+ sudo cat /etc/clickhouse-server/users.d/stress_tests_overrides.xml
cat: /etc/clickhouse-server/users.d/stress_tests_overrides.xml: No such file or directory
+ start_server
+ counter=0
+ max_attempt=120
+ clickhouse-client --query 'SELECT 1'
Code: 210. DB::NetException: Connection refused (localhost:9000). (NETWORK_ERROR)
+ '[' 0 -gt 120 ']'
+ clickhouse start --user root
+ sleep 0.5
+ counter=1
+ clickhouse-client --query 'SELECT 1'
Code: 210. DB::NetException: Connection refused (localhost:9000). (NETWORK_ERROR)
+ '[' 1 -gt 120 ']'
+ clickhouse start --user root
+ sleep 0.5
+ counter=2
+ clickhouse-client --query 'SELECT 1'
Code: 210. DB::NetException: Connection refused (localhost:9000). (NETWORK_ERROR)
+ '[' 2 -gt 120 ']'
+ clickhouse start --user root
+ sleep 0.5
+ counter=3
+ clickhouse-client --query 'SELECT 1'
Code: 210. DB::NetException: Connection refused (localhost:9000). (NETWORK_ERROR)
+ '[' 3 -gt 120 ']'
+ clickhouse start --user root
+ sleep 0.5
+ counter=4
+ clickhouse-client --query 'SELECT 1'
Code: 210. DB::NetException: Connection refused (localhost:9000). (NETWORK_ERROR)
+ '[' 4 -gt 120 ']'
+ clickhouse start --user root
+ sleep 0.5
+ counter=5
+ clickhouse-client --query 'SELECT 1'
Code: 210. DB::NetException: Connection refused (localhost:9000). (NETWORK_ERROR)
+ '[' 5 -gt 120 ']'
+ clickhouse start --user root
+ sleep 0.5
+ counter=6
+ clickhouse-client --query 'SELECT 1'
Code: 210. DB::NetException: Connection refused (localhost:9000). (NETWORK_ERROR)
+ '[' 6 -gt 120 ']'
+ clickhouse start --user root
+ sleep 0.5
+ counter=7
+ clickhouse-client --query 'SELECT 1'
Code: 210. DB::NetException: Connection refused (localhost:9000). (NETWORK_ERROR)
+ '[' 7 -gt 120 ']'
+ clickhouse start --user root
+ sleep 0.5
+ counter=8
+ clickhouse-client --query 'SELECT 1'
Code: 210. DB::NetException: Connection refused (localhost:9000). (NETWORK_ERROR)
+ '[' 8 -gt 120 ']'
+ clickhouse start --user root
+ sleep 0.5
+ counter=9
+ clickhouse-client --query 'SELECT 1'
Code: 210. DB::NetException: Connection refused (localhost:9000). (NETWORK_ERROR)
+ '[' 9 -gt 120 ']'
+ clickhouse start --user root
+ sleep 0.5
+ counter=10
+ clickhouse-client --query 'SELECT 1'
Code: 210. DB::NetException: Connection refused (localhost:9000). (NETWORK_ERROR)
+ '[' 10 -gt 120 ']'
+ clickhouse start --user root
+ sleep 0.5
+ counter=11
+ clickhouse-client --query 'SELECT 1'
Code: 210. DB::NetException: Connection refused (localhost:9000). (NETWORK_ERROR)
+ '[' 11 -gt 120 ']'
+ clickhouse start --user root
+ sleep 0.5
+ counter=12
+ clickhouse-client --query 'SELECT 1'
Code: 210. DB::NetException: Connection refused (localhost:9000). (NETWORK_ERROR)
+ '[' 12 -gt 120 ']'
+ clickhouse start --user root
+ sleep 0.5
+ counter=13
+ clickhouse-client --query 'SELECT 1'
Code: 210. DB::NetException: Connection refused (localhost:9000). (NETWORK_ERROR)
+ '[' 13 -gt 120 ']'
+ clickhouse start --user root
+ sleep 0.5
+ counter=14
+ clickhouse-client --query 'SELECT 1'
Code: 210. DB::NetException: Connection refused (localhost:9000). (NETWORK_ERROR)
+ '[' 14 -gt 120 ']'
+ clickhouse start --user root
+ sleep 0.5
+ counter=15
+ clickhouse-client --query 'SELECT 1'
Code: 210. DB::NetException: Connection refused (localhost:9000). (NETWORK_ERROR)
+ '[' 15 -gt 120 ']'
+ clickhouse start --user root
+ sleep 0.5
+ counter=16
+ clickhouse-client --query 'SELECT 1'
1
+ attach_gdb_to_clickhouse
++ clickhouse local --query 'SELECT count() FROM system.build_options WHERE name = '\''CXX_FLAGS'\'' AND position('\''sanitize=address'\'' IN value)'
+ IS_ASAN=1
+ [[ 1 = \1 ]]
+ echo 'ASAN build detected. Not using gdb since it disables LeakSanitizer detections'
+ clickhouse-client --query 'SHOW TABLES FROM datasets'
ASAN build detected. Not using gdb since it disables LeakSanitizer detections
hits_v1
visits_v1
+ clickhouse-client --query 'SHOW TABLES FROM test'
+ [[ '' == \1 ]]
+ [[ '' == \1 ]]
+ TEMP_POLICY=default
+ clickhouse-client --query 'CREATE TABLE test.hits_s3 (WatchID UInt64, JavaEnable UInt8, Title String, GoodEvent Int16,
EventTime DateTime, EventDate Date, CounterID UInt32, ClientIP UInt32, ClientIP6 FixedString(16), RegionID UInt32,
UserID UInt64, CounterClass Int8, OS UInt8, UserAgent UInt8, URL String, Referer String, URLDomain String, RefererDomain String,
Refresh UInt8, IsRobot UInt8, RefererCategories Array(UInt16), URLCategories Array(UInt16), URLRegions Array(UInt32),
RefererRegions Array(UInt32), ResolutionWidth UInt16, ResolutionHeight UInt16, ResolutionDepth UInt8, FlashMajor UInt8,
FlashMinor UInt8, FlashMinor2 String, NetMajor UInt8, NetMinor UInt8, UserAgentMajor UInt16, UserAgentMinor FixedString(2),
CookieEnable UInt8, JavascriptEnable UInt8, IsMobile UInt8, MobilePhone UInt8, MobilePhoneModel String, Params String,
IPNetworkID UInt32, TraficSourceID Int8, SearchEngineID UInt16, SearchPhrase String, AdvEngineID UInt8, IsArtifical UInt8,
WindowClientWidth UInt16, WindowClientHeight UInt16, ClientTimeZone Int16, ClientEventTime DateTime, SilverlightVersion1 UInt8,
SilverlightVersion2 UInt8, SilverlightVersion3 UInt32, SilverlightVersion4 UInt16, PageCharset String, CodeVersion UInt32,
IsLink UInt8, IsDownload UInt8, IsNotBounce UInt8, FUniqID UInt64, HID UInt32, IsOldCounter UInt8, IsEvent UInt8,
IsParameter UInt8, DontCountHits UInt8, WithHash UInt8, HitColor FixedString(1), UTCEventTime DateTime, Age UInt8,
Sex UInt8, Income UInt8, Interests UInt16, Robotness UInt8, GeneralInterests Array(UInt16), RemoteIP UInt32,
RemoteIP6 FixedString(16), WindowName Int32, OpenerName Int32, HistoryLength Int16, BrowserLanguage FixedString(2),
BrowserCountry FixedString(2), SocialNetwork String, SocialAction String, HTTPError UInt16, SendTiming Int32,
DNSTiming Int32, ConnectTiming Int32, ResponseStartTiming Int32, ResponseEndTiming Int32, FetchTiming Int32,
RedirectTiming Int32, DOMInteractiveTiming Int32, DOMContentLoadedTiming Int32, DOMCompleteTiming Int32,
LoadEventStartTiming Int32, LoadEventEndTiming Int32, NSToDOMContentLoadedTiming Int32, FirstPaintTiming Int32,
RedirectCount Int8, SocialSourceNetworkID UInt8, SocialSourcePage String, ParamPrice Int64, ParamOrderID String,
ParamCurrency FixedString(3), ParamCurrencyID UInt16, GoalsReached Array(UInt32), OpenstatServiceName String,
OpenstatCampaignID String, OpenstatAdID String, OpenstatSourceID String, UTMSource String, UTMMedium String,
UTMCampaign String, UTMContent String, UTMTerm String, FromTag String, HasGCLID UInt8, RefererHash UInt64,
URLHash UInt64, CLID UInt32, YCLID UInt64, ShareService String, ShareURL String, ShareTitle String,
ParsedParams Nested(Key1 String, Key2 String, Key3 String, Key4 String, Key5 String, ValueDouble Float64),
IslandID FixedString(16), RequestNum UInt32, RequestTry UInt8) ENGINE = MergeTree() PARTITION BY toYYYYMM(EventDate)
ORDER BY (CounterID, EventDate, intHash32(UserID)) SAMPLE BY intHash32(UserID) SETTINGS index_granularity = 8192, storage_policy='\''default'\'''
+ clickhouse-client --query 'CREATE TABLE test.hits (WatchID UInt64, JavaEnable UInt8, Title String, GoodEvent Int16,
EventTime DateTime, EventDate Date, CounterID UInt32, ClientIP UInt32, ClientIP6 FixedString(16), RegionID UInt32,
UserID UInt64, CounterClass Int8, OS UInt8, UserAgent UInt8, URL String, Referer String, URLDomain String,
RefererDomain String, Refresh UInt8, IsRobot UInt8, RefererCategories Array(UInt16), URLCategories Array(UInt16),
URLRegions Array(UInt32), RefererRegions Array(UInt32), ResolutionWidth UInt16, ResolutionHeight UInt16, ResolutionDepth UInt8,
FlashMajor UInt8, FlashMinor UInt8, FlashMinor2 String, NetMajor UInt8, NetMinor UInt8, UserAgentMajor UInt16,
UserAgentMinor FixedString(2), CookieEnable UInt8, JavascriptEnable UInt8, IsMobile UInt8, MobilePhone UInt8,
MobilePhoneModel String, Params String, IPNetworkID UInt32, TraficSourceID Int8, SearchEngineID UInt16,
SearchPhrase String, AdvEngineID UInt8, IsArtifical UInt8, WindowClientWidth UInt16, WindowClientHeight UInt16,
ClientTimeZone Int16, ClientEventTime DateTime, SilverlightVersion1 UInt8, SilverlightVersion2 UInt8, SilverlightVersion3 UInt32,
SilverlightVersion4 UInt16, PageCharset String, CodeVersion UInt32, IsLink UInt8, IsDownload UInt8, IsNotBounce UInt8,
FUniqID UInt64, HID UInt32, IsOldCounter UInt8, IsEvent UInt8, IsParameter UInt8, DontCountHits UInt8, WithHash UInt8,
HitColor FixedString(1), UTCEventTime DateTime, Age UInt8, Sex UInt8, Income UInt8, Interests UInt16, Robotness UInt8,
GeneralInterests Array(UInt16), RemoteIP UInt32, RemoteIP6 FixedString(16), WindowName Int32, OpenerName Int32,
HistoryLength Int16, BrowserLanguage FixedString(2), BrowserCountry FixedString(2), SocialNetwork String, SocialAction String,
HTTPError UInt16, SendTiming Int32, DNSTiming Int32, ConnectTiming Int32, ResponseStartTiming Int32, ResponseEndTiming Int32,
FetchTiming Int32, RedirectTiming Int32, DOMInteractiveTiming Int32, DOMContentLoadedTiming Int32, DOMCompleteTiming Int32,
LoadEventStartTiming Int32, LoadEventEndTiming Int32, NSToDOMContentLoadedTiming Int32, FirstPaintTiming Int32,
RedirectCount Int8, SocialSourceNetworkID UInt8, SocialSourcePage String, ParamPrice Int64, ParamOrderID String,
ParamCurrency FixedString(3), ParamCurrencyID UInt16, GoalsReached Array(UInt32), OpenstatServiceName String,
OpenstatCampaignID String, OpenstatAdID String, OpenstatSourceID String, UTMSource String, UTMMedium String,
UTMCampaign String, UTMContent String, UTMTerm String, FromTag String, HasGCLID UInt8, RefererHash UInt64,
URLHash UInt64, CLID UInt32, YCLID UInt64, ShareService String, ShareURL String, ShareTitle String,
ParsedParams Nested(Key1 String, Key2 String, Key3 String, Key4 String, Key5 String, ValueDouble Float64),
IslandID FixedString(16), RequestNum UInt32, RequestTry UInt8) ENGINE = MergeTree() PARTITION BY toYYYYMM(EventDate)
ORDER BY (CounterID, EventDate, intHash32(UserID)) SAMPLE BY intHash32(UserID) SETTINGS index_granularity = 8192, storage_policy='\''default'\'''
+ clickhouse-client --query 'CREATE TABLE test.visits (CounterID UInt32, StartDate Date, Sign Int8, IsNew UInt8,
VisitID UInt64, UserID UInt64, StartTime DateTime, Duration UInt32, UTCStartTime DateTime, PageViews Int32,
Hits Int32, IsBounce UInt8, Referer String, StartURL String, RefererDomain String, StartURLDomain String,
EndURL String, LinkURL String, IsDownload UInt8, TraficSourceID Int8, SearchEngineID UInt16, SearchPhrase String,
AdvEngineID UInt8, PlaceID Int32, RefererCategories Array(UInt16), URLCategories Array(UInt16), URLRegions Array(UInt32),
RefererRegions Array(UInt32), IsYandex UInt8, GoalReachesDepth Int32, GoalReachesURL Int32, GoalReachesAny Int32,
SocialSourceNetworkID UInt8, SocialSourcePage String, MobilePhoneModel String, ClientEventTime DateTime, RegionID UInt32,
ClientIP UInt32, ClientIP6 FixedString(16), RemoteIP UInt32, RemoteIP6 FixedString(16), IPNetworkID UInt32,
SilverlightVersion3 UInt32, CodeVersion UInt32, ResolutionWidth UInt16, ResolutionHeight UInt16, UserAgentMajor UInt16,
UserAgentMinor UInt16, WindowClientWidth UInt16, WindowClientHeight UInt16, SilverlightVersion2 UInt8, SilverlightVersion4 UInt16,
FlashVersion3 UInt16, FlashVersion4 UInt16, ClientTimeZone Int16, OS UInt8, UserAgent UInt8, ResolutionDepth UInt8,
FlashMajor UInt8, FlashMinor UInt8, NetMajor UInt8, NetMinor UInt8, MobilePhone UInt8, SilverlightVersion1 UInt8,
Age UInt8, Sex UInt8, Income UInt8, JavaEnable UInt8, CookieEnable UInt8, JavascriptEnable UInt8, IsMobile UInt8,
BrowserLanguage UInt16, BrowserCountry UInt16, Interests UInt16, Robotness UInt8, GeneralInterests Array(UInt16),
Params Array(String), Goals Nested(ID UInt32, Serial UInt32, EventTime DateTime, Price Int64, OrderID String, CurrencyID UInt32),
WatchIDs Array(UInt64), ParamSumPrice Int64, ParamCurrency FixedString(3), ParamCurrencyID UInt16, ClickLogID UInt64,
ClickEventID Int32, ClickGoodEvent Int32, ClickEventTime DateTime, ClickPriorityID Int32, ClickPhraseID Int32, ClickPageID Int32,
ClickPlaceID Int32, ClickTypeID Int32, ClickResourceID Int32, ClickCost UInt32, ClickClientIP UInt32, ClickDomainID UInt32,
ClickURL String, ClickAttempt UInt8, ClickOrderID UInt32, ClickBannerID UInt32, ClickMarketCategoryID UInt32, ClickMarketPP UInt32,
ClickMarketCategoryName String, ClickMarketPPName String, ClickAWAPSCampaignName String, ClickPageName String, ClickTargetType UInt16,
ClickTargetPhraseID UInt64, ClickContextType UInt8, ClickSelectType Int8, ClickOptions String, ClickGroupBannerID Int32,
OpenstatServiceName String, OpenstatCampaignID String, OpenstatAdID String, OpenstatSourceID String, UTMSource String,
UTMMedium String, UTMCampaign String, UTMContent String, UTMTerm String, FromTag String, HasGCLID UInt8, FirstVisit DateTime,
PredLastVisit Date, LastVisit Date, TotalVisits UInt32, TraficSource Nested(ID Int8, SearchEngineID UInt16, AdvEngineID UInt8,
PlaceID UInt16, SocialSourceNetworkID UInt8, Domain String, SearchPhrase String, SocialSourcePage String), Attendance FixedString(16),
CLID UInt32, YCLID UInt64, NormalizedRefererHash UInt64, SearchPhraseHash UInt64, RefererDomainHash UInt64, NormalizedStartURLHash UInt64,
StartURLDomainHash UInt64, NormalizedEndURLHash UInt64, TopLevelDomain UInt64, URLScheme UInt64, OpenstatServiceNameHash UInt64,
OpenstatCampaignIDHash UInt64, OpenstatAdIDHash UInt64, OpenstatSourceIDHash UInt64, UTMSourceHash UInt64, UTMMediumHash UInt64,
UTMCampaignHash UInt64, UTMContentHash UInt64, UTMTermHash UInt64, FromHash UInt64, WebVisorEnabled UInt8, WebVisorActivity UInt32,
ParsedParams Nested(Key1 String, Key2 String, Key3 String, Key4 String, Key5 String, ValueDouble Float64),
Market Nested(Type UInt8, GoalID UInt32, OrderID String, OrderPrice Int64, PP UInt32, DirectPlaceID UInt32, DirectOrderID UInt32,
DirectBannerID UInt32, GoodID String, GoodName String, GoodQuantity Int32, GoodPrice Int64), IslandID FixedString(16))
ENGINE = CollapsingMergeTree(Sign) PARTITION BY toYYYYMM(StartDate) ORDER BY (CounterID, StartDate, intHash32(UserID), VisitID)
SAMPLE BY intHash32(UserID) SETTINGS index_granularity = 8192, storage_policy='\''default'\'''
+ clickhouse-client --query 'INSERT INTO test.hits_s3 SELECT * FROM datasets.hits_v1 SETTINGS enable_filesystem_cache_on_write_operations=0, max_insert_threads=16'
Received exception from server (version 25.3.14):
Code: 241. DB::Exception: Received from localhost:9000. DB::Exception: User memory limit exceeded: would use 9.18 GiB (attempt to allocate chunk of 1.35 MiB bytes), maximum: 9.18 GiB. OvercommitTracker decision: Query was selected to stop by OvercommitTracker: (avg_value_size_hint = 137.9437255859375, avg_chars_size = 155.932470703125, limit = 8192): (while reading column Title): (while reading from part store/78e/78ebf6a1-d987-4579-b3ec-00c1a087b1f3/201403_1_1_2/ in table datasets.hits_v1 (78ebf6a1-d987-4579-b3ec-00c1a087b1f3) located on disk __tmp_internal_262634248876485800814430204900764312493 of type web, from mark 92 with max_rows_to_read = 8192): While executing MergeTreeSelect(pool: ReadPool, algorithm: Thread). (MEMORY_LIMIT_EXCEEDED)
(query: INSERT INTO test.hits_s3 SELECT * FROM datasets.hits_v1 SETTINGS enable_filesystem_cache_on_write_operations=0, max_insert_threads=16)
+ clickhouse-client --query 'INSERT INTO test.hits SELECT * FROM datasets.hits_v1 SETTINGS enable_filesystem_cache_on_write_operations=0, max_insert_threads=16'
Received exception from server (version 25.3.14):
Code: 241. DB::Exception: Received from localhost:9000. DB::Exception: User memory limit exceeded: would use 9.18 GiB (attempt to allocate chunk of 1.06 MiB bytes), maximum: 9.18 GiB. OvercommitTracker decision: Query was selected to stop by OvercommitTracker: (while reading column WindowName): (while reading from part store/78e/78ebf6a1-d987-4579-b3ec-00c1a087b1f3/201403_1_1_2/ in table datasets.hits_v1 (78ebf6a1-d987-4579-b3ec-00c1a087b1f3) located on disk __tmp_internal_262634248876485800814430204900764312493 of type web, from mark 24 with max_rows_to_read = 8192): While executing MergeTreeSelect(pool: ReadPool, algorithm: Thread). (MEMORY_LIMIT_EXCEEDED)
(query: INSERT INTO test.hits SELECT * FROM datasets.hits_v1 SETTINGS enable_filesystem_cache_on_write_operations=0, max_insert_threads=16)
+ clickhouse-client --query 'INSERT INTO test.visits SELECT * FROM datasets.visits_v1 SETTINGS enable_filesystem_cache_on_write_operations=0, max_insert_threads=16'
+ clickhouse-client --query 'DROP TABLE datasets.visits_v1 SYNC'
+ clickhouse-client --query 'DROP TABLE datasets.hits_v1 SYNC'
+ clickhouse-client --query 'SHOW TABLES FROM test'
hits
hits_s3
visits
+ clickhouse-client --query 'SYSTEM STOP THREAD FUZZER'
+ stop_server
+ local max_tries=90
+ local check_hang=true
+ local pid
++ cat /var/run/clickhouse-server/clickhouse-server.pid
+ pid=1362
+ for i in {1..30}
+ clickhouse client -q 'SYSTEM STOP DISTRIBUTED SENDS'
+ break
+ clickhouse stop --max-tries 90 --do-not-kill
/var/run/clickhouse-server/clickhouse-server.pid file exists and contains pid = 1362.
The process with pid = 1362 is running.
Sent terminate signal to process with pid 1362.
Waiting for server to stop
/var/run/clickhouse-server/clickhouse-server.pid file exists and contains pid = 1362.
The process with pid = 1362 is running.
Waiting for server to stop
/var/run/clickhouse-server/clickhouse-server.pid file exists and contains pid = 1362.
The process with pid = 1362 is running.
Waiting for server to stop
/var/run/clickhouse-server/clickhouse-server.pid file exists and contains pid = 1362.
The process with pid = 1362 is running.
Waiting for server to stop
/var/run/clickhouse-server/clickhouse-server.pid file exists and contains pid = 1362.
The process with pid = 1362 is running.
Waiting for server to stop
/var/run/clickhouse-server/clickhouse-server.pid file exists and contains pid = 1362.
The process with pid = 1362 is running.
Waiting for server to stop
/var/run/clickhouse-server/clickhouse-server.pid file exists and contains pid = 1362.
The process with pid = 1362 is running.
Waiting for server to stop
/var/run/clickhouse-server/clickhouse-server.pid file exists and contains pid = 1362.
The process with pid = 1362 is running.
Waiting for server to stop
/var/run/clickhouse-server/clickhouse-server.pid file exists and contains pid = 1362.
The process with pid = 1362 is running.
Waiting for server to stop
/var/run/clickhouse-server/clickhouse-server.pid file exists and contains pid = 1362.
The process with pid = 1362 is running.
Waiting for server to stop
/var/run/clickhouse-server/clickhouse-server.pid file exists and contains pid = 1362.
The process with pid = 1362 is running.
Waiting for server to stop
Now there is no clickhouse-server process.
Server stopped
+ return
+ export RANDOMIZE_OBJECT_KEY_TYPE=1
+ RANDOMIZE_OBJECT_KEY_TYPE=1
+ export ZOOKEEPER_FAULT_INJECTION=1
+ ZOOKEEPER_FAULT_INJECTION=1
+ export THREAD_POOL_FAULT_INJECTION=1
+ THREAD_POOL_FAULT_INJECTION=1
+ configure
+ export USE_DATABASE_ORDINARY=1
+ USE_DATABASE_ORDINARY=1
+ export EXPORT_S3_STORAGE_POLICIES=1
+ EXPORT_S3_STORAGE_POLICIES=1
+ /repo/tests/config/install.sh
+ DEST_SERVER_PATH=/etc/clickhouse-server
+ DEST_CLIENT_PATH=/etc/clickhouse-client
+++ dirname /repo/tests/config/install.sh
++ cd /repo/tests/config
++ pwd -P
+ SRC_PATH=/repo/tests/config
+ '[' 0 -ge 2 ']'
+ FAST_TEST=0
+ NO_AZURE=0
+ [[ 0 -gt 0 ]]
+ echo 'Going to install test configs from /repo/tests/config into /etc/clickhouse-server'
+ mkdir -p /etc/clickhouse-server/config.d/
Going to install test configs from /repo/tests/config into /etc/clickhouse-server
+ mkdir -p /etc/clickhouse-server/users.d/
+ mkdir -p /etc/clickhouse-client
+ ln -sf /repo/tests/config/config.d/tmp.xml /etc/clickhouse-server/config.d/
+ ln -sf /repo/tests/config/config.d/zookeeper_write.xml /etc/clickhouse-server/config.d/
+ ln -sf /repo/tests/config/config.d/max_num_to_warn.xml /etc/clickhouse-server/config.d/
+ ln -sf /repo/tests/config/config.d/listen.xml /etc/clickhouse-server/config.d/
+ ln -sf /repo/tests/config/config.d/text_log.xml /etc/clickhouse-server/config.d/
+ ln -sf /repo/tests/config/config.d/blob_storage_log.xml /etc/clickhouse-server/config.d/
+ ln -sf /repo/tests/config/config.d/custom_settings_prefixes.xml /etc/clickhouse-server/config.d/
+ ln -sf /repo/tests/config/config.d/database_catalog_drop_table_concurrency.xml /etc/clickhouse-server/config.d/
+ ln -sf /repo/tests/config/config.d/enable_access_control_improvements.xml /etc/clickhouse-server/config.d/
+ ln -sf /repo/tests/config/config.d/macros.xml /etc/clickhouse-server/config.d/
+ ln -sf /repo/tests/config/config.d/secure_ports.xml /etc/clickhouse-server/config.d/
+ ln -sf /repo/tests/config/config.d/clusters.xml /etc/clickhouse-server/config.d/
+ ln -sf /repo/tests/config/config.d/graphite.xml /etc/clickhouse-server/config.d/
+ ln -sf /repo/tests/config/config.d/graphite_alternative.xml /etc/clickhouse-server/config.d/
+ ln -sf /repo/tests/config/config.d/grpc_protocol.xml /etc/clickhouse-server/config.d/
+ ln -sf /repo/tests/config/config.d/database_atomic.xml /etc/clickhouse-server/config.d/
+ ln -sf /repo/tests/config/config.d/max_concurrent_queries.xml /etc/clickhouse-server/config.d/
+ ln -sf /repo/tests/config/config.d/merge_tree_settings.xml /etc/clickhouse-server/config.d/
+ ln -sf /repo/tests/config/config.d/backoff_failed_mutation.xml /etc/clickhouse-server/config.d/
+ ln -sf /repo/tests/config/config.d/merge_tree_old_dirs_cleanup.xml /etc/clickhouse-server/config.d/
+ ln -sf /repo/tests/config/config.d/test_cluster_with_incorrect_pw.xml /etc/clickhouse-server/config.d/
+ ln -sf /repo/tests/config/config.d/keeper_port.xml /etc/clickhouse-server/config.d/
+ ln -sf /repo/tests/config/config.d/logging_no_rotate.xml /etc/clickhouse-server/config.d/
+ ln -sf /repo/tests/config/config.d/merge_tree.xml /etc/clickhouse-server/config.d/
+ ln -sf /repo/tests/config/config.d/lost_forever_check.xml /etc/clickhouse-server/config.d/
+ ln -sf /repo/tests/config/config.d/tcp_with_proxy.xml /etc/clickhouse-server/config.d/
+ ln -sf /repo/tests/config/config.d/prometheus.xml /etc/clickhouse-server/config.d/
+ ln -sf /repo/tests/config/config.d/top_level_domains_lists.xml /etc/clickhouse-server/config.d/
+ ln -sf /repo/tests/config/config.d/top_level_domains_path.xml /etc/clickhouse-server/config.d/
+ ln -sf /repo/tests/config/config.d/transactions.xml /etc/clickhouse-server/config.d/
+ ln -sf /repo/tests/config/config.d/encryption.xml /etc/clickhouse-server/config.d/
+ ln -sf /repo/tests/config/config.d/zookeeper_log.xml /etc/clickhouse-server/config.d/
+ ln -sf /repo/tests/config/config.d/logger_trace.xml /etc/clickhouse-server/config.d/
+ ln -sf /repo/tests/config/config.d/named_collection.xml /etc/clickhouse-server/config.d/
+ ln -sf /repo/tests/config/config.d/ssl_certs.xml /etc/clickhouse-server/config.d/
+ ln -sf /repo/tests/config/config.d/filesystem_cache_log.xml /etc/clickhouse-server/config.d/
+ ln -sf /repo/tests/config/config.d/session_log.xml /etc/clickhouse-server/config.d/
+ ln -sf /repo/tests/config/config.d/system_unfreeze.xml /etc/clickhouse-server/config.d/
+ ln -sf /repo/tests/config/config.d/enable_zero_copy_replication.xml /etc/clickhouse-server/config.d/
+ ln -sf /repo/tests/config/config.d/nlp.xml /etc/clickhouse-server/config.d/
+ ln -sf /repo/tests/config/config.d/forbidden_headers.xml /etc/clickhouse-server/config.d/
+ ln -sf /repo/tests/config/config.d/enable_keeper_map.xml /etc/clickhouse-server/config.d/
+ ln -sf /repo/tests/config/config.d/custom_disks_base_path.xml /etc/clickhouse-server/config.d/
+ ln -sf /repo/tests/config/config.d/display_name.xml /etc/clickhouse-server/config.d/
+ ln -sf /repo/tests/config/config.d/compressed_marks_and_index.xml /etc/clickhouse-server/config.d/
+ ln -sf /repo/tests/config/config.d/disable_s3_env_credentials.xml /etc/clickhouse-server/config.d/
+ ln -sf /repo/tests/config/config.d/enable_wait_for_shutdown_replicated_tables.xml /etc/clickhouse-server/config.d/
+ ln -sf /repo/tests/config/config.d/backups.xml /etc/clickhouse-server/config.d/
+ ln -sf /repo/tests/config/config.d/filesystem_caches_path.xml /etc/clickhouse-server/config.d/
+ ln -sf /repo/tests/config/config.d/validate_tcp_client_information.xml /etc/clickhouse-server/config.d/
+ ln -sf /repo/tests/config/config.d/zero_copy_destructive_operations.xml /etc/clickhouse-server/config.d/
+ ln -sf /repo/tests/config/config.d/handlers.yaml /etc/clickhouse-server/config.d/
+ ln -sf /repo/tests/config/config.d/threadpool_writer_pool_size.yaml /etc/clickhouse-server/config.d/
+ ln -sf /repo/tests/config/config.d/serverwide_trace_collector.xml /etc/clickhouse-server/config.d/
+ ln -sf /repo/tests/config/config.d/rocksdb.xml /etc/clickhouse-server/config.d/
+ '[' 0 '!=' 1 ']'
+ ln -sf /repo/tests/config/config.d/legacy_geobase.xml /etc/clickhouse-server/config.d/
+ ln -sf /repo/tests/config/users.d/log_queries.xml /etc/clickhouse-server/users.d/
+ ln -sf /repo/tests/config/users.d/readonly.xml /etc/clickhouse-server/users.d/
+ ln -sf /repo/tests/config/users.d/ci_logs_sender.yaml /etc/clickhouse-server/users.d/
+ ln -sf /repo/tests/config/users.d/access_management.xml /etc/clickhouse-server/users.d/
+ ln -sf /repo/tests/config/users.d/database_atomic_drop_detach_sync.xml /etc/clickhouse-server/users.d/
+ ln -sf /repo/tests/config/users.d/opentelemetry.xml /etc/clickhouse-server/users.d/
+ ln -sf /repo/tests/config/users.d/remote_queries.xml /etc/clickhouse-server/users.d/
+ ln -sf /repo/tests/config/users.d/session_log_test.xml /etc/clickhouse-server/users.d/
+ ln -sf /repo/tests/config/users.d/memory_profiler.xml /etc/clickhouse-server/users.d/
+ ln -sf /repo/tests/config/users.d/no_fsync_metadata.xml /etc/clickhouse-server/users.d/
+ ln -sf /repo/tests/config/users.d/filelog.xml /etc/clickhouse-server/users.d/
+ ln -sf /repo/tests/config/users.d/enable_blobs_check.xml /etc/clickhouse-server/users.d/
+ ln -sf /repo/tests/config/users.d/marks.xml /etc/clickhouse-server/users.d/
+ ln -sf /repo/tests/config/users.d/insert_keeper_retries.xml /etc/clickhouse-server/users.d/
+ ln -sf /repo/tests/config/users.d/prefetch_settings.xml /etc/clickhouse-server/users.d/
+ ln -sf /repo/tests/config/users.d/nonconst_timezone.xml /etc/clickhouse-server/users.d/
+ ln -sf /repo/tests/config/users.d/allow_introspection_functions.yaml /etc/clickhouse-server/users.d/
+ ln -sf /repo/tests/config/users.d/replicated_ddl_entry.xml /etc/clickhouse-server/users.d/
+ ln -sf /repo/tests/config/users.d/limits.yaml /etc/clickhouse-server/users.d/
+ [[ -n '' ]]
+ ln -sf /repo/tests/config/users.d/timeouts.xml /etc/clickhouse-server/users.d/
+ ln -sf /repo/tests/config/ints_dictionary.xml /etc/clickhouse-server/
+ ln -sf /repo/tests/config/strings_dictionary.xml /etc/clickhouse-server/
+ ln -sf /repo/tests/config/decimals_dictionary.xml /etc/clickhouse-server/
+ ln -sf /repo/tests/config/executable_dictionary.xml /etc/clickhouse-server/
+ ln -sf /repo/tests/config/executable_pool_dictionary.xml /etc/clickhouse-server/
+ ln -sf /repo/tests/config/test_function.xml /etc/clickhouse-server/
+ ln -sf /repo/tests/config/top_level_domains /etc/clickhouse-server/
+ ln -sf /repo/tests/config/regions_hierarchy.txt /etc/clickhouse-server/config.d/
+ ln -sf /repo/tests/config/regions_names_en.txt /etc/clickhouse-server/config.d/
+ ln -sf /repo/tests/config/regions_names_es.txt /etc/clickhouse-server/config.d/
+ ln -sf /repo/tests/config/ext-en.txt /etc/clickhouse-server/config.d/
+ ln -sf /repo/tests/config/ext-ru.txt /etc/clickhouse-server/config.d/
+ ln -sf /repo/tests/config/lem-en.bin /etc/clickhouse-server/config.d/
+ ln -sf /repo/tests/config/server.key /etc/clickhouse-server/
+ ln -sf /repo/tests/config/server.crt /etc/clickhouse-server/
+ ln -sf /repo/tests/config/dhparam.pem /etc/clickhouse-server/
+ ln -sf --backup=simple --suffix=_original.xml /repo/tests/config/config.d/query_masking_rules.xml /etc/clickhouse-server/config.d/
+ [[ -n 1 ]]
+ [[ 1 -eq 1 ]]
+ rm -f /etc/clickhouse-server/config.d/zookeeper.xml
+ ln -sf /repo/tests/config/config.d/zookeeper_fault_injection.xml /etc/clickhouse-server/config.d/
+ [[ -n 1 ]]
+ [[ 1 -eq 1 ]]
+ ln -sf /repo/tests/config/config.d/cannot_allocate_thread_injection.xml /etc/clickhouse-server/config.d/
+ value=0
+ sed --follow-symlinks -i 's|[01]|0|' /etc/clickhouse-server/config.d/keeper_port.xml
+ value=22335488
+ sed --follow-symlinks -i 's|[[:digit:]]\+|22335488|' /etc/clickhouse-server/config.d/keeper_port.xml
+ value=19515392
+ sed --follow-symlinks -i 's|[[:digit:]]\+|19515392|' /etc/clickhouse-server/config.d/keeper_port.xml
+ value=1
+ sed --follow-symlinks -i 's|[01]|1|' /etc/clickhouse-server/config.d/keeper_port.xml
+ [[ -n '' ]]
+ [[ -n 1 ]]
+ [[ 1 -eq 1 ]]
+ ln -sf /repo/tests/config/users.d/database_ordinary.xml /etc/clickhouse-server/users.d/
+ [[ '' == \1 ]]
+ [[ '' == \1 ]]
+ [[ 1 == \1 ]]
+ [[ 0 != \1 ]]
+ ln -sf /repo/tests/config/config.d/azure_storage_conf.xml /etc/clickhouse-server/config.d/
+ ln -sf /repo/tests/config/config.d/storage_conf.xml /etc/clickhouse-server/config.d/
+ ln -sf /repo/tests/config/config.d/storage_conf_02944.xml /etc/clickhouse-server/config.d/
+ ln -sf /repo/tests/config/config.d/storage_conf_02963.xml /etc/clickhouse-server/config.d/
+ ln -sf /repo/tests/config/config.d/storage_conf_02961.xml /etc/clickhouse-server/config.d/
+ ln -sf /repo/tests/config/users.d/s3_cache.xml /etc/clickhouse-server/users.d/
+ ln -sf /repo/tests/config/users.d/s3_cache_new.xml /etc/clickhouse-server/users.d/
+ [[ '' == \1 ]]
+ [[ '' == \1 ]]
+ ln -sf /repo/tests/config/client_config.xml /etc/clickhouse-client/config.xml
+ sudo cat /etc/clickhouse-server/config.d/keeper_port.xml
+ sed 's|100000|10000|'
+ sudo mv /etc/clickhouse-server/config.d/keeper_port.xml.tmp /etc/clickhouse-server/config.d/keeper_port.xml
+ [[ -n 1 ]]
+ [[ 1 -eq 1 ]]
+ randomize_config_boolean_value filtered_list keeper_port
+ value=0
+ sudo cat /etc/clickhouse-server/config.d/keeper_port.xml
+ sed 's|[01]|0|'
+ sudo mv /etc/clickhouse-server/config.d/keeper_port.xml.tmp /etc/clickhouse-server/config.d/keeper_port.xml
+ randomize_config_boolean_value multi_read keeper_port
+ value=0
+ sudo cat /etc/clickhouse-server/config.d/keeper_port.xml
+ sed 's|[01]|0|'
+ sudo mv /etc/clickhouse-server/config.d/keeper_port.xml.tmp /etc/clickhouse-server/config.d/keeper_port.xml
+ randomize_config_boolean_value check_not_exists keeper_port
+ value=1
+ sudo cat /etc/clickhouse-server/config.d/keeper_port.xml
+ sed 's|[01]|1|'
+ sudo mv /etc/clickhouse-server/config.d/keeper_port.xml.tmp /etc/clickhouse-server/config.d/keeper_port.xml
+ randomize_config_boolean_value create_if_not_exists keeper_port
+ value=1
+ sudo cat /etc/clickhouse-server/config.d/keeper_port.xml
+ sed 's|[01]|1|'
+ sudo mv /etc/clickhouse-server/config.d/keeper_port.xml.tmp /etc/clickhouse-server/config.d/keeper_port.xml
+ randomize_config_boolean_value remove_recursive keeper_port
+ value=0
+ sudo cat /etc/clickhouse-server/config.d/keeper_port.xml
+ sed 's|[01]|0|'
+ sudo mv /etc/clickhouse-server/config.d/keeper_port.xml.tmp /etc/clickhouse-server/config.d/keeper_port.xml
+ sudo chown clickhouse /etc/clickhouse-server/config.d/keeper_port.xml
+ sudo chgrp clickhouse /etc/clickhouse-server/config.d/keeper_port.xml
+ [[ -n 1 ]]
+ [[ 1 -eq 1 ]]
+ randomize_config_boolean_value use_compression zookeeper_fault_injection
+ value=1
+ sudo cat /etc/clickhouse-server/config.d/zookeeper_fault_injection.xml
+ sed 's|[01]|1|'
+ sudo mv /etc/clickhouse-server/config.d/zookeeper_fault_injection.xml.tmp /etc/clickhouse-server/config.d/zookeeper_fault_injection.xml
+ randomize_config_boolean_value use_xid_64 zookeeper_fault_injection
+ value=1
+ sudo cat /etc/clickhouse-server/config.d/zookeeper_fault_injection.xml
+ sed 's|[01]|1|'
+ sudo mv /etc/clickhouse-server/config.d/zookeeper_fault_injection.xml.tmp /etc/clickhouse-server/config.d/zookeeper_fault_injection.xml
+ echo 'ASAN_OPTIONS='\''malloc_context_size=10 verbosity=1 allocator_release_to_os_interval_ms=10000'\'''
+ export 'ASAN_OPTIONS=malloc_context_size=10 allocator_release_to_os_interval_ms=10000'
+ ASAN_OPTIONS='malloc_context_size=10 allocator_release_to_os_interval_ms=10000'
+ sudo chown root: /var/lib/clickhouse
+ local total_mem
++ awk '/MemTotal/ { print $(NF-1) }' /proc/meminfo
+ total_mem=32086444
+ total_mem=32856518656
+ max_server_memory_usage_to_ram_ratio=0.5
Setting max_server_memory_usage_to_ram_ratio to 0.5
+ echo 'Setting max_server_memory_usage_to_ram_ratio to 0.5'
+ cat
Setting max_memory_usage_for_user=9856955596 and max_memory_usage for queries to 10G
+ local max_users_mem
+ max_users_mem=9856955596
+ echo 'Setting max_memory_usage_for_user=9856955596 and max_memory_usage for queries to 10G'
+ cat
+ cat
+ [[ '' == \1 ]]
+ [[ '' == \1 ]]
+ sudo cat /etc/clickhouse-server/config.d/logger_trace.xml
+ sed 's|trace|test|'
+ mv /etc/clickhouse-server/config.d/logger_trace.xml.tmp /etc/clickhouse-server/config.d/logger_trace.xml
+ '[' SLRU = SLRU ']'
+ sudo cat /etc/clickhouse-server/config.d/storage_conf.xml
+ sed 's|LRU|SLRU|'
+ mv /etc/clickhouse-server/config.d/storage_conf.xml.tmp /etc/clickhouse-server/config.d/storage_conf.xml
++ date +%-d
+ '[' 1 -eq 1 ']'
+ sudo echo 'true'
+ start_server
+ counter=0
+ max_attempt=120
+ clickhouse-client --query 'SELECT 1'
Code: 210. DB::NetException: Connection refused (localhost:9000). (NETWORK_ERROR)
+ '[' 0 -gt 120 ']'
+ clickhouse start --user root
+ sleep 0.5
+ counter=1
+ clickhouse-client --query 'SELECT 1'
Code: 210. DB::NetException: Connection refused (localhost:9000). (NETWORK_ERROR)
+ '[' 1 -gt 120 ']'
+ clickhouse start --user root
+ sleep 0.5
+ counter=2
+ clickhouse-client --query 'SELECT 1'
Code: 210. DB::NetException: Connection refused (localhost:9000). (NETWORK_ERROR)
+ '[' 2 -gt 120 ']'
+ clickhouse start --user root
+ sleep 0.5
+ counter=3
+ clickhouse-client --query 'SELECT 1'
Code: 210. DB::NetException: Connection refused (localhost:9000). (NETWORK_ERROR)
+ '[' 3 -gt 120 ']'
+ clickhouse start --user root
+ sleep 0.5
+ counter=4
+ clickhouse-client --query 'SELECT 1'
Code: 210. DB::NetException: Connection refused (localhost:9000). (NETWORK_ERROR)
+ '[' 4 -gt 120 ']'
+ clickhouse start --user root
+ sleep 0.5
+ counter=5
+ clickhouse-client --query 'SELECT 1'
Code: 210. DB::NetException: Connection refused (localhost:9000). (NETWORK_ERROR)
+ '[' 5 -gt 120 ']'
+ clickhouse start --user root
+ sleep 0.5
+ counter=6
+ clickhouse-client --query 'SELECT 1'
Code: 210. DB::NetException: Connection refused (localhost:9000). (NETWORK_ERROR)
+ '[' 6 -gt 120 ']'
+ clickhouse start --user root
+ sleep 0.5
+ counter=7
+ clickhouse-client --query 'SELECT 1'
Code: 210. DB::NetException: Connection refused (localhost:9000). (NETWORK_ERROR)
+ '[' 7 -gt 120 ']'
+ clickhouse start --user root
+ sleep 0.5
+ counter=8
+ clickhouse-client --query 'SELECT 1'
Code: 210. DB::NetException: Connection refused (localhost:9000). (NETWORK_ERROR)
+ '[' 8 -gt 120 ']'
+ clickhouse start --user root
+ sleep 0.5
+ counter=9
+ clickhouse-client --query 'SELECT 1'
Code: 210. DB::NetException: Connection refused (localhost:9000). (NETWORK_ERROR)
+ '[' 9 -gt 120 ']'
+ clickhouse start --user root
+ sleep 0.5
+ counter=10
+ clickhouse-client --query 'SELECT 1'
Code: 210. DB::NetException: Connection refused (localhost:9000). (NETWORK_ERROR)
+ '[' 10 -gt 120 ']'
+ clickhouse start --user root
+ sleep 0.5
+ counter=11
+ clickhouse-client --query 'SELECT 1'
Code: 210. DB::NetException: Connection refused (localhost:9000). (NETWORK_ERROR)
+ '[' 11 -gt 120 ']'
+ clickhouse start --user root
+ sleep 0.5
+ counter=12
+ clickhouse-client --query 'SELECT 1'
Code: 210. DB::NetException: Connection refused (localhost:9000). (NETWORK_ERROR)
+ '[' 12 -gt 120 ']'
+ clickhouse start --user root
+ sleep 0.5
+ counter=13
+ clickhouse-client --query 'SELECT 1'
Code: 210. DB::NetException: Connection refused (localhost:9000). (NETWORK_ERROR)
+ '[' 13 -gt 120 ']'
+ clickhouse start --user root
+ sleep 0.5
+ counter=14
+ clickhouse-client --query 'SELECT 1'
Code: 210. DB::NetException: Connection refused (localhost:9000). (NETWORK_ERROR)
+ '[' 14 -gt 120 ']'
+ clickhouse start --user root
+ sleep 0.5
+ counter=15
+ clickhouse-client --query 'SELECT 1'
Code: 210. DB::NetException: Connection refused (localhost:9000). (NETWORK_ERROR)
+ '[' 15 -gt 120 ']'
+ clickhouse start --user root
+ sleep 0.5
+ counter=16
+ clickhouse-client --query 'SELECT 1'
1
+ attach_gdb_to_clickhouse
++ clickhouse local --query 'SELECT count() FROM system.build_options WHERE name = '\''CXX_FLAGS'\'' AND position('\''sanitize=address'\'' IN value)'
+ IS_ASAN=1
+ [[ 1 = \1 ]]
+ echo 'ASAN build detected. Not using gdb since it disables LeakSanitizer detections'
ASAN build detected. Not using gdb since it disables LeakSanitizer detections
+ cd /repo/tests/
+ python3 /repo/tests/ci/stress.py --hung-check --drop-databases --output-folder /test_output --skip-func-tests '' --global-time-limit 1200
2026-09-21 01:34:25,230 Run func tests '/usr/bin/clickhouse-test --client-option ignore_drop_queries_probability=0.2 --global_time_limit=1200 '
2026-09-21 01:34:25,732 Run func tests '/usr/bin/clickhouse-test --order=random --database=test_1 --client-option join_use_nulls=1 join_algorithm='parallel_hash' memory_tracker_fault_probability=0.001 merge_tree_read_split_ranges_into_intersecting_and_non_intersecting_injection_probability=0.05 group_by_use_nulls=1 http_make_head_request=0 ignore_drop_queries_probability=0.2 --global_time_limit=1200 '
2026-09-21 01:34:26,233 Run func tests '/usr/bin/clickhouse-test --order=random --db-engine="Replicated('/test/db/test_2', 's1', 'r1')" --client-option enable_deflate_qpl_codec=1 enable_zstd_qat_codec=1 ignore_drop_queries_probability=0.2 --global_time_limit=1200 '
2026-09-21 01:34:26,734 Run func tests '/usr/bin/clickhouse-test --order=random --database=test_3 --client-option join_algorithm='partial_merge' use_query_cache=1 query_cache_nondeterministic_function_handling='ignore' query_cache_system_table_handling='ignore' group_by_use_nulls=1 ignore_drop_queries_probability=0.2 --global_time_limit=1200 '
2026-09-21 01:34:27,235 Run func tests '/usr/bin/clickhouse-test --order=random --client-option join_use_nulls=1 http_make_head_request=1 ignore_drop_queries_probability=0.2 --global_time_limit=1200 '
2026-09-21 01:34:27,737 Run func tests '/usr/bin/clickhouse-test --order=random --db-engine="Replicated('/test/db/test_5', 's1', 'r1')" --database=test_5 --client-option enable_deflate_qpl_codec=1 enable_zstd_qat_codec=1 join_algorithm='full_sorting_merge' group_by_use_nulls=1 ignore_drop_queries_probability=0.2 --global_time_limit=1200 '
2026-09-21 01:34:28,238 Run func tests '/usr/bin/clickhouse-test --order=random --client-option memory_tracker_fault_probability=0.001 merge_tree_read_split_ranges_into_intersecting_and_non_intersecting_injection_probability=0.05 ignore_drop_queries_probability=0.2 --global_time_limit=1200 '
2026-09-21 01:34:28,739 Run func tests '/usr/bin/clickhouse-test --order=random --database=test_7 --client-option join_use_nulls=1 join_algorithm='grace_hash' use_query_cache=1 query_cache_nondeterministic_function_handling='ignore' query_cache_system_table_handling='ignore' group_by_use_nulls=1 ignore_drop_queries_probability=0.2 enable_parallel_replicas=1 max_parallel_replicas=3 cluster_for_parallel_replicas='parallel_replicas' parallel_replicas_for_non_replicated_merge_tree=1 --global_time_limit=1200 '
2026-09-21 01:34:29,240 Run func tests '/usr/bin/clickhouse-test --order=random --db-engine="Replicated('/test/db/test_8', 's1', 'r1')" --client-option enable_deflate_qpl_codec=1 enable_zstd_qat_codec=1 use_query_cache=1 query_cache_nondeterministic_function_handling='ignore' query_cache_system_table_handling='ignore' http_make_head_request=0 ignore_drop_queries_probability=0.2 --global_time_limit=1200 '
2026-09-21 01:34:29,741 Run func tests '/usr/bin/clickhouse-test --order=random --database=test_9 --client-option join_algorithm='auto' max_rows_in_join=1000 use_query_cache=1 query_cache_nondeterministic_function_handling='ignore' query_cache_system_table_handling='ignore' group_by_use_nulls=1 ignore_drop_queries_probability=0.2 --global_time_limit=1200 '
2026-09-21 01:34:30,243 Run func tests '/usr/bin/clickhouse-test --order=random --client-option join_use_nulls=1 ignore_drop_queries_probability=0.2 --global_time_limit=1200 '
2026-09-21 01:34:30,744 Run func tests '/usr/bin/clickhouse-test --order=random --db-engine="Replicated('/test/db/test_11', 's1', 'r1')" --database=test_11 --client-option enable_deflate_qpl_codec=1 enable_zstd_qat_codec=1 join_algorithm='parallel_hash' memory_tracker_fault_probability=0.001 merge_tree_read_split_ranges_into_intersecting_and_non_intersecting_injection_probability=0.05 group_by_use_nulls=1 ignore_drop_queries_probability=0.2 --global_time_limit=1200 '
2026-09-21 01:34:31,245 Run func tests '/usr/bin/clickhouse-test --order=random --client-option implicit_transaction=1 throw_on_unsupported_query_inside_transaction=0 ignore_drop_queries_probability=0.2 --global_time_limit=1200 '
2026-09-21 01:34:31,746 Run func tests '/usr/bin/clickhouse-test --order=random --database=test_13 --client-option join_use_nulls=1 join_algorithm='partial_merge' group_by_use_nulls=1 ignore_drop_queries_probability=0.2 --global_time_limit=1200 '
2026-09-21 01:34:32,247 Run func tests '/usr/bin/clickhouse-test --order=random --db-engine="Replicated('/test/db/test_14', 's1', 'r1')" --client-option enable_deflate_qpl_codec=1 enable_zstd_qat_codec=1 use_query_cache=1 query_cache_nondeterministic_function_handling='ignore' query_cache_system_table_handling='ignore' ignore_drop_queries_probability=0.2 enable_parallel_replicas=1 max_parallel_replicas=3 cluster_for_parallel_replicas='parallel_replicas' parallel_replicas_for_non_replicated_merge_tree=1 --global_time_limit=1200 '
2026-09-21 01:34:32,748 Run func tests '/usr/bin/clickhouse-test --order=random --database=test_15 --client-option join_algorithm='full_sorting_merge' use_query_cache=1 query_cache_nondeterministic_function_handling='ignore' query_cache_system_table_handling='ignore' group_by_use_nulls=1 ignore_drop_queries_probability=0.2 --global_time_limit=1200 '
2026-09-21 01:34:33,249 Will wait functests to finish
2026-09-21 01:34:33,249 Finished 0 from 16 processes
2026-09-21 01:34:38,252 Finished 0 from 16 processes
2026-09-21 01:34:43,256 Finished 0 from 16 processes
2026-09-21 01:34:48,260 Finished 0 from 16 processes
2026-09-21 01:34:53,264 Finished 0 from 16 processes
2026-09-21 01:34:58,268 Finished 0 from 16 processes
2026-09-21 01:35:03,272 Finished 0 from 16 processes
2026-09-21 01:35:08,276 Finished 0 from 16 processes
2026-09-21 01:35:13,280 Finished 0 from 16 processes
2026-09-21 01:35:18,285 Finished 0 from 16 processes
2026-09-21 01:35:23,288 Finished 0 from 16 processes
2026-09-21 01:35:28,292 Finished 0 from 16 processes
2026-09-21 01:35:33,296 Finished 0 from 16 processes
2026-09-21 01:35:38,300 Finished 0 from 16 processes
2026-09-21 01:35:43,304 Finished 0 from 16 processes
2026-09-21 01:35:48,308 Finished 0 from 16 processes
2026-09-21 01:35:53,312 Finished 0 from 16 processes
2026-09-21 01:35:58,316 Finished 0 from 16 processes
2026-09-21 01:36:03,317 Finished 0 from 16 processes
2026-09-21 01:36:08,320 Finished 0 from 16 processes
2026-09-21 01:36:13,325 Finished 0 from 16 processes
2026-09-21 01:36:18,328 Finished 0 from 16 processes
2026-09-21 01:36:23,333 Finished 0 from 16 processes
2026-09-21 01:36:28,335 Finished 0 from 16 processes
2026-09-21 01:36:33,336 Finished 0 from 16 processes
2026-09-21 01:36:38,341 Finished 0 from 16 processes
2026-09-21 01:36:43,344 Finished 0 from 16 processes
2026-09-21 01:36:48,348 Finished 0 from 16 processes
2026-09-21 01:36:53,352 Finished 0 from 16 processes
2026-09-21 01:36:58,356 Finished 0 from 16 processes
2026-09-21 01:37:03,360 Finished 0 from 16 processes
2026-09-21 01:37:08,364 Finished 0 from 16 processes
2026-09-21 01:37:13,368 Finished 0 from 16 processes
2026-09-21 01:37:18,372 Finished 0 from 16 processes
2026-09-21 01:37:23,376 Finished 0 from 16 processes
2026-09-21 01:37:28,380 Finished 0 from 16 processes
2026-09-21 01:37:33,381 Finished 0 from 16 processes
2026-09-21 01:37:38,382 Finished 0 from 16 processes
2026-09-21 01:37:43,384 Finished 0 from 16 processes
2026-09-21 01:37:48,390 Finished 0 from 16 processes
2026-09-21 01:37:53,392 Finished 0 from 16 processes
2026-09-21 01:37:58,393 Finished 0 from 16 processes
2026-09-21 01:38:03,396 Finished 0 from 16 processes
2026-09-21 01:38:08,400 Finished 0 from 16 processes
2026-09-21 01:38:13,404 Finished 0 from 16 processes
2026-09-21 01:38:18,409 Finished 0 from 16 processes
2026-09-21 01:38:23,412 Finished 0 from 16 processes
2026-09-21 01:38:28,416 Finished 0 from 16 processes
2026-09-21 01:38:33,421 Finished 0 from 16 processes
2026-09-21 01:38:38,424 Finished 0 from 16 processes
2026-09-21 01:38:43,428 Finished 0 from 16 processes
2026-09-21 01:38:48,432 Finished 0 from 16 processes
2026-09-21 01:38:53,436 Finished 0 from 16 processes
2026-09-21 01:38:58,440 Finished 0 from 16 processes
2026-09-21 01:39:03,444 Finished 0 from 16 processes
2026-09-21 01:39:08,450 Finished 1 from 16 processes
2026-09-21 01:39:13,453 Finished 1 from 16 processes
2026-09-21 01:39:18,459 Finished 1 from 16 processes
2026-09-21 01:39:23,463 Finished 1 from 16 processes
2026-09-21 01:39:28,464 Finished 1 from 16 processes
2026-09-21 01:39:33,468 Finished 1 from 16 processes
2026-09-21 01:39:38,472 Finished 1 from 16 processes
2026-09-21 01:39:43,474 Finished 1 from 16 processes
2026-09-21 01:39:48,476 Finished 1 from 16 processes
2026-09-21 01:39:53,480 Finished 1 from 16 processes
2026-09-21 01:39:58,484 Finished 1 from 16 processes
2026-09-21 01:40:03,488 Finished 1 from 16 processes
2026-09-21 01:40:08,492 Finished 1 from 16 processes
2026-09-21 01:40:13,497 Finished 1 from 16 processes
2026-09-21 01:40:18,500 Finished 1 from 16 processes
2026-09-21 01:40:23,504 Finished 1 from 16 processes
2026-09-21 01:40:28,505 Finished 1 from 16 processes
2026-09-21 01:40:33,508 Finished 1 from 16 processes
2026-09-21 01:40:38,512 Finished 1 from 16 processes
2026-09-21 01:40:43,516 Finished 1 from 16 processes
2026-09-21 01:40:48,520 Finished 1 from 16 processes
2026-09-21 01:40:53,524 Finished 1 from 16 processes
2026-09-21 01:40:58,528 Finished 1 from 16 processes
2026-09-21 01:41:03,533 Finished 1 from 16 processes
2026-09-21 01:41:08,536 Finished 1 from 16 processes
2026-09-21 01:41:13,540 Finished 1 from 16 processes
2026-09-21 01:41:18,545 Finished 1 from 16 processes
2026-09-21 01:41:23,548 Finished 1 from 16 processes
2026-09-21 01:41:28,552 Finished 1 from 16 processes
2026-09-21 01:41:33,557 Finished 1 from 16 processes
2026-09-21 01:41:38,560 Finished 1 from 16 processes
2026-09-21 01:41:43,565 Finished 1 from 16 processes
2026-09-21 01:41:48,568 Finished 1 from 16 processes
2026-09-21 01:41:53,572 Finished 1 from 16 processes
2026-09-21 01:41:58,576 Finished 1 from 16 processes
2026-09-21 01:42:03,581 Finished 1 from 16 processes
2026-09-21 01:42:08,586 Finished 1 from 16 processes
2026-09-21 01:42:13,588 Finished 1 from 16 processes
2026-09-21 01:42:18,592 Finished 1 from 16 processes
2026-09-21 01:42:23,597 Finished 1 from 16 processes
2026-09-21 01:42:28,600 Finished 1 from 16 processes
2026-09-21 01:42:33,604 Finished 1 from 16 processes
2026-09-21 01:42:38,608 Finished 1 from 16 processes
2026-09-21 01:42:43,612 Finished 1 from 16 processes
2026-09-21 01:42:48,616 Finished 1 from 16 processes
2026-09-21 01:42:53,621 Finished 1 from 16 processes
2026-09-21 01:42:58,627 Finished 1 from 16 processes
2026-09-21 01:43:03,632 Finished 1 from 16 processes
2026-09-21 01:43:08,636 Finished 1 from 16 processes
2026-09-21 01:43:13,640 Finished 1 from 16 processes
2026-09-21 01:43:18,644 Finished 1 from 16 processes
2026-09-21 01:43:23,648 Finished 1 from 16 processes
2026-09-21 01:43:28,652 Finished 2 from 16 processes
2026-09-21 01:43:33,656 Finished 2 from 16 processes
2026-09-21 01:43:38,660 Finished 2 from 16 processes
2026-09-21 01:43:43,665 Finished 2 from 16 processes
2026-09-21 01:43:48,670 Finished 2 from 16 processes
2026-09-21 01:43:53,672 Finished 2 from 16 processes
2026-09-21 01:43:58,677 Finished 2 from 16 processes
2026-09-21 01:44:03,682 Finished 2 from 16 processes
2026-09-21 01:44:08,684 Finished 2 from 16 processes
2026-09-21 01:44:13,687 Finished 2 from 16 processes
2026-09-21 01:44:18,692 Finished 2 from 16 processes
2026-09-21 01:44:23,696 Finished 2 from 16 processes
2026-09-21 01:44:28,700 Finished 2 from 16 processes
2026-09-21 01:44:33,704 Finished 2 from 16 processes
2026-09-21 01:44:38,708 Finished 2 from 16 processes
2026-09-21 01:44:43,712 Finished 2 from 16 processes
2026-09-21 01:44:48,716 Finished 2 from 16 processes
2026-09-21 01:44:53,720 Finished 2 from 16 processes
2026-09-21 01:44:58,724 Finished 2 from 16 processes
2026-09-21 01:45:03,728 Finished 2 from 16 processes
2026-09-21 01:45:08,731 Finished 2 from 16 processes
2026-09-21 01:45:13,736 Finished 2 from 16 processes
2026-09-21 01:45:18,741 Finished 2 from 16 processes
2026-09-21 01:45:23,744 Finished 2 from 16 processes
2026-09-21 01:45:28,749 Finished 2 from 16 processes
2026-09-21 01:45:33,752 Finished 2 from 16 processes
2026-09-21 01:45:38,756 Finished 2 from 16 processes
2026-09-21 01:45:43,760 Finished 2 from 16 processes
2026-09-21 01:45:48,765 Finished 2 from 16 processes
2026-09-21 01:45:53,770 Finished 2 from 16 processes
2026-09-21 01:45:58,776 Finished 2 from 16 processes
2026-09-21 01:46:03,780 Finished 2 from 16 processes
2026-09-21 01:46:08,784 Finished 2 from 16 processes
2026-09-21 01:46:13,788 Finished 2 from 16 processes
2026-09-21 01:46:18,792 Finished 2 from 16 processes
2026-09-21 01:46:23,796 Finished 2 from 16 processes
2026-09-21 01:46:28,799 Finished 2 from 16 processes
2026-09-21 01:46:33,800 Finished 2 from 16 processes
2026-09-21 01:46:38,806 Finished 2 from 16 processes
2026-09-21 01:46:43,811 Finished 2 from 16 processes
2026-09-21 01:46:48,812 Finished 2 from 16 processes
2026-09-21 01:46:53,817 Finished 2 from 16 processes
2026-09-21 01:46:58,820 Finished 2 from 16 processes
2026-09-21 01:47:03,824 Finished 2 from 16 processes
2026-09-21 01:47:08,827 Finished 2 from 16 processes
2026-09-21 01:47:13,832 Finished 2 from 16 processes
2026-09-21 01:47:18,835 Finished 2 from 16 processes
2026-09-21 01:47:23,836 Finished 2 from 16 processes
2026-09-21 01:47:28,841 Finished 2 from 16 processes
2026-09-21 01:47:33,844 Finished 2 from 16 processes
2026-09-21 01:47:38,848 Finished 2 from 16 processes
2026-09-21 01:47:43,852 Finished 2 from 16 processes
2026-09-21 01:47:48,855 Finished 2 from 16 processes
2026-09-21 01:47:53,860 Finished 2 from 16 processes
2026-09-21 01:47:58,864 Finished 2 from 16 processes
2026-09-21 01:48:03,868 Finished 2 from 16 processes
2026-09-21 01:48:08,871 Finished 2 from 16 processes
2026-09-21 01:48:13,876 Finished 2 from 16 processes
2026-09-21 01:48:18,880 Finished 2 from 16 processes
2026-09-21 01:48:23,884 Finished 2 from 16 processes
2026-09-21 01:48:28,888 Finished 2 from 16 processes
2026-09-21 01:48:33,893 Finished 2 from 16 processes
2026-09-21 01:48:38,896 Finished 2 from 16 processes
2026-09-21 01:48:43,900 Finished 2 from 16 processes
2026-09-21 01:48:48,904 Finished 2 from 16 processes
2026-09-21 01:48:53,906 Finished 2 from 16 processes
2026-09-21 01:48:58,911 Finished 2 from 16 processes
2026-09-21 01:49:03,914 Finished 2 from 16 processes
2026-09-21 01:49:08,916 Finished 2 from 16 processes
2026-09-21 01:49:13,921 Finished 2 from 16 processes
2026-09-21 01:49:18,924 Finished 2 from 16 processes
2026-09-21 01:49:23,928 Finished 2 from 16 processes
2026-09-21 01:49:28,932 Finished 2 from 16 processes
2026-09-21 01:49:33,937 Finished 2 from 16 processes
2026-09-21 01:49:38,941 Finished 2 from 16 processes
2026-09-21 01:49:43,944 Finished 2 from 16 processes
2026-09-21 01:49:48,948 Finished 2 from 16 processes
2026-09-21 01:49:53,952 Finished 2 from 16 processes
2026-09-21 01:49:58,953 Finished 2 from 16 processes
2026-09-21 01:50:03,956 Finished 3 from 16 processes
2026-09-21 01:50:08,960 Finished 3 from 16 processes
2026-09-21 01:50:13,962 Finished 3 from 16 processes
2026-09-21 01:50:18,965 Finished 3 from 16 processes
2026-09-21 01:50:23,972 Finished 3 from 16 processes
2026-09-21 01:50:28,976 Finished 3 from 16 processes
2026-09-21 01:50:33,977 Finished 3 from 16 processes
2026-09-21 01:50:38,980 Finished 3 from 16 processes
2026-09-21 01:50:43,984 Finished 3 from 16 processes
2026-09-21 01:50:48,988 Finished 3 from 16 processes
2026-09-21 01:50:53,992 Finished 3 from 16 processes
2026-09-21 01:50:58,996 Finished 3 from 16 processes
2026-09-21 01:51:04,000 Finished 3 from 16 processes
2026-09-21 01:51:09,005 Finished 3 from 16 processes
2026-09-21 01:51:14,008 Finished 3 from 16 processes
2026-09-21 01:51:19,012 Finished 3 from 16 processes
2026-09-21 01:51:24,013 Finished 3 from 16 processes
2026-09-21 01:51:29,017 Finished 3 from 16 processes
2026-09-21 01:51:34,020 Finished 3 from 16 processes
2026-09-21 01:51:39,021 Finished 3 from 16 processes
2026-09-21 01:51:44,024 Finished 3 from 16 processes
2026-09-21 01:51:49,026 Finished 3 from 16 processes
2026-09-21 01:51:54,028 Finished 3 from 16 processes
2026-09-21 01:51:59,032 Finished 3 from 16 processes
2026-09-21 01:52:04,037 Finished 3 from 16 processes
2026-09-21 01:52:09,038 Finished 3 from 16 processes
2026-09-21 01:52:14,040 Finished 3 from 16 processes
2026-09-21 01:52:19,045 Finished 3 from 16 processes
2026-09-21 01:52:24,046 Finished 3 from 16 processes
2026-09-21 01:52:29,051 Finished 3 from 16 processes
2026-09-21 01:52:34,056 Finished 3 from 16 processes
2026-09-21 01:52:39,061 Finished 3 from 16 processes
2026-09-21 01:52:44,064 Finished 3 from 16 processes
2026-09-21 01:52:49,068 Finished 3 from 16 processes
2026-09-21 01:52:54,073 Finished 3 from 16 processes
2026-09-21 01:52:59,076 Finished 3 from 16 processes
2026-09-21 01:53:04,080 Finished 3 from 16 processes
2026-09-21 01:53:09,081 Finished 3 from 16 processes
2026-09-21 01:53:14,084 Finished 3 from 16 processes
2026-09-21 01:53:19,088 Finished 3 from 16 processes
2026-09-21 01:53:24,092 Finished 3 from 16 processes
2026-09-21 01:53:29,095 Finished 3 from 16 processes
2026-09-21 01:53:34,097 Finished 3 from 16 processes
2026-09-21 01:53:39,103 Finished 3 from 16 processes
2026-09-21 01:53:44,107 Finished 3 from 16 processes
2026-09-21 01:53:49,108 Finished 3 from 16 processes
2026-09-21 01:53:54,113 Finished 3 from 16 processes
2026-09-21 01:53:59,116 Finished 3 from 16 processes
2026-09-21 01:54:04,120 Finished 3 from 16 processes
2026-09-21 01:54:09,125 Finished 3 from 16 processes
2026-09-21 01:54:14,131 Finished 3 from 16 processes
2026-09-21 01:54:19,132 Finished 3 from 16 processes
2026-09-21 01:54:24,135 Finished 3 from 16 processes
2026-09-21 01:54:29,139 Finished 3 from 16 processes
2026-09-21 01:54:34,140 Finished 8 from 16 processes
2026-09-21 01:54:39,145 Finished 12 from 16 processes
2026-09-21 01:54:44,148 Finished 12 from 16 processes
2026-09-21 01:54:49,153 Finished 12 from 16 processes
2026-09-21 01:54:54,159 Finished 12 from 16 processes
2026-09-21 01:54:59,164 Finished 12 from 16 processes
2026-09-21 01:55:04,169 Finished 12 from 16 processes
2026-09-21 01:55:09,175 Finished 13 from 16 processes
2026-09-21 01:55:14,180 Finished 14 from 16 processes
2026-09-21 01:55:19,185 Finished 14 from 16 processes
2026-09-21 01:55:24,190 Finished 14 from 16 processes
2026-09-21 01:55:29,192 Finished 14 from 16 processes
2026-09-21 01:55:34,195 Finished 14 from 16 processes
2026-09-21 01:55:39,200 Finished 14 from 16 processes
2026-09-21 01:55:44,204 Finished 14 from 16 processes
2026-09-21 01:55:49,209 Finished 14 from 16 processes
2026-09-21 01:55:54,210 Finished 14 from 16 processes
2026-09-21 01:55:59,215 Finished 14 from 16 processes
2026-09-21 01:56:04,220 Finished 14 from 16 processes
2026-09-21 01:56:09,221 Finished 15 from 16 processes
2026-09-21 01:56:14,224 Finished 15 from 16 processes
2026-09-21 01:56:19,225 Finished 15 from 16 processes
2026-09-21 01:56:24,228 Finished 15 from 16 processes
2026-09-21 01:56:29,233 Finished 15 from 16 processes
2026-09-21 01:56:34,239 Finished 15 from 16 processes
2026-09-21 01:56:39,240 Finished 15 from 16 processes
2026-09-21 01:56:44,244 Finished 15 from 16 processes
2026-09-21 01:56:49,249 Finished 15 from 16 processes
2026-09-21 01:56:54,255 Finished 15 from 16 processes
2026-09-21 01:56:59,256 Finished 15 from 16 processes
2026-09-21 01:57:04,257 Finished 15 from 16 processes
2026-09-21 01:57:09,262 Finished 15 from 16 processes
2026-09-21 01:57:14,267 Finished 15 from 16 processes
2026-09-21 01:57:19,271 Finished 15 from 16 processes
2026-09-21 01:57:24,274 Finished 15 from 16 processes
2026-09-21 01:57:29,278 Finished 15 from 16 processes
2026-09-21 01:57:34,284 Finished 15 from 16 processes
2026-09-21 01:57:39,289 Finished 15 from 16 processes
2026-09-21 01:57:44,294 Finished 15 from 16 processes
2026-09-21 01:57:49,297 Finished 15 from 16 processes
2026-09-21 01:57:54,302 Finished 15 from 16 processes
2026-09-21 01:57:59,307 Finished 15 from 16 processes
2026-09-21 01:58:04,312 Finished 15 from 16 processes
2026-09-21 01:58:09,316 Finished 15 from 16 processes
2026-09-21 01:58:14,320 Finished 15 from 16 processes
2026-09-21 01:58:19,325 Finished 15 from 16 processes
2026-09-21 01:58:24,328 Finished 15 from 16 processes
2026-09-21 01:58:29,332 Finished 15 from 16 processes
2026-09-21 01:58:34,337 Finished 15 from 16 processes
2026-09-21 01:58:39,340 Finished 15 from 16 processes
2026-09-21 01:58:44,345 Finished 15 from 16 processes
2026-09-21 01:58:49,349 Finished 15 from 16 processes
2026-09-21 01:58:54,353 Finished 15 from 16 processes
2026-09-21 01:58:59,359 Finished 15 from 16 processes
2026-09-21 01:59:04,359 Finished 15 from 16 processes
2026-09-21 01:59:09,361 Finished 15 from 16 processes
2026-09-21 01:59:14,367 Finished 15 from 16 processes
2026-09-21 01:59:19,367 Finished 15 from 16 processes
2026-09-21 01:59:24,372 Finished 15 from 16 processes
2026-09-21 01:59:29,374 Finished 15 from 16 processes
2026-09-21 01:59:34,375 Finished 15 from 16 processes
2026-09-21 01:59:39,380 Finished 15 from 16 processes
2026-09-21 01:59:44,382 Finished 15 from 16 processes
2026-09-21 01:59:49,386 Finished 15 from 16 processes
2026-09-21 01:59:54,388 Finished 15 from 16 processes
2026-09-21 01:59:59,392 Finished 15 from 16 processes
2026-09-21 02:00:04,395 Finished 15 from 16 processes
2026-09-21 02:00:09,395 Finished 15 from 16 processes
2026-09-21 02:00:14,400 Finished 15 from 16 processes
2026-09-21 02:00:19,405 Finished 15 from 16 processes
2026-09-21 02:00:24,411 Finished 15 from 16 processes
2026-09-21 02:00:29,415 Finished 15 from 16 processes
2026-09-21 02:00:34,421 Finished 15 from 16 processes
2026-09-21 02:00:39,426 Finished 15 from 16 processes
2026-09-21 02:00:44,428 Finished 15 from 16 processes
2026-09-21 02:00:49,430 Finished 15 from 16 processes
2026-09-21 02:00:54,436 Finished 15 from 16 processes
2026-09-21 02:00:59,441 Finished 15 from 16 processes
2026-09-21 02:01:04,446 Finished 15 from 16 processes
2026-09-21 02:01:09,448 Finished 15 from 16 processes
2026-09-21 02:01:14,449 Finished 15 from 16 processes
2026-09-21 02:01:19,452 Finished 15 from 16 processes
2026-09-21 02:01:24,457 Finished 15 from 16 processes
2026-09-21 02:01:29,460 Finished 15 from 16 processes
2026-09-21 02:01:34,464 Finished 15 from 16 processes
2026-09-21 02:01:39,470 Finished 15 from 16 processes
2026-09-21 02:01:44,475 Finished 15 from 16 processes
2026-09-21 02:01:49,480 Finished 15 from 16 processes
2026-09-21 02:01:54,484 Finished 15 from 16 processes
2026-09-21 02:01:59,489 Finished 15 from 16 processes
2026-09-21 02:02:04,492 Finished 15 from 16 processes
2026-09-21 02:02:09,498 Finished 15 from 16 processes
2026-09-21 02:02:14,502 Finished 15 from 16 processes
2026-09-21 02:02:19,502 Finished 15 from 16 processes
2026-09-21 02:02:24,508 Finished 15 from 16 processes
2026-09-21 02:02:29,510 Finished 15 from 16 processes
2026-09-21 02:02:34,515 Finished 15 from 16 processes
2026-09-21 02:02:39,520 Finished 15 from 16 processes
2026-09-21 02:02:44,524 Finished 15 from 16 processes
2026-09-21 02:02:49,529 Finished 15 from 16 processes
2026-09-21 02:02:54,532 Finished 15 from 16 processes
2026-09-21 02:02:59,536 Finished 15 from 16 processes
2026-09-21 02:03:04,541 Finished 15 from 16 processes
2026-09-21 02:03:09,544 Finished 15 from 16 processes
2026-09-21 02:03:14,549 Finished 15 from 16 processes
2026-09-21 02:03:19,550 Finished 15 from 16 processes
2026-09-21 02:03:24,554 Finished 15 from 16 processes
2026-09-21 02:03:29,556 Finished 15 from 16 processes
2026-09-21 02:03:34,557 Finished 15 from 16 processes
2026-09-21 02:03:39,562 Finished 15 from 16 processes
2026-09-21 02:03:44,564 Finished 15 from 16 processes
2026-09-21 02:03:49,569 Finished 15 from 16 processes
2026-09-21 02:03:54,572 Finished 15 from 16 processes
2026-09-21 02:03:59,576 Finished 15 from 16 processes
2026-09-21 02:04:04,581 Finished 15 from 16 processes
2026-09-21 02:04:09,587 Finished 15 from 16 processes
2026-09-21 02:04:14,588 Finished 15 from 16 processes
2026-09-21 02:04:19,593 Finished 15 from 16 processes
2026-09-21 02:04:24,596 All processes finished
2026-09-21 02:04:24,596 Compressing stress logs
2026-09-21 02:04:24,621 Logs compressed
2026-09-21 02:04:24,621 Will terminate gdb (if any)
2026-09-21 02:04:24,621 Running command: kill -TERM $(pidof gdb)
/bin/sh: 1: kill: Usage: kill [-s sigspec | -signum | -sigspec] [pid | job]... or
kill -l [exitstatus]
2026-09-21 02:04:24,625 Command returned 2, retrying
/bin/sh: 1: kill: Usage: kill [-s sigspec | -signum | -sigspec] [pid | job]... or
kill -l [exitstatus]
2026-09-21 02:04:24,629 Command returned 2, retrying
/bin/sh: 1: kill: Usage: kill [-s sigspec | -signum | -sigspec] [pid | job]... or
kill -l [exitstatus]
2026-09-21 02:04:25,634 Command returned 2, retrying
/bin/sh: 1: kill: Usage: kill [-s sigspec | -signum | -sigspec] [pid | job]... or
kill -l [exitstatus]
2026-09-21 02:04:27,642 Command returned 2, retrying
/bin/sh: 1: kill: Usage: kill [-s sigspec | -signum | -sigspec] [pid | job]... or
kill -l [exitstatus]
2026-09-21 02:04:30,649 Command returned 2, retrying
2026-09-21 02:04:34,649 Running command: timeout 50s tail --pid=$(pidof gdb) -f /dev/null || kill -9 $(pidof gdb) ||:
tail: invalid PID: ‘’
/bin/sh: 1: kill: Usage: kill [-s sigspec | -signum | -sigspec] [pid | job]... or
kill -l [exitstatus]
2026-09-21 02:04:34,659 Running command: kill -CONT $(cat /var/run/clickhouse-server/clickhouse-server.pid) && clickhouse client -q 'SELECT 1 FORMAT Null'
2026-09-21 02:04:34,924 Running command: clickhouse client -q "SYSTEM STOP THREAD FUZZER" --max_untracked_memory=1Gi --memory_profiler_step=1Gi --max_memory_usage_for_user=0 --max_memory_usage_in_client=1000000000 --enable-progress-table-toggle=0
2026-09-21 02:04:35,189 Running command: clickhouse client -q "SYSTEM START MERGES" --max_untracked_memory=1Gi --memory_profiler_step=1Gi --max_memory_usage_for_user=0 --max_memory_usage_in_client=1000000000 --enable-progress-table-toggle=0
2026-09-21 02:04:35,403 Running command: clickhouse client -q "SYSTEM START DISTRIBUTED SENDS" --max_untracked_memory=1Gi --memory_profiler_step=1Gi --max_memory_usage_for_user=0 --max_memory_usage_in_client=1000000000 --enable-progress-table-toggle=0
2026-09-21 02:04:35,668 Running command: clickhouse client -q "SYSTEM START TTL MERGES" --max_untracked_memory=1Gi --memory_profiler_step=1Gi --max_memory_usage_for_user=0 --max_memory_usage_in_client=1000000000 --enable-progress-table-toggle=0
2026-09-21 02:04:35,933 Running command: clickhouse client -q "SYSTEM START MOVES" --max_untracked_memory=1Gi --memory_profiler_step=1Gi --max_memory_usage_for_user=0 --max_memory_usage_in_client=1000000000 --enable-progress-table-toggle=0
2026-09-21 02:04:36,198 Running command: clickhouse client -q "SYSTEM START FETCHES" --max_untracked_memory=1Gi --memory_profiler_step=1Gi --max_memory_usage_for_user=0 --max_memory_usage_in_client=1000000000 --enable-progress-table-toggle=0
2026-09-21 02:04:36,463 Running command: clickhouse client -q "SYSTEM START REPLICATED SENDS" --max_untracked_memory=1Gi --memory_profiler_step=1Gi --max_memory_usage_for_user=0 --max_memory_usage_in_client=1000000000 --enable-progress-table-toggle=0
2026-09-21 02:04:36,678 Running command: clickhouse client -q "SYSTEM START REPLICATION QUEUES" --max_untracked_memory=1Gi --memory_profiler_step=1Gi --max_memory_usage_for_user=0 --max_memory_usage_in_client=1000000000 --enable-progress-table-toggle=0
2026-09-21 02:04:36,892 Running command: clickhouse client -q "SYSTEM DROP MARK CACHE" --max_untracked_memory=1Gi --memory_profiler_step=1Gi --max_memory_usage_for_user=0 --max_memory_usage_in_client=1000000000 --enable-progress-table-toggle=0
2026-09-21 02:04:37,157 Running command: clickhouse client -q "KILL QUERY WHERE upper(query) LIKE 'WATCH %'" --max_untracked_memory=1Gi --memory_profiler_step=1Gi --max_memory_usage_for_user=0 --max_memory_usage_in_client=1000000000 --enable-progress-table-toggle=0
2026-09-21 02:04:37,422 Running command: clickhouse client -q "KILL QUERY WHERE query LIKE 'insert into tableB select %'" --max_untracked_memory=1Gi --memory_profiler_step=1Gi --max_memory_usage_for_user=0 --max_memory_usage_in_client=1000000000 --enable-progress-table-toggle=0
2026-09-21 02:04:37,687 Running command: clickhouse client -q "KILL QUERY WHERE query LIKE 'SELECT URL, uniq(SearchPhrase) AS u FROM test.hits GROUP BY URL ORDER BY u %'" --max_untracked_memory=1Gi --memory_profiler_step=1Gi --max_memory_usage_for_user=0 --max_memory_usage_in_client=1000000000 --enable-progress-table-toggle=0
2026-09-21 02:04:37,902 Running command: clickhouse client -q "KILL QUERY WHERE query LIKE 'SELECT (SELECT number FROM system.numbers WHERE number = 1000000000000)%'" --max_untracked_memory=1Gi --memory_profiler_step=1Gi --max_memory_usage_for_user=0 --max_memory_usage_in_client=1000000000 --enable-progress-table-toggle=0
Received exception from server (version 25.3.14):
Code: 159. DB::Exception: Received from localhost:9000. DB::Exception: Timeout exceeded: elapsed 60062.236494 ms, maximum: 60000 ms. (TIMEOUT_EXCEEDED)
(query: SELECT sleepEachRow((
SELECT maxOrDefault(300 - elapsed) + 1
FROM system.processes
WHERE query NOT LIKE '%FROM system.processes%' AND elapsed < 300
) / 300)
FROM numbers(300)
FORMAT Null
SETTINGS function_sleep_max_microseconds_per_block = 0
)
2026-09-21 02:05:39,501 Checking if some queries hung
Using queries from 'queries' directory
Connecting to ClickHouse server... OK
Connected to server 25.3.14.10001.altinitystable @ 07020f362800626e9ea95b3bc0c3b19c36cb4272 HEAD
Found 1 parallel tests and 0 sequential tests
Running about 1 stateless tests (Process-3).
00001_select_1: [ OK ]
1 tests passed. 0 tests skipped. 0.58 s elapsed (Process-3).
Checking the hung queries: done
No queries hung.
Has fatal logs from client in './client.fatal.log.27393':
==27393==WARNING: ASan doesn't fully support makecontext/swapcontext functions and may produce false positives in some cases!
All tests have finished.
Top patterns of log messages:
count count_% size size_% uniq_loggers uniq_threads levels background_% message_format_string
1. 24619 0.062 5.20 MiB 0.091 1 91 ['Debug'] 0 (from {}{}{}){}{}{} {} (stage: {})
2. 24094 0.061 3.61 MiB 0.063 5988 90 ['Trace'] 1 {} Creating query context from {} context, user_id: {}, parent context user: {}
3. 22205 0.056 626.67 KiB 0.011 1 90 ['Debug'] 0 Processed in {} sec.
4. 17831 0.045 462.57 KiB 0.008 1 115 ['Trace'] 0 Query to stage {}{}
5. 17522 0.044 869.99 KiB 0.015 1 115 ['Trace'] 0 Query from stage {} to stage {}{}
6. 13891 0.035 1.08 MiB 0.019 1 66 ['Debug'] 0 Read {} rows, {} in {} sec., {} rows/sec., {}/sec.
7. 12426 0.032 556.96 KiB 0.009 1 3 ['Trace'] 1 Processing requests batch, size: {}, bytes: {}
8. 9212 0.023 955.03 KiB 0.016 1 76 ['Trace'] 0.002 Checking existence of path: {}
9. 6999 0.018 492.28 KiB 0.008 1 724 ['Trace'] 0.642 Reserved {} on local disk {}, having unreserved {}.
10. 6959 0.018 820.43 KiB 0.014 630 257 ['Trace'] 0.485 Renaming temporary part {} to {} with tid {}.
11. 6880 0.017 325.06 KiB 0.006 1 246 ['Trace'] 0.485 filled checksums {}
12. 6740 0.017 467.50 KiB 0.008 628 687 ['Trace'] 0.629 Trying to reserve {} using storage policy from min volume index {}
13. 6191 0.016 287.97 KiB 0.005 6191 107 ['Debug'] 0.996 Authenticating user '{}' from {}
14. 6172 0.016 693.14 KiB 0.012 6172 107 ['Debug'] 0.996 {} Authenticated with global context as user {}
15. 6149 0.016 450.37 KiB 0.008 6149 90 ['Debug'] 1 Creating session context with user_id: {}
16. 6142 0.016 539.82 KiB 0.009 6142 105 ['Debug'] 0.996 {} Logout, user_id: {}
17. 5648 0.014 653.78 KiB 0.011 1 27 ['Debug'] 0 Reading {} marks from part {}, total {} rows starting from the beginning of the part, column {}
18. 5234 0.013 207.72 KiB 0.004 1 121 ['Debug'] 0.202 {}{} memory usage: {}.
19. 4730 0.012 445.13 KiB 0.008 1 60 ['Debug'] 0 Reading {} marks from part {}, total {} rows starting from the beginning of the part
20. 4639 0.012 154.84 KiB 0.003 2 90 ['Trace'] 1 TCP Request. Address: {}
21. 4514 0.011 412.46 KiB 0.007 1 90 ['Debug'] 1 Connected {} version {}.{}.{}, revision: {}{}{}.
22. 4467 0.011 117.78 KiB 0.002 1 88 ['Debug'] 1 Done processing connection.
23. 3701 0.009 169.24 KiB 0.003 1 125 ['Trace'] 0 Read steps statistics: {}
24. 3429 0.009 204.27 KiB 0.003 527 147 ['Debug'] 0.107 There are {} detached tables. Start searching non used tables.
25. 3429 0.009 143.99 KiB 0.002 527 147 ['Debug'] 0.107 Found {} non used tables in detached tables.
26. 3328 0.008 191.71 KiB 0.003 18 44 ['Trace'] 1 Flushing system log, {} entries to flush up to offset {}
27. 3324 0.008 118.71 KiB 0.002 18 44 ['Trace'] 1 Flushed system log up to offset {}
28. 2931 0.007 264.63 KiB 0.005 1 134 ['Trace'] 0 Aggregated. {} to {} rows (from {}) in {} sec. ({:.3f} rows/sec., {}/sec.)
29. 2797 0.007 83.28 KiB 0.001 1 135 ['Trace'] 0 Aggregation method: {}
30. 2712 0.007 78.18 KiB 0.001 446 81 ['Debug'] 0 Key condition: {}
31. 2673 0.007 331.82 KiB 0.006 1 56 ['Trace'] 0 No query result found for query {}
32. 2610 0.007 203.94 KiB 0.003 373 78 ['Trace'] 0 Reading {} ranges in{}order from part {}, approx. {} rows starting from {}
33. 2505 0.006 110.08 KiB 0.002 444 81 ['Trace'] 0 Filtering marks by primary and secondary keys
34. 2502 0.006 193.03 KiB 0.003 1 66 ['Trace'] 0 Query span trace_id for opentelemetry log: {}
35. 2267 0.006 24.35 KiB 0 1 134 ['Trace'] 0 Aggregating
36. 2229 0.006 253.81 KiB 0.004 436 81 ['Debug'] 0 Selected {}/{} parts by partition key, {} parts by primary key, {}/{} marks by primary key, {} marks to read from {} ranges
37. 2011 0.005 45.17 KiB 0.001 1 132 ['Trace'] 0 Merging aggregated data
38. 1985 0.005 124.79 KiB 0.002 331 81 ['Debug'] 0.001 PK index has dropped {}/{} granules, it took {}ms across {} threads.
39. 1830 0.005 94.72 KiB 0.002 393 81 ['Trace'] 0.001 Spreading mark ranges among streams (default reading)
40. 1782 0.005 1.58 MiB 0.027 2 14 ['Error'] 0.5 Number of arguments for function {} doesn't match: passed {}, should be {}
41. 1717 0.004 37.48 KiB 0.001 158 515 ['Trace'] 1 Execution took {} ms.
42. 1678 0.004 301.32 KiB 0.005 2 60 ['Trace'] 1 HTTP Request for {}. Method: {}, Address: {}, User-Agent: {}{}, Content Type: {}, Transfer Encoding: {}, X-Forwarded-For: {}
43. 1677 0.004 1.30 MiB 0.023 2 60 ['Trace'] 1 Request URI: {}
44. 1637 0.004 194.84 KiB 0.003 1 52 ['Trace'] 0 Stored query result of query {}
45. 1584 0.004 162.03 KiB 0.003 1 7 ['Trace'] 0.5 Adding file: {}, size: {}
46. 1494 0.004 149.12 KiB 0.003 28 16 ['Trace'] 1 Mutating part {} with mutation commands from {} mutations ({}): {}
47. 1494 0.004 86.25 KiB 0.001 28 16 ['Trace'] 1 Executing log entry to mutate part {} to {}
48. 1485 0.004 474.30 KiB 0.008 1 133 ['Trace'] 0.037 The new analyzer is enabled, but the old interpreter is used. It can be a bug, please report it. Will disable 'allow_experimental_analyzer' setting (for query: {})
49. 1467 0.004 186.79 KiB 0.003 1 51 ['Debug'] 0 Could not find entry for table_uuid: {}, part: {}, condition_hash: {}
50. 1458 0.004 123.87 KiB 0.002 2 16 ['Debug'] 1 Mutation of part {} finished by some other replica, will download mutated part
51. 1457 0.004 99.60 KiB 0.002 1 16 ['Debug'] 1 Part {} should be deleted after previous attempt before fetch
52. 1437 0.004 366.37 KiB 0.006 1 95 ['Trace'] 0 {}Keys: {}, datatype: {}, kind: {}, strictness: {}, right header: {}
53. 1415 0.004 29.02 KiB 0 2 60 ['Debug'] 0.027 Done processing query
54. 1339 0.003 107.85 KiB 0.002 1 108 ['Trace'] 0 An entry for key={} found in cache: {}
55. 1337 0.003 52.26 KiB 0.001 1 175 ['Debug'] 0.579 Spawn loader worker #{} in {}
56. 1337 0.003 37.88 KiB 0.001 1 170 ['Debug'] 1 Stop worker in {}
57. 1336 0.003 98.58 KiB 0.002 1 154 ['Debug'] 1 Execute load job '{}' in {}
58. 1336 0.003 102.50 KiB 0.002 1 67 ['Debug'] 0.065 Schedule load job '{}' into {}
59. 1336 0.003 93.35 KiB 0.002 1 154 ['Debug'] 1 Finish load job '{}' with status {}
60. 1323 0.003 123.54 KiB 0.002 1 68 ['Debug'] 0.045 Prioritize load job '{}': {} -> {}
61. 1226 0.003 135.47 KiB 0.002 469 128 ['Debug'] 0.971 Removing {} parts from filesystem (serially): Parts: [{}]
62. 1179 0.003 118.39 KiB 0.002 675 471 ['Trace'] 1 Didn't start merge: {}
63. 1141 0.003 37.87 KiB 0.001 1 176 ['Debug'] 0.511 Change current priority: {} -> {}
64. 1134 0.003 9.97 KiB 0 2 67 ['Trace'] 0.007 No tables
65. 1014 0.003 209.36 KiB 0.004 1 5 ['Error'] 0 Failed to push block to view {}, {}
66. 1010 0.003 74.96 KiB 0.001 1 58 ['Debug'] 0 Waiting for table {} to be finally dropped
67. 1010 0.003 116.39 KiB 0.002 1 58 ['Debug'] 0 Done waiting for the table {} to be dropped. The outcome: {}
68. 1004 0.003 22.55 KiB 0 4 4 ['Information'] 0 Removing leftover nodes
69. 1000 0.003 38.09 KiB 0.001 1 1 ['Information'] 0 Someone else is removing leftover nodes
70. 988 0.003 81.81 KiB 0.001 1 61 ['Debug'] 0 Merging {} parts: from {} to {} into {} with storage {}
71. 988 0.003 33.71 KiB 0.001 1 61 ['Debug'] 0 Selected MergeAlgorithm: {}
72. 977 0.002 127.63 KiB 0.002 1 61 ['Debug'] 0 Merge sorted {} rows, containing {} columns ({} merged, {} gathered) in {} sec., {} rows/sec., {}/sec.
73. 976 0.002 63.25 KiB 0.001 140 63 ['Information'] 0 Merged {} parts: [{}, {}] -> {}
74. 969 0.002 171.22 KiB 0.003 1 99 ['Information'] 1 Removing metadata {} of dropped table {}
75. 931 0.002 70.10 KiB 0.001 1 123 ['Trace'] 0 Statistics updated for key={}: {}
76. 891 0.002 35.67 KiB 0.001 1 49 ['Trace'] 0 PREWHERE condition was split into {} steps
77. 859 0.002 94.46 KiB 0.002 1 76 ['Trace'] 0 Adjusting memory limit before external aggregation with {} (ratio: {}, available system memory: {})
78. 858 0.002 13.41 KiB 0 125 68 ['Debug'] 1 Scheduling tasks
79. 852 0.002 61.60 KiB 0.001 1 418 ['Information'] 1 Have {} tables in drop queue ({} of them are in use), will try drop {} tables
80. 844 0.002 33.79 KiB 0.001 14 100 ['Trace'] 0.002 Sending external_roles with query: [{}] ({})
81. 842 0.002 72.78 KiB 0.001 53 444 ['Information'] 0.992 Selected {} parts from {} to {}. Merge selecting phase took: {}ms
82. 840 0.002 48.57 KiB 0.001 2 22 ['Trace'] 0.939 Loading config file '{}'.
83. 824 0.002 86.12 KiB 0.001 92 44 ['Debug'] 0.955 Removing {} parts from memory: Parts: [{}]
84. 824 0.002 15.29 KiB 0 92 44 ['Debug'] 0.955 Removed {} {} parts
85. 824 0.002 103.02 KiB 0.002 92 44 ['Trace'] 0.955 Skipped {} old parts, found {} old parts to remove. Parts: [{}]
86. 819 0.002 59.69 KiB 0.001 1 58 ['Trace'] 0 The min valid primary key position for moving to the tail of PREWHERE is {}
87. 809 0.002 182.02 KiB 0.003 125 68 ['Trace'] 1 scheduleTasks: initialized={}, size_before_filtering={}, queue_size={}, entries={}..{}, first_failed_task_name={}, current_tasks_size={}, last_current_task={}, last_skipped_entry_name={}
88. 807 0.002 19.70 KiB 0 125 68 ['Debug'] 1 Waiting for queue updates
89. 791 0.002 13.90 KiB 0 740 109 ['Debug'] 0.067 Loading data parts
90. 788 0.002 76.74 KiB 0.001 27 399 ['Trace'] 1 Scheduling next cleanup after {}ms (points: {}, interval: {}ms, ratio: {}, points per minute: {})
91. 785 0.002 54.88 KiB 0.001 1 431 ['Trace'] 0.936 Rolling back transaction {}{}
92. 770 0.002 156.65 KiB 0.003 4 4 ['Information'] 1 An error occurred while checking and cleaning task {} from queue: {}
93. 741 0.002 21.71 KiB 0 125 66 ['Trace'] 1 Checking task {}
94. 737 0.002 37.43 KiB 0.001 125 66 ['Debug'] 1 Will schedule {} tasks starting from {}
95. 737 0.002 16.55 KiB 0 733 86 ['Debug'] 0.031 There are no data parts
96. 714 0.002 68.01 KiB 0.001 124 65 ['Debug'] 1 Will not execute task {}: {}
97. 684 0.002 90.65 KiB 0.002 1 46 ['Trace'] 0 Before join block: '{}'
98. 678 0.002 161.01 KiB 0.003 1 46 ['Trace'] 0 After join block: '{}'
99. 645 0.002 114.95 KiB 0.002 1 83 ['Debug'] 0 {} entry for table_id: {}, part_name: {}, condition_hash: {}, marks_count: {}, has_final_mark: {}, ranges: {}
100. 639 0.002 50.18 KiB 0.001 13 64 ['Trace'] 0.834 List of all grants: {}
count count_% size size_% uniq_loggers uniq_threads levels background_% message_format_string
Top messages without format string (fmt::runtime):
count pattern runtime_message line
1. 28 CodeDBExceptionSyntaxerrorfailed Code: 62. DB::Exception: Syntax error: failed at position 102 (IDENTIFIED): IDENTIFIED plaintext_password by '8'. Expected one of: NO_PASSWORD, PLAINTEXT_PASSWORD, SHA256_PASSWORD, DOUBLE_SHA1_PASSWORD, LDAP, KERBEROS, SSL_CERTIFICATE, BCRYPT_PASSWORD, SSH ('/executeQuery.cpp',301)
2. 22 IfthesignaturecheckfailedThiscou If the signature check failed. This could be because of a time skew. Attempting to adjust the signer. ('/AWSLogger.cpp',70)
3. 20 CodeDBExceptionReceivedfromDBExc Code: 439. DB::Exception: Received from 127.0.0.2:9000. DB::Exception: Cannot schedule a task: failed to start the thread (threads=1, jobs=1). Stack trace: ↴ ('/executeQuery.cpp',301)
↳ ↴
↳0. ./contrib/llvm-project/libcxx/include/__exception/exception.h:113: Poco::Exception::Exception(St
4. 15 voidDBStorageReplicatedMergeTree void DB::StorageReplicatedMergeTree::mutationsUpdatingTask(): Code: 999. Coordination::Exception: Session expired. (KEEPER_EXCEPTION), Stack trace (when copying this message, always include the lines below): ↴ ('/Exception.cpp',285)
↳ ↴
↳0. ./contrib/llvm-project/libcxx/include/__exce
5. 13 voidDBReplicatedMergeTreeCleanup void DB::ReplicatedMergeTreeCleanupThread::run(): Code: 999. Coordination::Exception: Session expired. (KEEPER_EXCEPTION), Stack trace (when copying this message, always include the lines below): ↴ ('/Exception.cpp',285)
↳ ↴
↳0. ./contrib/llvm-project/libcxx/include/__exception/except
6. 11 CodeCoordinationExceptionSession Code: 999. Coordination::Exception: Session expired (fault injected on recv). (KEEPER_EXCEPTION), Stack trace (when copying this message, always include the lines below): ↴ ('/Exception.cpp',285)
↳ ↴
↳0. ./contrib/llvm-project/libcxx/include/__exception/exception.h:113: Poco::Exceptio
7. 6 Connectiontomysqlfailedtimes Connection to mysql failed 1 times ('',0)
8. 4 CodeCoordinationExceptionFaultin Code: 999. Coordination::Exception: Fault injection before operation. (KEEPER_EXCEPTION), Stack trace (when copying this message, always include the lines below): ↴ ('/TCPHandler.cpp',472)
↳ ↴
↳0. ./contrib/llvm-project/libcxx/include/__exception/exception.h:113: Poco::Exception::Excep
9. 4 Exceptionwhileexecutingbackgroun Exception while executing background task {97d8b1c8-8139-41e2-b4ab-b3afe3a077c8::all_1_1_0_2}: Code: 999. Coordination::Exception: Session expired. (KEEPER_EXCEPTION), Stack trace (when copying this message, always include the lines below): ↴ ('/Exception.cpp',285)
↳ ↴
↳0. ./contrib/l
10. 4 CodeDBExceptionFaultinjectionbef Code: 999. DB::Exception: Fault injection before operation. (KEEPER_EXCEPTION) (version 25.3.14.10001.altinitystable (altinity build)) (from [::1]:54014) (comment: 02456_keeper_retries_during_insert.sql) (query 6, line 10) (in query: INSERT INTO keeper_ret ('/executeQuery.cpp',301)
11. 4 virtualboolDBReplicatedMergeMuta virtual bool DB::ReplicatedMergeMutateTaskBase::executeStep(): Code: 999. Coordination::Exception: Session expired. (KEEPER_EXCEPTION), Stack trace (when copying this message, always include the lines below): ↴ ('/Exception.cpp',285)
↳ ↴
↳0. ./contrib/llvm-project/libcxx/include/__exc
12. 3 Forkedachildprocesstowatch Forked a child process to watch ('',0)
13. 3 configatindexiscommittedprevconf config at index 1 is committed, prev config log idx 0 ('/LoggerWrapper.h',43)
14. 3 peerDCIDlocalhostvotingmembermyi peer 1: DC ID 0, localhost:9234, voting member, 1 ↴ ('/LoggerWrapper.h',43)
↳my id: 1, voting_member ↴
↳num peers: 0
15. 3 invalidelectiontimeoutupperbound invalid election timeout upper bound detected, adjusted to 0 ('/LoggerWrapper.h',43)
16. 3 invalidelectiontimeoutlowerbound invalid election timeout lower bound detected, adjusted to 0 ('/LoggerWrapper.h',43)
17. 3 INITRAFTSERVERcommitindextermele === INIT RAFT SERVER === ↴ ('/LoggerWrapper.h',43)
↳commit index 0 ↴
↳term 0 ↴
↳election timer allowed ↴
↳log store start 1, end 0 ↴
↳config log idx 0, prev log idx 0 ↴
↳ -- ASYNC REPLICATION --
18. 3 RaftASIOlistenerinitiatedonunsec Raft ASIO listener initiated on :::9234, unsecured ('/LoggerWrapper.h',43)
19. 3 Connectiontomysqldbasusermysqlus Connection to mysql_db@127.123.0.1:3306 as user mysql_user failed: mysqlxx::ConnectionFailed: Can't connect to MySQL server on '127.123.0.1' (115) ((nullptr):0) ('',0)
20. 3 VOTEINITmyidmyrolecandidateterml [VOTE INIT] my id 1, my role candidate, term 1, log idx 0, log term 0, priority (target 1 / mine 1) ('/LoggerWrapper.h',43)
21. 3 statemachinecommitindexprecommit state machine commit index 0, precommit index 0, last log index 0 ('/LoggerWrapper.h',43)
22. 3 newconfigurationlogidxprevlogidx new configuration: log idx 1, prev log idx 0 ↴ ('/LoggerWrapper.h',43)
↳peer 1, DC ID 0, localhost:9234, voting member, 1 ↴
↳my id: 1, leader: 1, term: 1
23. 3 waitforHBforms wait for HB, for 50 + [0, 0] ms ('/LoggerWrapper.h',43)
24. 3 parameterselectiontimeoutrangehe parameters: election timeout range 0 - 0, heartbeat 0, leadership expiry 0, max batch 100, backoff 50, snapshot distance 10000, enable randomized snapshot creation NO, log sync stop gap 99999, reserved logs 2147483647, client timeout 10000, auto forwarding ('/LoggerWrapper.h',43)
25. 3 Electiontimeoutinitiateleaderele Election timeout, initiate leader election ('/LoggerWrapper.h',43)
26. 3 BECOMELEADERappendednewconfigat [BECOME LEADER] appended new config at 1 ('/LoggerWrapper.h',43)
27. 3 PRIORITYdecaytargetmine [PRIORITY] decay, target 1 -> 1, mine 1 ('/LoggerWrapper.h',43)
28. 3 StartingClickHousealtinitystable Starting ClickHouse 25.3.14.10001.altinitystable (revision: 4294967295, git hash: 07020f362800626e9ea95b3bc0c3b19c36cb4272, build id: 1647FE9BCC9DDCE9F0A68D1A6F98DC2C00469C0E), PID 427 ('',0)
29. 3 startingup starting up ('',0)
30. 3 newelectiontimeoutrange new election timeout range: 0 - 0 ('/LoggerWrapper.h',43)
Top messages not matching their format strings:
message_format_string count() any_message
1. 113 Connection to conv_main@127.0.0.1:3456 as user metrika failed: mysqlxx::ConnectionFailed: Can't connect to MySQL server on '127.0.0.1' (115) ((nullptr):0)
2. {} is in use (by merge/mutation/INSERT) (consider increasing temporary_directories_lifetime setting) 62 /var/lib/clickhouse/store/506/50612272-69c2-44ef-bbbd-7b5d198c8d4d/tmp_merge_202609_1_71_14/ is in use (by merge/mutation/INSERT) (consider increasing temporary_directories_lifetime setting) (skipped 1 similar messages)
3. Close WriteBufferFromAzureBlobStorage. {}. 5 Close WriteBufferFromAzureBlobStorage. lgaeivadeyjimewyrrvsmcsdmqfmqjmf. (LogSeriesLimiter: on interval from 2026-09-21 01:34:16 to 2026-09-21 01:41:31 accepted series 1 / 1 for the logger WriteBufferFromAzureBlobStorage)
4. Substitution '\{}' in replacement argument is invalid, regexp has only {} capturing groups 4 Code: 36. DB::Exception: Substitution '\1' in replacement argument is invalid, regexp has only 0 capturing groups. (BAD_ARGUMENTS) (version 25.3.14.10001.altinitystable (altinity build)) (from [::1]:46962) (comment: 02864_replace_regexp_string_fallback.sql) (query 2, line 7) (in query: -- negative tests↴
↳ -- Even if the fallback is used, invalid substitutions must throw an exception. ↴
↳ SELECT 'Hello' AS haystack, 'l' AS needle, '\\1' AS replacement, replaceRegexpOne(materialize(haystack), needle, replacement);), Stack trace (when copying this message, always include the lines below): ↴
↳ ↴
↳0. ./contrib/llvm-project/libcxx/include/__exception/exception.h:113: Poco::Exception::Exception(String const&, int) @ 0x000000003867ecd1 ↴
↳1. ./build_docker/./src/Common/Exception.cpp:108: DB::Exception::Exception(DB::Exception::MessageMasked&&, int, bool) @ 0x000000001c089a11 ↴
↳2. DB::Exception::Exception(PreformattedMessage&&, int) @ 0x000000000c6c420b ↴
↳3. DB::Exception::Exception(int, FormatStringHelperImpl::type, std::type_identity::type>, int&, int&&) @ 0x00000000188f403e ↴
↳4. DB::ReplaceRegexpImpl::checkSubstitutions(std::basic_string_view>, int) @ 0x00000000188fcc2f ↴
↳5. DB::FunctionStringReplace, DB::(anonymous namespace)::NameReplaceRegexpOne>::executeImpl(std::vector> const&, std::shared_ptr const&, unsigned long) const @ 0x00000000188f769b↴
↳6. DB::IFunction::executeImplDryRun(std::vector> const&, std::shared_ptr const&, unsigned long) const @ 0x000000000c6c20b5 ↴
↳7. ./build_docker/./src/Functions/IFunctionAdaptors.cpp:16: DB::FunctionToExecutableFunctionAdaptor::executeDryRunImpl(std::vector> const&, std::shared_ptr const&, unsigned long) const @ 0x0000000025d7cb95↴
↳8. DB::IExecutableFunction::executeWithoutLowCardinalityColumns(std::vector> const&, std::shared_ptr const&, unsigned long, bool) const @ 0x0000000025d6d74f ↴
↳9. DB::IExecutableFunction::executeWithoutSparseColumns(std::vector> const&, std::shared_ptr const&, unsigned long, bool) const @ 0x0000000025d70af9 ↴
↳10. DB::IExecutableFunction::execute(std::vector> const&, std::shared_ptr const&, unsigned long, bool) const @ 0x0000000025d73096 ↴
↳11. ./build_docker/./src/Interpreters/ActionsDAG.cpp:812: DB::ActionsDAG::evaluatePartialResult(std::unordered_map, std::equal_to, std::allocator>>&, std::vector> const&, unsigned long, bool) @ 0x0000000028a69cdd↴
↳12. ./build_docker/./src/Interpreters/ActionsDAG.cpp:892: DB::ActionsDAG::updateHeader(DB::Block const&) const @ 0x0000000028a6736d ↴
↳13. ./build_docker/./src/Processors/Transforms/ExpressionTransform.cpp:10: DB::ExpressionTransform::transformHeader(DB::Block const&, DB::ActionsDAG const&) @ 0x00000000309069f7 ↴
↳14. ./build_docker/./src/Processors/QueryPlan/ExpressionStep.cpp:38: DB::ExpressionStep::ExpressionStep(DB::Block const&, DB::ActionsDAG) @ 0x0000000030cf779f ↴
↳15. ./contrib/llvm-project/libcxx/include/__memory/unique_ptr.h:634: DB::(anonymous namespace)::addExpressionStep(DB::QueryPlan&, std::shared_ptr&, String const&, std::unordered_set, std::hash>, std::equal_to>, std::allocator>>&) @ 0x000000002a7c3e48↴
↳16. ./build_docker/./src/Planner/Planner.cpp:1655: DB::Planner::buildPlanForQueryNode() @ 0x000000002a7bbe73 ↴
↳17. ./build_docker/./src/Planner/Planner.cpp:1315: DB::Planner::buildQueryPlanIfNeeded() @ 0x000000002a7ac51f ↴
↳18. ./build_docker/./src/Interpreters/InterpreterSelectQueryAnalyzer.cpp:255: DB::InterpreterSelectQueryAnalyzer::getQueryPlan() @ 0x000000002a7a76f2 ↴
↳19. ./build_docker/./src/Interpreters/executeQuery.cpp:1405: DB::executeQueryImpl(char const*, char const*, std::shared_ptr, DB::QueryFlags, DB::QueryProcessingStage::Enum, DB::ReadBuffer*, std::shared_ptr&) @ 0x000000002af35e79↴
↳20. ./build_docker/./src/Interpreters/executeQuery.cpp:1624: DB::executeQuery(String const&, std::shared_ptr, DB::QueryFlags, DB::QueryProcessingStage::Enum) @ 0x000000002af2eca5 ↴
↳21. ./build_docker/./src/Server/TCPHandler.cpp:664: DB::TCPHandler::runImpl() @ 0x00000000300bf716 ↴
↳22. ./build_docker/./src/Server/TCPHandler.cpp:2629: DB::TCPHandler::run() @ 0x00000000300ff3da ↴
↳23. ./build_docker/./base/poco/Net/src/TCPServerConnection.cpp:40: Poco::Net::TCPServerConnection::start() @ 0x0000000038859fcf ↴
↳24. ./build_docker/./base/poco/Net/src/TCPServerDispatcher.cpp:115: Poco::Net::TCPServerDispatcher::run() @ 0x000000003885ac97 ↴
↳25. ./build_docker/./base/poco/Foundation/src/ThreadPool.cpp:205: Poco::PooledThread::run() @ 0x00000000387695eb ↴
↳26. ./base/poco/Foundation/src/Thread_POSIX.cpp:335: Poco::ThreadImpl::runnableEntry(void*) @ 0x00000000387631e8 ↴
↳27. asan_thread_start(void*) @ 0x000000000c676e77 ↴
↳28. ? @ 0x00007f81386d7ac3 ↴
↳29. ? @ 0x00007f8138769850 ↴
5. Cleanup is cancelled, exiting 3 Cleanup is cancelled, exiting (skipped 1 similar messages)
6. (from {}{}{}){}{}{} {} (stage: {}) 1 (from [::1]:48800) (comment: 02687_native_fuzz.sql) (query 1, line 1) -- It correctly throws exception about incorrect data instead of a low-level exception about the allocator: ↴
↳ SELECT * FROM format(Native, 'WatchID Int64, JavaEnable Int16, UTMCaTitle String, GoodEvent Int16, EventTime DateTime, EventDate Date, Countem String, FromTag String, HasGCLID Int16, RefererHash Int64, URLHash Int64, CLID Int16', $$
� �'�X+�'�X+�'�URLHashInt64�|3�b.�|3�b.�|3�b.�|3�b.�↴
↳o�e�
�#�\X-h�X v�v�h�9�D�|3�b.�CLIDInt32 � $$); (stage: Complete)
Top short messages:
c message_format_string substr(any(toValidUTF8(message)), 1, 120) min_length_without_exception_boilerplate
1. 25 Creating {}: {} Creating table test_hy6eg35p_2.src: CREATE TABLE IF NOT EXISTS test_hy6eg35p_2.src UUID '3100010f-87c5-405c-833a-435d6d6 124
2. 14 {} ThreadFuzzer is enabled. Application will run slowly and unstable. 35
3. 11 Cannot TRUNCATE dictionary Code: 62. DB::Exception: Cannot TRUNCATE dictionary. (SYNTAX_ERROR) (version 25.3.14.10001.altinitystable (altinity buil 27
4. 5 Found {} on {} Found snapshot_37.bin.zstd on LocalSnapshotDisk 18
5. 2 Unknown setting '{}' Code: 115. DB::Exception: Unknown setting 'xxx_yyy'. (UNKNOWN_SETTING) (version 25.3.14.10001.altinitystable (altinity b 27
6. 2 Unknown table engine {} Code: 56. DB::Exception: Unknown table engine s3. (UNKNOWN_STORAGE) (version 25.3.14.10001.altinitystable (altinity buil 24
Top messages by level:
(0.004515702328551554,'Number of arguments for function {} doesn\'t match: passed {}, should be {}') Error
(0.0003927799444026324,'ZooKeeper session has expired. Switching to a new session.') Warning
(0.0025442004140660834,'Removing leftover nodes') Information
(0.062393727684397514,'(from {}{}{}){}{}{} {} (stage: {})') Debug
(0.06106334400174344,'{} Creating query context from {} context, user_id: {}, parent context user: {}') Trace
2026-09-21 02:05:47,439 Stress test finished
+ echo -e 'Test script exit code\tOK\t\N\t'
+ rg -Fa 'No queries hung' /test_output/test_results.tsv
+ grep -Fa OK
No queries hung OK \N
+ stop_server
+ local max_tries=90
+ local check_hang=true
+ local pid
++ cat /var/run/clickhouse-server/clickhouse-server.pid
+ pid=2832
+ for i in {1..30}
+ clickhouse client -q 'SYSTEM STOP DISTRIBUTED SENDS'
+ break
+ clickhouse stop --max-tries 90 --do-not-kill
/var/run/clickhouse-server/clickhouse-server.pid file exists and contains pid = 2832.
The process with pid = 2832 is running.
Sent terminate signal to process with pid 2832.
Waiting for server to stop
/var/run/clickhouse-server/clickhouse-server.pid file exists and contains pid = 2832.
The process with pid = 2832 is running.
Waiting for server to stop
/var/run/clickhouse-server/clickhouse-server.pid file exists and contains pid = 2832.
The process with pid = 2832 is running.
Waiting for server to stop
/var/run/clickhouse-server/clickhouse-server.pid file exists and contains pid = 2832.
The process with pid = 2832 is running.
Waiting for server to stop
/var/run/clickhouse-server/clickhouse-server.pid file exists and contains pid = 2832.
The process with pid = 2832 is running.
Waiting for server to stop
/var/run/clickhouse-server/clickhouse-server.pid file exists and contains pid = 2832.
The process with pid = 2832 is running.
Waiting for server to stop
/var/run/clickhouse-server/clickhouse-server.pid file exists and contains pid = 2832.
The process with pid = 2832 is running.
Waiting for server to stop
/var/run/clickhouse-server/clickhouse-server.pid file exists and contains pid = 2832.
The process with pid = 2832 is running.
Waiting for server to stop
/var/run/clickhouse-server/clickhouse-server.pid file exists and contains pid = 2832.
The process with pid = 2832 is running.
Waiting for server to stop
/var/run/clickhouse-server/clickhouse-server.pid file exists and contains pid = 2832.
The process with pid = 2832 is running.
Waiting for server to stop
/var/run/clickhouse-server/clickhouse-server.pid file exists and contains pid = 2832.
The process with pid = 2832 is running.
Waiting for server to stop
/var/run/clickhouse-server/clickhouse-server.pid file exists and contains pid = 2832.
The process with pid = 2832 is running.
Waiting for server to stop
/var/run/clickhouse-server/clickhouse-server.pid file exists and contains pid = 2832.
The process with pid = 2832 does not exist.
Server stopped
+ return
+ mv /var/log/clickhouse-server/clickhouse-server.log /var/log/clickhouse-server/clickhouse-server.stress.log
+ unset THREAD_FUZZER_CPU_TIME_PERIOD_US THREAD_FUZZER_EXPLICIT_MEMORY_EXCEPTION_PROBABILITY THREAD_FUZZER_EXPLICIT_SLEEP_PROBABILITY THREAD_FUZZER_SLEEP_PROBABILITY THREAD_FUZZER_SLEEP_TIME_US_MAX THREAD_FUZZER_pthread_mutex_lock_AFTER_MIGRATE_PROBABILITY THREAD_FUZZER_pthread_mutex_lock_AFTER_SLEEP_PROBABILITY THREAD_FUZZER_pthread_mutex_lock_AFTER_SLEEP_TIME_US_MAX THREAD_FUZZER_pthread_mutex_lock_BEFORE_MIGRATE_PROBABILITY THREAD_FUZZER_pthread_mutex_lock_BEFORE_SLEEP_PROBABILITY THREAD_FUZZER_pthread_mutex_lock_BEFORE_SLEEP_TIME_US_MAX THREAD_FUZZER_pthread_mutex_unlock_AFTER_MIGRATE_PROBABILITY THREAD_FUZZER_pthread_mutex_unlock_AFTER_SLEEP_PROBABILITY THREAD_FUZZER_pthread_mutex_unlock_AFTER_SLEEP_TIME_US_MAX THREAD_FUZZER_pthread_mutex_unlock_BEFORE_MIGRATE_PROBABILITY THREAD_FUZZER_pthread_mutex_unlock_BEFORE_SLEEP_PROBABILITY THREAD_FUZZER_pthread_mutex_unlock_BEFORE_SLEEP_TIME_US_MAX THREAD_POOL_FAULT_INJECTION
+ rm /etc/clickhouse-server/config.d/cannot_allocate_thread_injection.xml
+ start_server
+ counter=0
+ max_attempt=120
+ clickhouse-client --query 'SELECT 1'
Code: 210. DB::NetException: Connection refused (localhost:9000). (NETWORK_ERROR)
+ '[' 0 -gt 120 ']'
+ clickhouse start --user root
+ sleep 0.5
+ counter=1
+ clickhouse-client --query 'SELECT 1'
Code: 210. DB::NetException: Connection refused (localhost:9000). (NETWORK_ERROR)
+ '[' 1 -gt 120 ']'
+ clickhouse start --user root
+ sleep 0.5
+ counter=2
+ clickhouse-client --query 'SELECT 1'
Code: 210. DB::NetException: Connection refused (localhost:9000). (NETWORK_ERROR)
+ '[' 2 -gt 120 ']'
+ clickhouse start --user root
+ sleep 0.5
+ counter=3
+ clickhouse-client --query 'SELECT 1'
Code: 210. DB::NetException: Connection refused (localhost:9000). (NETWORK_ERROR)
+ '[' 3 -gt 120 ']'
+ clickhouse start --user root
+ sleep 0.5
+ counter=4
+ clickhouse-client --query 'SELECT 1'
Code: 210. DB::NetException: Connection refused (localhost:9000). (NETWORK_ERROR)
+ '[' 4 -gt 120 ']'
+ clickhouse start --user root
+ sleep 0.5
+ counter=5
+ clickhouse-client --query 'SELECT 1'
Code: 210. DB::NetException: Connection refused (localhost:9000). (NETWORK_ERROR)
+ '[' 5 -gt 120 ']'
+ clickhouse start --user root
+ sleep 0.5
+ counter=6
+ clickhouse-client --query 'SELECT 1'
Code: 210. DB::NetException: Connection refused (localhost:9000). (NETWORK_ERROR)
+ '[' 6 -gt 120 ']'
+ clickhouse start --user root
+ sleep 0.5
+ counter=7
+ clickhouse-client --query 'SELECT 1'
Code: 210. DB::NetException: Connection refused (localhost:9000). (NETWORK_ERROR)
+ '[' 7 -gt 120 ']'
+ clickhouse start --user root
+ sleep 0.5
+ counter=8
+ clickhouse-client --query 'SELECT 1'
1
+ attach_gdb_to_clickhouse
++ clickhouse local --query 'SELECT count() FROM system.build_options WHERE name = '\''CXX_FLAGS'\'' AND position('\''sanitize=address'\'' IN value)'
+ IS_ASAN=1
+ [[ 1 = \1 ]]
+ echo 'ASAN build detected. Not using gdb since it disables LeakSanitizer detections'
ASAN build detected. Not using gdb since it disables LeakSanitizer detections
+ check_server_start
+ clickhouse-client --query 'SELECT '\''Server successfully started'\'', '\''OK'\'', NULL, '\'''\'''
+ '[' -s /test_output/application_errors.txt ']'
+ rm /test_output/application_errors.txt
rm: cannot remove '/test_output/application_errors.txt': No such file or directory
+ stop_server
+ local max_tries=90
+ local check_hang=true
+ local pid
++ cat /var/run/clickhouse-server/clickhouse-server.pid
+ pid=52544
+ for i in {1..30}
+ clickhouse client -q 'SYSTEM STOP DISTRIBUTED SENDS'
+ break
+ clickhouse stop --max-tries 90 --do-not-kill
/var/run/clickhouse-server/clickhouse-server.pid file exists and contains pid = 52544.
The process with pid = 52544 is running.
Sent terminate signal to process with pid 52544.
Waiting for server to stop
/var/run/clickhouse-server/clickhouse-server.pid file exists and contains pid = 52544.
The process with pid = 52544 is running.
Waiting for server to stop
/var/run/clickhouse-server/clickhouse-server.pid file exists and contains pid = 52544.
The process with pid = 52544 is running.
Waiting for server to stop
/var/run/clickhouse-server/clickhouse-server.pid file exists and contains pid = 52544.
The process with pid = 52544 is running.
Waiting for server to stop
/var/run/clickhouse-server/clickhouse-server.pid file exists and contains pid = 52544.
The process with pid = 52544 is running.
Waiting for server to stop
/var/run/clickhouse-server/clickhouse-server.pid file exists and contains pid = 52544.
The process with pid = 52544 is running.
Waiting for server to stop
/var/run/clickhouse-server/clickhouse-server.pid file exists and contains pid = 52544.
The process with pid = 52544 is running.
Waiting for server to stop
/var/run/clickhouse-server/clickhouse-server.pid file exists and contains pid = 52544.
The process with pid = 52544 is running.
Waiting for server to stop
/var/run/clickhouse-server/clickhouse-server.pid file exists and contains pid = 52544.
The process with pid = 52544 is running.
Waiting for server to stop
/var/run/clickhouse-server/clickhouse-server.pid file exists and contains pid = 52544.
The process with pid = 52544 is running.
Waiting for server to stop
/var/run/clickhouse-server/clickhouse-server.pid file exists and contains pid = 52544.
The process with pid = 52544 is running.
Waiting for server to stop
/var/run/clickhouse-server/clickhouse-server.pid file exists and contains pid = 52544.
The process with pid = 52544 is running.
Waiting for server to stop
/var/run/clickhouse-server/clickhouse-server.pid file exists and contains pid = 52544.
The process with pid = 52544 is running.
Waiting for server to stop
/var/run/clickhouse-server/clickhouse-server.pid file exists and contains pid = 52544.
The process with pid = 52544 is running.
Waiting for server to stop
Found pid = 53510 in the list of running processes.
The process with pid = 53510 is running.
Waiting for server to stop
Now there is no clickhouse-server process.
Server stopped
+ return
+ '[' -f /var/log/clickhouse-server/clickhouse-server.log ']'
+ '[' -f /var/log/clickhouse-server/stderr.log ']'
+ mv /var/log/clickhouse-server/clickhouse-server.log /var/log/clickhouse-server/clickhouse-server.final.log
+ check_logs_for_critical_errors
+ sed -n '/WARNING:.*anitizer/,/^$/p' /var/log/clickhouse-server/stderr.log
+ rg -Fav -e 'ASan doesn'\''t fully support makecontext/swapcontext functions' -e DB::Exception /test_output/tmp
+ echo -e 'No sanitizer asserts\tOK\t\N\t'
+ rm -f /test_output/tmp
+ rg -Fa ' Application: Child process was terminated by signal 9' /var/log/clickhouse-server/clickhouse-server.err.log /var/log/clickhouse-server/clickhouse-server.final.log /var/log/clickhouse-server/clickhouse-server.initial.log /var/log/clickhouse-server/clickhouse-server.stress.log
+ echo -e 'No OOM messages in clickhouse-server.log\tOK\t\N\t'
+ rg -Fa 'Code: 49. DB::Exception: ' /var/log/clickhouse-server/clickhouse-server.err.log /var/log/clickhouse-server/clickhouse-server.final.log /var/log/clickhouse-server/clickhouse-server.initial.log /var/log/clickhouse-server/clickhouse-server.stress.log
+ echo -e 'No logical errors\tOK\t\N\t'
+ '[' -s /test_output/logical_errors.txt ']'
+ rm /test_output/logical_errors.txt
+ rg --text 'Code: 499.*The specified key does not exist' /var/log/clickhouse-server/clickhouse-server.err.log /var/log/clickhouse-server/clickhouse-server.final.log /var/log/clickhouse-server/clickhouse-server.initial.log /var/log/clickhouse-server/clickhouse-server.stress.log
+ grep -v -e a.myext -e DistributedCacheTCPHandler -e ReadBufferFromDistributedCache -e ReadBufferFromS3 -e ReadBufferFromAzureBlobStorage -e AsynchronousBoundedReadBuffer -e 'caller id: None:DistribCache'
+ echo -e 'No lost s3 keys\tOK\t\N\t'
+ rg -Fa 'it is lost forever' /var/log/clickhouse-server/clickhouse-server.err.log /var/log/clickhouse-server/clickhouse-server.final.log /var/log/clickhouse-server/clickhouse-server.initial.log /var/log/clickhouse-server/clickhouse-server.stress.log
+ grep SharedMergeTreePartCheckThread
+ echo -e 'No SharedMergeTree lost forever in clickhouse-server.log\tOK\t\N\t'
+ '[' -s /test_output/no_such_key_errors.txt ']'
+ rm /test_output/no_such_key_errors.txt
+ rg -Fa '#######################################' /var/log/clickhouse-server/clickhouse-server.err.log /var/log/clickhouse-server/clickhouse-server.final.log /var/log/clickhouse-server/clickhouse-server.initial.log /var/log/clickhouse-server/clickhouse-server.stress.log
+ echo -e 'Not crashed\tOK\t\N\t'
+ rg -Fa ' ' /var/log/clickhouse-server/clickhouse-server.err.log /var/log/clickhouse-server/clickhouse-server.final.log /var/log/clickhouse-server/clickhouse-server.initial.log /var/log/clickhouse-server/clickhouse-server.stress.log
+ echo -e 'No fatal messages in clickhouse-server.log\tOK\t\N\t'
+ '[' -s /test_output/fatal_messages.txt ']'
+ rm /test_output/fatal_messages.txt
+ rg -v 'rg -Faz '
+ rg -Faz '########################################' /test_output/stress_run_logs.tar.zst /test_output/test_results.tsv
+ rg -Fa ' received signal ' /test_output/gdb.log
/test_output/gdb.log: No such file or directory (os error 2)
+ dmesg -T
+ grep -q -F -e 'Out of memory: Killed process' -e 'oom_reaper: reaped process' -e oom-kill:constraint=CONSTRAINT_NONE /test_output/dmesg.log
+ echo -e 'No OOM in dmesg\tOK\t\N\t'
+ tar -chf /test_output/coordination.tar /var/lib/clickhouse/coordination
tar: Removing leading `/' from member names
tar: Removing leading `/' from hard link targets
+ collect_query_and_trace_logs
+ for table in query_log trace_log metric_log
+ clickhouse-local --config-file=/etc/clickhouse-server/config.xml --only-system-tables -q 'select * from system.query_log format TSVWithNamesAndTypes'
+ zstd --threads=0
Logging trace to /var/log/clickhouse-server/clickhouse-server.log
Logging errors to /var/log/clickhouse-server/clickhouse-server.err.log
+ for table in query_log trace_log metric_log
+ clickhouse-local --config-file=/etc/clickhouse-server/config.xml --only-system-tables -q 'select * from system.trace_log format TSVWithNamesAndTypes'
+ zstd --threads=0
Logging trace to /var/log/clickhouse-server/clickhouse-server.log
Logging errors to /var/log/clickhouse-server/clickhouse-server.err.log
+ for table in query_log trace_log metric_log
+ clickhouse-local --config-file=/etc/clickhouse-server/config.xml --only-system-tables -q 'select * from system.metric_log format TSVWithNamesAndTypes'
+ zstd --threads=0
Logging trace to /var/log/clickhouse-server/clickhouse-server.log
Logging errors to /var/log/clickhouse-server/clickhouse-server.err.log
+ mv /var/log/clickhouse-server/stderr.log /test_output/
+ clickhouse-local --structure 'test String, res String, time Nullable(Float32), desc String' -q 'SELECT '\''failure'\'', test FROM table WHERE res != '\''OK'\'' order by
(test like '\''%Sanitizer%'\'') DESC,
(test like '\''%Killed by signal%'\'') DESC,
(test like '\''%gdb.log%'\'') DESC,
(test ilike '\''%possible deadlock%'\'') DESC,
(test like '\''%start%'\'') DESC,
(test like '\''%dmesg%'\'') DESC,
(test like '\''%OOM%'\'') DESC,
(test like '\''%Signal 9%'\'') DESC,
(test like '\''%Fatal message%'\'') DESC,
rowNumberInAllBlocks()
LIMIT 1'
+ '[' -s /test_output/check_status.tsv ']'
+ echo -e 'success\tNo errors found'
+ rg 'OOM in dmesg|Signal 9' /test_output/check_status.tsv
+ collect_core_dumps
+ find . -type f -maxdepth 1 -name 'core.*'
+ read -r core